{"text_format":"1","workbook":"xlsx","n_sheets":6,"sheets":["Hoja4","Hoja3","Hoja1","REPARTO","PLAN","Hoja5"],"not_rendered":{"charts":1,"images":1,"macros":0,"external_links":1,"defined_names":3,"comments":0,"pivot_tables":5},"unopened":[],"bounds":{"document_bytes":16777216,"sheet_cells":100000,"rows_first":2000,"rows_last":500,"rows_between":2000,"halvings":0,"cell_chars":16384,"cell_head_chars":4096},"cells_cut":0,"cells_raw":0,"read":"whole","date_system":"1900"}

{"sheet":"Hoja4","index":0,"n_rows":25,"n_cols":3,"rows_kept":25,"cut":false,"hidden":true,"merged":[]}
["CLASIFICACIÓN DE LA INFORMACIÓN","(Varios elementos)"]
[]
[]
[]
[]
[]
[]
[]
[]
[]
[]
[]
[]
[]
[]
[]
["OTI",50,0.37313432835820898]
["SECRETARIA GENERAL Y JURIDICA",43,0.32089552238805968]
["FINANCIERA Y ADMON",25,0.18656716417910449]
["ESTRATEGIA",4,2.9850746268656716E-2]
["NEGOCIOS",4,2.9850746268656716E-2]
["TÉCNICA",4,2.9850746268656716E-2]
["OPERACIONES",3,2.2388059701492536E-2]
["RIESGOS",1,7.462686567164179E-3]
["TOTAL GENERAL",134,1]

{"sheet":"Hoja3","index":1,"n_rows":17,"n_cols":12,"rows_kept":17,"cut":false,"hidden":true,"merged":[]}
[null,null,null,null,null,null,null,null,"DEPENDENCIA","Planeado","Contratado","%"]
["DEPENDENCIA","VALOR","PRESUPUESTO CONTRATADO","%",null,null,null,null,"ESTRATEGIA",1172306306,1172306306,{"$f":"K2/J2","v":1}]
["OFICINA DE ESTRATEGIA Y DESARROLLO",694295625,null,null,null,null,null,null,"FINANCIERA Y ADMON",8752267945,5335356771,{"$f":"K3/J3","v":0.60959705581774215}]
["VICEPRESIDENCIA FINANCIERA Y ADMINISTRATIVA",8752267945,3088070598,{"$f":"C4/B4","v":0.35283090250500782},null,null,null,null,"NEGOCIOS",13360033182.975,12691995310,{"$f":"K4/J4","v":0.94999728939099515}]
["VICEPRESIDENCIA DE NEGOCIOS",7381429080.000001,12227414358,{"$f":"C5/B5","v":1.656510443367966},null,null,null,null,"OPERACIONES",38366883401,31119191770,{"$f":"K5/J5","v":0.81109511671174483}]
["VICEPRESIDENCIA DE OPERACIONES",38366883401,31119191770,0.81109511671174483,null,null,null,null,"OTI",16326122400.077499,9124308413,{"$f":"K6/J6","v":0.55887786391682859}]
["OFICINA DE TECNOLOGIAS DE LA INFORMACIÓN",16326122400.077499,201210990,1.2324481286447102E-2,null,null,null,null,"PYP",120411187909,99075259486,0.82280775737280742]
["VICEPRESIDENCIA DE PROMOCIÓN Y PREVENCIÓN",120411187909,81402850713,0.67604059163106744,null,null,null,null,"RIESGOS",68348301,68348301,1]
["OFICINA DE GESTIÓN INTEGRAL DE RIESGOS",68348301,null,0,null,null,null,null,"SECRETARIA GENERAL Y JURIDICA",5599124509.9749994,4399646576,0.78577402023511078]
["SECRETARIA GENERAL Y JURIDICA",6077135190.9749994,7043728834,1.1590541616484795,null,null,null,null,"TÉCNICA",1132517831,1125458561,0.99376674714801905]
["VICEPRESIDENCIA TÉCNICA",1132517831,725588815,0.64068643789856583,null,null,null,null,"Total general",{"$f":"SUM(J2:J10)","v":205188791786.0275},{"$f":"SUM(K2:K10)","v":164111871494},0.79980914193957131]
["PRESUPUESTOS COMPARTIDOS"]
["VP NEGOCIOS Y VP FINANCIERA Y ADMON",269479593]
["VP NEGOCIOS Y SECRETARIA GENERAL",110000000]
["VP NEGOCIOS, SECRETARIA GENERAL y VP PYP",6589650515]
["OFICINA DE ESTRATEGIA, G. TALENTO HUMANO y OFICINA DE RIESGOS",97086437]
["TOTAL PLAN ",206276404228.05252,135808056078]

{"sheet":"Hoja1","index":2,"n_rows":49,"n_cols":8,"rows_kept":49,"cut":false,"hidden":true,"merged":[]}
[]
[]
[null,"Datos",null,null,"VICEPRESIDENCIA/SECTREATARÍA GENERAL","CANTIDAD PREVISTA DE CONTRATOS","VALOR PLANEADO A CONTRATAR","% del valor estimado"]
["VICEPRESIDENCIA/SECTREATARÍA GENERAL","CANTIDAD PREVISTA DE CONTRATOS","VALOR PLANEADO A CONTRATAR",null,"Financiera y Administrativa",39,9198008297,{"$f":"G4/$G$10","v":4.6140842804290406E-2}]
["NEGOCIOS",26,10913533198,null,"Negocios",23,8440161697,4.2339184911486492E-2]
["Operaciones",11,16055336512,null,"Operaciones",14,30469448195,0.15284678748958133]
["SECRETARIA GENERAL Y JURÍDICA",77,26131635084.554203,null,"Promoción y Prevención",270,119824776984,0.60108841179031813]
["PyP",311,139682224243,null,"Secretaria General y Jurídica",128,29798454282.709999,0.14948081698488994]
["Total general",425,192782729037.5542,null,"Técnica",438,1615494000,8.1039560194337071E-3]
[null,null,null,null,"Total general",912,199346343455.70999]
[]
[]
[]
[]
[]
["CANTIDAD PREVISTA DE CONTRATOS"]
["MES","Total"]
["ENERO",320]
["FEBRERO",6]
["MARZO",1]
["ABRIL",1]
["JUNIO",9]
["JULIO",24]
["AGOSTO",6]
["SEPTIEMBRE",8]
["OCTUBRE",9]
["NOVIEMBRE",11]
["DICIEMBRE",30]
["Total general",425]
[]
[]
[]
[]
[]
[]
["MES","Total"]
["ENERO",254]
["FEBRERO",104]
["MARZO",89]
["ABRIL",83]
["MAYO",62]
["JUNIO",59]
["JULIO",58]
["AGOSTO",46]
["SEPTIEMBRE",34]
["OCTUBRE",41]
["NOVIEMBRE",55]
["DICIEMBRE",27]
["Total general",912]

{"sheet":"REPARTO","index":3,"n_rows":21,"n_cols":9,"rows_kept":21,"cut":false,"hidden":true,"merged":[]}
["¿YA SE CONTRATÓ?","(Todas)"]
["Modalidad de selección ","(Todas)"]
[null,null,null,null,null,null,250000,null,120000]
["Etiquetas de fila",null,null,null,null,null,{"$f":"G3/20","v":12500}]
["NEGOCIOS"]
["Riesgos laborales"]
["Mercadeo y Comunicaciones"]
["Canales"]
["Experiencia del cliente"]
["Vida"]
["Operaciones"]
["Gcia. Afiliaciones y Novedades"]
["Gcia. Recaudo y Cartera"]
["Vicepresidencia de operaciones"]
["SECRETARIA GENERAL Y JURÍDICA"]
["GERENCIA JURÍDICA"]
["Oficina de Tecnologías de la Información"]
["Oficina Gestión Integral de Riesgos "]
["PyP"]
["Gerencia de administración del riesgo"]
["Total general"]

{"sheet":"PLAN","index":4,"n_rows":777,"n_cols":26,"rows_kept":777,"cut":false,"hidden":false,"merged":[[4,10,8,13],[10,10,14,13],[16,4,19,4],[16,5,19,5]]}
[]
[null,null,null,null,"PLAN ANUAL DE ADQUISICIONES"]
[]
[null,null,null,null,"A. INFORMACIÓN GENERAL DE LA ENTIDAD"]
[null,null,null,null,"Nombre","POSITIVA COMPAÑÍA DE SEGUROS S.A.",null,null,null,null,"El principal objetivo del Plan Anual de Adquisiciones es permitir que la entidad estatal aumente la probabilidad de lograr mejores condiciones de competencia a través de la participación de un mayor número de operadores económicos interesados en los procesos de selección que se van a adelantar durante el año fiscal, y que el Estado cuente con información suficiente para realizar compras coordinadas. "]
[null,null,null,null,"Dirección","Avenida Carrera 45 No. 94-72"]
[null,null,null,null,"Teléfono","PBX:(57-1)6502200"]
[null,null,null,null,"Página web","www.positiva.gov.co"]
[null,null,null,null,"Misión y visión","MISION: Protegemos Integralmente la vida de las personas contribuyendo al bienestar de las familias, las empresas y la sociedad\nVISION: Ser la aseguradora que garantiza oportunamente la máxima protección a nuestros clientes"]
[null,null,null,null,"Perspectiva estratégica","POSITIVA COMPAÑÍA DE SEGUROS S.A., diseña e implementa un modelo de negocio de Responsabilidad Global que contribuya con la rentabilidad y el desarrollo sostenible de la empresa y que coadyude con el logro de sus objetivos específicos."]
[null,null,null,null,"Información de contacto","Gerencia de Abastecimiento Estratégico\ncontratacion@positiva.gov.co\nPBX: (1)6502200 Ext: 10641",null,null,null,null,"El Plan Anual de Adquisiciones es un documento de naturaleza informativa y las adquisiciones incluidas en el mismo pueden ser canceladas, revisadas o modificadas. Esta información no representa compromiso u obligación alguna por parte de la entidad estatal ni la compromete a adquirir los bienes, obras y servicios en él señalados. "]
[null,null,null,null,"Valor total del PAA",{"$f":"SUM(M:M)","v":244193773134.6875}]
[null,null,null,null,"Límite de contratación menor cuantía","Régimen Especial de Contratación",null,null,null,null,null,null,null,null,null,null,null,null,null,null,null,null,null,null,null,"SI"]
[null,null,null,null,"Límite de contratación mínima cuantía","Régimen Especial de Contratación",null,null,null,null,null,null,null,null,null,null,null,null,null,null,null,null,null,null,null,"NO"]
[null,null,null,null,"Fecha de última actualización del PAA","2022-09-21"]
[]
[null,null,null,null,"NOTA","Acorde con el Decreto 2973 de 2013 en relación con el régimen de las reservas técnicas de las entidades aseguradoras y se dictan otras disposiciones, los contratos para la atención del siniestro se pagan con los recursos destinados a la reserva técnica.\nEste tipo de contratos son de cuantía indeterminada y aunque es determinable, al momento de la planeación únicamente se refleja el valor asociado al control presupuestal. "]
[]
[]
[]
[null,null,null,null,"B. ADQUISICIONES PLANEADAS"]
["VICEPRESIDENCIA/SECTREATARÍA GENERAL","ÁREA","¿YA SE CONTRATÓ?","ORDEN","Códigos UNSPSC","Descripción","Fecha estimada de inicio de proceso de selección","MES","Fecha fin contrato","Duración estimada del contrato (Meses)","Modalidad de selección ","Fuente de los recursos","Valor total estimado","Valor estimado en la vigencia actual","¿Se requieren vigencias futuras?","Estado de solicitud de vigencias futuras","Datos de contacto del responsable","¿Su necesidad contiene información financiera y secretos comerciales?\nEjm: Tarifas comerciales, disminución de la siniestralidad, atención o servicio conexo al siniestro, know how del negocio, clasificación de empresas, estrategias comerciales.","¿Su necesidad y el proceso de contratación son catalogados como misionales?\nEjm: Gestión comercial, Gestión de clientes, Atención al siniestro, Estrategias de disminución de la siniestralidad, Gestión integral del portafolio, Gestión de reservas y reaseguros.","En caso de ser una necesidad tecnologica ¿Su necesidad contiene información sensible?\nEjm: Administración de bases de datos de clientes, información comercial de la Compañía, información relevante al know how del negocio. ","¿De publicarse esta información referente al proceso de contratación podrían vulnerarse los intereses de Positiva con relación a su competencia al revelar información misional?","CLASIFICACIÓN DE LA INFORMACIÓN","DESCRIPCIÓN AJUSTADA"]
["SECRETARIA GENERAL Y JURÍDICA","GERENCIA JURÍDICA","SI","C23132022","80111607","Prestar servicios profesionales de asesoría en la rama del derecho penal, a través de la generación de conceptos jurídicos relacionados con eventuales hechos que pueden derivar de actos contrarios al Ordenamiento Penal Colombiano, así como la elaboración, presentación y seguimiento de denuncias penales por hechos que constituyan delitos en contra de los intereses de Positiva Compañía de Seguros S.A., asesoría y representación judicial en calidad de apoderado dentro de las investigaciones penales. ","2021-12-01",{"$f":"MONTH(G23)","v":12},"2021-01-05",12,"Invitación directa","GastosAdministrativos",138000000,138000000,"NO","N/A","Gerencia de Abastecimiento Estratégico\ncontratacion@positiva.gov.co\nPBX: (1)6502200 Ext: 10641","NO","NO","NO","NO",{"$f":"IF(U23=\"SI\",\"Pública clasificada\",\"Pública\")","v":"Pública"},{"$f":"CONCATENATE(D23,\"-\",\"Tipo de información\",\" \",V23,\"-\",F23)","v":"C23132022-Tipo de información Pública-Prestar servicios profesionales de asesoría en la rama del derecho penal, a través de la generación de conceptos jurídicos relacionados con eventuales hechos que pueden derivar de actos contrarios al Ordenamiento Penal Colombiano, así como la elaboración, presentación y seguimiento de denuncias penales por hechos que constituyan delitos en contra de los intereses de Positiva Compañía de Seguros S.A., asesoría y representación judicial en calidad de apoderado dentro de las investigaciones penales. "}]
["SECRETARIA GENERAL Y JURÍDICA","GERENCIA JURÍDICA","SI","C23142021","80111607","Prestación de servicios profesionales como abogado especializado en derecho comercial, brindando atención en los diferentes procesos concursales de restructuración y reorganización empresarial, liquidación obligatoria y liquidación judicial conforme a las disposiciones establecidas en las leyes 550 de 1999 y 1116 de 2006 y, atendiendo a nivel nacional los procesos de liquidación forzosa, administrativa, liquidación de empresas afiliadas a Riegos Laborales y liquidación de entidades financieras, entre otros, en aras de cumplir con la debida defensa de los intereses de Positiva Compañía de Seguros S.A.","2021-12-01",12,"2022-01-03",12,"Invitación directa","GastosAdministrativos",187200000,187200000,"NO","N/A","Gerencia de Abastecimiento Estratégico\ncontratacion@positiva.gov.co\nPBX: (1)6502200 Ext: 10641","NO","NO","NO","NO","Pública","C23142021-Tipo de información Pública-Prestación de servicios profesionales como abogado especializado en derecho comercial, brindando atención en los diferentes procesos concursales de restructuración y reorganización empresarial, liquidación obligatoria y liquidación judicial conforme a las disposiciones establecidas en las leyes 550 de 1999 y 1116 de 2006 y, atendiendo a nivel nacional los procesos de liquidación forzosa, administrativa, liquidación de empresas afiliadas a Riegos Laborales y liquidación de entidades financieras, entre otros, en aras de cumplir con la debida defensa de los intereses de Positiva Compañía de Seguros S.A."]
["SECRETARIA GENERAL Y JURÍDICA","GERENCIA JURÍDICA","SI","C23152022 ","80111607","Prestar servicios profesionales de una firma de Abogados especializados en derecho comercial, de seguros y seguridad social, para que asesore y represente judicialmente  a la Compañía en los procesos en que sea parte activa o pasiva, para que atienda audiencias de conciliación judicial, prejudicial y extrajudicial  en los procesos en que sea parte la entidad, igualmente para rendir conceptos jurídicos en las áreas mencionadas y capacitar al personal de la Compañía cuando se le solicite.","2021-12-01",12,"2022-01-03",12,"Invitación directa","GastosAdministrativos",220000000,220000000,"NO","N/A","Gerencia de Abastecimiento Estratégico\ncontratacion@positiva.gov.co\nPBX: (1)6502200 Ext: 10641","NO","NO","NO","NO","Pública","C23152022 -Tipo de información Pública-Prestar servicios profesionales de una firma de Abogados especializados en derecho comercial, de seguros y seguridad social, para que asesore y represente judicialmente  a la Compañía en los procesos en que sea parte activa o pasiva, para que atienda audiencias de conciliación judicial, prejudicial y extrajudicial  en los procesos en que sea parte la entidad, igualmente para rendir conceptos jurídicos en las áreas mencionadas y capacitar al personal de la Compañía cuando se le solicite."]
["SECRETARIA GENERAL Y JURÍDICA","GERENCIA JURÍDICA","SI","C23162022","80111607","Prestación de servicios profesionales especializados en derecho corporativo, lo cual incluye: derecho de la propiedad industrial y derecho marcario, protección de datos personales (habeas data y financiero), derechos de autor, secreto empresarial, seguridad de la información y Transparencia y Derecho de Acceso; El asesor podrá además ser encargado de la atención de audiencias de conciliación; gestiones en reclamaciones administrativas ante el Ministerio del Trabajo y otros entes administrativos; y trámites de registro ante organismos como las cámaras de comercio, la Superintendencia de Industria y Comercio, y todos aquellos que resulten necesarios para el cabal desarrollo de las actividades asignadas en cumplimiento del objeto contractual.","2021-12-01",12,"2022-01-03",12,"Invitación directa","GastosAdministrativos",138000000,138000000,"NO","N/A","Gerencia de Abastecimiento Estratégico\ncontratacion@positiva.gov.co\nPBX: (1)6502200 Ext: 10641","NO","NO","NO","NO","Pública","C23162022-Tipo de información Pública-Prestación de servicios profesionales especializados en derecho corporativo, lo cual incluye: derecho de la propiedad industrial y derecho marcario, protección de datos personales (habeas data y financiero), derechos de autor, secreto empresarial, seguridad de la información y Transparencia y Derecho de Acceso; El asesor podrá además ser encargado de la atención de audiencias de conciliación; gestiones en reclamaciones administrativas ante el Ministerio del Trabajo y otros entes administrativos; y trámites de registro ante organismos como las cámaras de comercio, la Superintendencia de Industria y Comercio, y todos aquellos que resulten necesarios para el cabal desarrollo de las actividades asignadas en cumplimiento del objeto contractual."]
["SECRETARIA GENERAL Y JURÍDICA","GERENCIA JURÍDICA","SI","C23192022","80111607","Prestar servicios profesionales en Derecho Público, Derecho Tributario, Derecho Civil y Derecho Comercial, para la representación judicial, audiencias de conciliación judicial y extrajudicial en los procesos en que sea parte la entidad, elaboración de conceptos y acompañamiento en todos los procesos en los que interviene la Gerencia Jurídica, adelantar trámites ante entidades administrativas y de inspección, vigilancia y control, en especial ante la Procuraduría General de la Nación y estructurar y dictar capacitaciones en temas jurídicos  específicos, requeridos por Positiva Compañía de Seguros S.A","2021-12-01",12,"2022-01-03",12,"Invitación directa","GastosAdministrativos",80400000,80400000,"NO","N/A","Gerencia de Abastecimiento Estratégico\ncontratacion@positiva.gov.co\nPBX: (1)6502200 Ext: 10641","NO","NO","NO","NO","Pública","C23192022-Tipo de información Pública-Prestar servicios profesionales en Derecho Público, Derecho Tributario, Derecho Civil y Derecho Comercial, para la representación judicial, audiencias de conciliación judicial y extrajudicial en los procesos en que sea parte la entidad, elaboración de conceptos y acompañamiento en todos los procesos en los que interviene la Gerencia Jurídica, adelantar trámites ante entidades administrativas y de inspección, vigilancia y control, en especial ante la Procuraduría General de la Nación y estructurar y dictar capacitaciones en temas jurídicos  específicos, requeridos por Positiva Compañía de Seguros S.A"]
["SECRETARIA GENERAL Y JURÍDICA","GERENCIA JURÍDICA","SI","C23172022","80111607","Prestar servicios profesionales especializados en derecho corporativo, derecho de la propiedad industrial y derecho marcario; con el propósito de ejercer el mandato judicial en defensa de los intereses de Positiva Compañía de Seguros S.A, en la demanda interpuesta ante la Superintendencia de Industria y Comercio, por La Positiva Seguros y Reaseguros (PERU), con radicado 19-084346.","2021-12-01",12,"2019-08-30","INDETERMINADO","Invitación directa","GastosAdministrativos",117852000,117852000,"NO","N/A","Gerencia de Abastecimiento Estratégico\ncontratacion@positiva.gov.co\nPBX: (1)6502200 Ext: 10641","NO","NO","NO","NO","Pública","C23172022-Tipo de información Pública-Prestar servicios profesionales especializados en derecho corporativo, derecho de la propiedad industrial y derecho marcario; con el propósito de ejercer el mandato judicial en defensa de los intereses de Positiva Compañía de Seguros S.A, en la demanda interpuesta ante la Superintendencia de Industria y Comercio, por La Positiva Seguros y Reaseguros (PERU), con radicado 19-084346."]
["SECRETARIA GENERAL Y JURÍDICA","GERENCIA JURÍDICA","SI","C23222022","80111607","Prestar servicios profesionales en derecho de Publico y Constitucional, para formular estrategias, modelo y Plan de Mejora, tendientes a la disminución de acciones de tutelas y procesos judiciales en contra de la compañía, efectuando una revisión de las tutelas y procesos judiciales con el fin de identificar las causas raíces (tipologías) generadoras de las demandas y mitigar el riesgo de la entidad en términos de fallos judiciales.  ","2021-12-01",12,"2022-01-03",12,"Invitación directa","GastosAdministrativos",228000000,228000000,"NO","N/A","Gerencia de Abastecimiento Estratégico\ncontratacion@positiva.gov.co\nPBX: (1)6502200 Ext: 10641","NO","NO","NO","NO","Pública","C23222022-Tipo de información Pública-Prestar servicios profesionales en derecho de Publico y Constitucional, para formular estrategias, modelo y Plan de Mejora, tendientes a la disminución de acciones de tutelas y procesos judiciales en contra de la compañía, efectuando una revisión de las tutelas y procesos judiciales con el fin de identificar las causas raíces (tipologías) generadoras de las demandas y mitigar el riesgo de la entidad en términos de fallos judiciales.  "]
["SECRETARIA GENERAL Y JURÍDICA","GERENCIA JURÍDICA","SI","C23202022","80111607","Prestar de servicios de profesionales para apoyar y soportar asuntos de Derecho Financiero","2021-12-01",12,"2022-01-03",12,"Invitación directa","GastosAdministrativos",43800000,43800000,"NO","N/A","Gerencia de Abastecimiento Estratégico\ncontratacion@positiva.gov.co\nPBX: (1)6502200 Ext: 10641","NO","NO","NO","NO","Pública","C23202022-Tipo de información Pública-Prestar de servicios de profesionales para apoyar y soportar asuntos de Derecho Financiero"]
["SECRETARIA GENERAL Y JURÍDICA","GERENCIA JURÍDICA","SI","C23242022","80111607","Prestar de servicios de profesionales para apoyar y soportar asuntos de contratación estatal, derecho económico, derecho administrativo, derecho contractual y hacienda pública.","2021-12-01",12,"2022-01-03",12,"Invitación directa","GastosAdministrativos",50000000,50000000,"NO","N/A","Gerencia de Abastecimiento Estratégico\ncontratacion@positiva.gov.co\nPBX: (1)6502200 Ext: 10641","NO","NO","NO","NO","Pública","C23242022-Tipo de información Pública-Prestar de servicios de profesionales para apoyar y soportar asuntos de contratación estatal, derecho económico, derecho administrativo, derecho contractual y hacienda pública."]
["SECRETARIA GENERAL Y JURÍDICA","GERENCIA JURÍDICA","NO","C23262022","80111607","EL CONTRATISTA, se compromete con POSITIVA COMPAÑÍA DE SEGUROS S.A., a la prestación de servicios profesionales en materia penal especializada, representación judicial y defensa de los intereses económicos de POSITIVA COMPAÑÍA DE SEGUROS SA, dentro de los procesos judiciales relacionados con la apropiación de recursos de la extinta Junta Regional de Calificación de Invalidez del Cesar y contra todas las personas que resulten involucradas.","2021-12-01",12,"2021-04-28","INDETERMINADO","Invitación directa","GastosAdministrativos",33320000,33320000,"NO","N/A","Gerencia de Abastecimiento Estratégico\ncontratacion@positiva.gov.co\nPBX: (1)6502200 Ext: 10641","NO","NO","NO","NO","Pública","C23262022-Tipo de información Pública-EL CONTRATISTA, se compromete con POSITIVA COMPAÑÍA DE SEGUROS S.A., a la prestación de servicios profesionales en materia penal especializada, representación judicial y defensa de los intereses económicos de POSITIVA COMPAÑÍA DE SEGUROS SA, dentro de los procesos judiciales relacionados con la apropiación de recursos de la extinta Junta Regional de Calificación de Invalidez del Cesar y contra todas las personas que resulten involucradas."]
["SECRETARIA GENERAL Y JURÍDICA","GERENCIA JURÍDICA","NO","C23272022","80111607","EL CONTRATISTA prestará a favor de POSITIVA sus servicios profesionales para Representar Judicial y extrajudicialmente los intereses de la Compañía en los dos litigios iniciados por el proveedor Belisario Velásquez & Asociados en contra de la Compañía","2021-12-01",12,"2021-06-21","INDETERMINADO","Invitación directa","GastosAdministrativos",131000000,131000000,"NO","N/A","Gerencia de Abastecimiento Estratégico\ncontratacion@positiva.gov.co\nPBX: (1)6502200 Ext: 10641","NO","NO","NO","NO","Pública","C23272022-Tipo de información Pública-EL CONTRATISTA prestará a favor de POSITIVA sus servicios profesionales para Representar Judicial y extrajudicialmente los intereses de la Compañía en los dos litigios iniciados por el proveedor Belisario Velásquez & Asociados en contra de la Compañía"]
["SECRETARIA GENERAL Y JURÍDICA","GERENCIA JURÍDICA","SI","C23182022","80111607","EL CONTRATISTA, se compromete con POSITIVA COMPAÑÍA DE SEGUROS S.A., a la Prestación de servicios profesionales para el acompañamiento jurídico, preparación de la estrategia y representación judicial y extrajudicial de los intereses de POSITIVA en la formulación de acciones administrativas y judiciales necesarias para evitar un daño antijurídico por cuenta de la invitación pública No. 003 de 2020- FOMAG.","2021-12-01",12,"2021-09-10","INDETERMINADO","Invitación directa","GastosAdministrativos",83800000,83800000,"NO","N/A","Gerencia de Abastecimiento Estratégico\ncontratacion@positiva.gov.co\nPBX: (1)6502200 Ext: 10641","NO","NO","NO","NO","Pública","C23182022-Tipo de información Pública-EL CONTRATISTA, se compromete con POSITIVA COMPAÑÍA DE SEGUROS S.A., a la Prestación de servicios profesionales para el acompañamiento jurídico, preparación de la estrategia y representación judicial y extrajudicial de los intereses de POSITIVA en la formulación de acciones administrativas y judiciales necesarias para evitar un daño antijurídico por cuenta de la invitación pública No. 003 de 2020- FOMAG."]
["SECRETARIA GENERAL Y JURÍDICA","GERENCIA JURÍDICA","SI",null,"80111607","El CONTRATISTA, se compromete con POSITIVA COMPAÑÍA DE SEGUROS S.A., a la prestación de servicios profesionales de abogado para representar los intereses de la Compañía en los procesos judiciales asignados, así como las audiencias de conciliación judicial, prejudicial, en los procesos en que sea parte la Entidad en calidad de demandante o demandado, en las Sucursales de Arauca, Casanare, Santander y Norte de Santander. Igualmente para rendir conceptos jurídicos en las áreas especializadas a contratar y prestar la asesoría jurídica que se le solicite.","2021-12-01",12,"2022-01-11",12,"Invitación directa","SINIESTRO",270000000,270000000,"NO","N/A","Gerencia de Abastecimiento Estratégico\ncontratacion@positiva.gov.co\nPBX: (1)6502200 Ext: 10641","NO","NO","NO","NO","Pública","-Tipo de información Pública-El CONTRATISTA, se compromete con POSITIVA COMPAÑÍA DE SEGUROS S.A., a la prestación de servicios profesionales de abogado para representar los intereses de la Compañía en los procesos judiciales asignados, así como las audiencias de conciliación judicial, prejudicial, en los procesos en que sea parte la Entidad en calidad de demandante o demandado, en las Sucursales de Arauca, Casanare, Santander y Norte de Santander. Igualmente para rendir conceptos jurídicos en las áreas especializadas a contratar y prestar la asesoría jurídica que se le solicite."]
["SECRETARIA GENERAL Y JURÍDICA","GERENCIA JURÍDICA","SI",null,"80111607","EL Adjudicatario se compromete a la prestación de servicios profesionales para brindar asesoría en la elaboración y prestación de conceptos jurídicos con ocasión de hechos relevantes para la entidad que merezcan un análisis desde el punto de vista del drecho penal, asimismo la representación júridico penal de POSITIVA COMPAÑÍA DE SEGUROS S.A., dentro de las investigaciones penales que se inicien para poner en conocimiento de las autoridades competentes presuntas conductas delictivas perpretadas en su contra","2021-12-01",12,"2019-01-25","INDETERMINADO","Invitación directa","SINIESTRO",50000000,50000000,"NO","N/A","Gerencia de Abastecimiento Estratégico\ncontratacion@positiva.gov.co\nPBX: (1)6502200 Ext: 10641","NO","NO","NO","NO","Pública","-Tipo de información Pública-EL Adjudicatario se compromete a la prestación de servicios profesionales para brindar asesoría en la elaboración y prestación de conceptos jurídicos con ocasión de hechos relevantes para la entidad que merezcan un análisis desde el punto de vista del drecho penal, asimismo la representación júridico penal de POSITIVA COMPAÑÍA DE SEGUROS S.A., dentro de las investigaciones penales que se inicien para poner en conocimiento de las autoridades competentes presuntas conductas delictivas perpretadas en su contra"]
["SECRETARIA GENERAL Y JURÍDICA","GERENCIA JURÍDICA","SI",null,"80111607","Prestar servicios profesionales de firma de Abogados Especializados en el área de Derecho Laboral con experiencia en el manejo de las Altas Cortes y en especial La Corte Suprema de Justicia, con el propósito de ejercer el mandato judicial en defensa de los intereses de Positiva Compañía de Seguros S.A, ante las autoridades judiciales, administrativas y/o ante particulares con funciones judiciales, a nivel de la etapa de casación.","2021-12-01",12,"2022-01-11",12,"Invitación directa","SINIESTRO",295000000,295000000,"NO","N/A","Gerencia de Abastecimiento Estratégico\ncontratacion@positiva.gov.co\nPBX: (1)6502200 Ext: 10641","NO","NO","NO","NO","Pública","-Tipo de información Pública-Prestar servicios profesionales de firma de Abogados Especializados en el área de Derecho Laboral con experiencia en el manejo de las Altas Cortes y en especial La Corte Suprema de Justicia, con el propósito de ejercer el mandato judicial en defensa de los intereses de Positiva Compañía de Seguros S.A, ante las autoridades judiciales, administrativas y/o ante particulares con funciones judiciales, a nivel de la etapa de casación."]
["SECRETARIA GENERAL Y JURÍDICA","GERENCIA JURÍDICA","SI",null,"80111607","Prestar servicios profesionales de recobro vía judicial, de las prestaciones económicas y asistenciales derivadas de Enfermedad Laboral, contra las ARL que hubieren asumido ese riesgo con anterioridad,  a prorrata del tiempo durante el cual se otorgó dicha prestación","2021-12-01",12,"2022-01-11",12,"Invitación directa","SINIESTRO","INDETERMINADO","INDETERMINADO","NO","N/A","Gerencia de Abastecimiento Estratégico\ncontratacion@positiva.gov.co\nPBX: (1)6502200 Ext: 10641","NO","NO","NO","NO","Pública","-Tipo de información Pública-Prestar servicios profesionales de recobro vía judicial, de las prestaciones económicas y asistenciales derivadas de Enfermedad Laboral, contra las ARL que hubieren asumido ese riesgo con anterioridad,  a prorrata del tiempo durante el cual se otorgó dicha prestación"]
["SECRETARIA GENERAL Y JURÍDICA","GERENCIA JURÍDICA","NO",null,"80111607","Prestar servicios profesionales especializados en seguros y seguridad social, para la atención y representación de la Compañía en procesos judiciales en los cuales sea demandante o demandada, procesos de nulidades relativas y demás acciones que se deriven del contrato de seguros, demandas contra dictámenes de las Juntas de calificación de Invalidez, demandas por responsabilidad civil y acompañamiento mediante la emisión de conceptos jurídicos en los mismos temas.","2021-12-01",12,"2022-01-11",12,"Invitación directa","SINIESTRO",120000000,120000000,"NO","N/A","Gerencia de Abastecimiento Estratégico\ncontratacion@positiva.gov.co\nPBX: (1)6502200 Ext: 10641","NO","NO","NO","NO","Pública","-Tipo de información Pública-Prestar servicios profesionales especializados en seguros y seguridad social, para la atención y representación de la Compañía en procesos judiciales en los cuales sea demandante o demandada, procesos de nulidades relativas y demás acciones que se deriven del contrato de seguros, demandas contra dictámenes de las Juntas de calificación de Invalidez, demandas por responsabilidad civil y acompañamiento mediante la emisión de conceptos jurídicos en los mismos temas."]
["SECRETARIA GENERAL Y JURÍDICA","GERENCIA JURÍDICA","NO ",null,"80111607","Prestar servicios profesionales de abogado especializado en derecho laboral y seguridad social o de seguros, para defender los intereses de Positiva en los procesos judiciales asignados, así como las audiencias de conciliación judicial, prejudicial y extrajudicial en los procesos en que sea parte la Entidad, en las: Sucursales de ATLÁNTICO, BOLIVAR, MAGDALENA CESAR Y GUAJIRA, CÓRDOBA, SUCRE, ANTIOQUIA Y CHOCO.  Igualmente para rendir conceptos jurídicos en las áreas especializadas a contratar y prestar la asesoría jurídica que se le solicite.","2021-12-01",12,"2022-01-11",12,"Invitación directa","SINIESTRO",520000000,520000000,"NO","N/A","Gerencia de Abastecimiento Estratégico\ncontratacion@positiva.gov.co\nPBX: (1)6502200 Ext: 10641","NO","NO","NO","NO","Pública","-Tipo de información Pública-Prestar servicios profesionales de abogado especializado en derecho laboral y seguridad social o de seguros, para defender los intereses de Positiva en los procesos judiciales asignados, así como las audiencias de conciliación judicial, prejudicial y extrajudicial en los procesos en que sea parte la Entidad, en las: Sucursales de ATLÁNTICO, BOLIVAR, MAGDALENA CESAR Y GUAJIRA, CÓRDOBA, SUCRE, ANTIOQUIA Y CHOCO.  Igualmente para rendir conceptos jurídicos en las áreas especializadas a contratar y prestar la asesoría jurídica que se le solicite."]
["SECRETARIA GENERAL Y JURÍDICA","GERENCIA JURÍDICA","NO",null,"80111607","Prestar servicios profesionales de abogado especializado en derecho laboral y seguridad social o de seguros, para defender los intereses de Positiva en los procesos judiciales asignados, así como las audiencias de conciliación judicial, prejudicial y extrajudicial en los procesos en que sea parte la Entidad, en la Regional Occidente: Sucursales de CALDAS, RISARALDA, VALLE, NARIÑO, CAUCA, QUINDIO, ANTIOQUIA  Y CHOCÓ   Igualmente para rendir conceptos jurídicos en las áreas especializadas a contratar y prestar la asesoría jurídica que se le solicite.","2021-12-01",12,"2022-01-11",12,"Invitación directa","SINIESTRO",490000000,490000000,"NO","N/A","Gerencia de Abastecimiento Estratégico\ncontratacion@positiva.gov.co\nPBX: (1)6502200 Ext: 10641","NO","NO","NO","NO","Pública","-Tipo de información Pública-Prestar servicios profesionales de abogado especializado en derecho laboral y seguridad social o de seguros, para defender los intereses de Positiva en los procesos judiciales asignados, así como las audiencias de conciliación judicial, prejudicial y extrajudicial en los procesos en que sea parte la Entidad, en la Regional Occidente: Sucursales de CALDAS, RISARALDA, VALLE, NARIÑO, CAUCA, QUINDIO, ANTIOQUIA  Y CHOCÓ   Igualmente para rendir conceptos jurídicos en las áreas especializadas a contratar y prestar la asesoría jurídica que se le solicite."]
["SECRETARIA GENERAL Y JURÍDICA","GERENCIA JURÍDICA","SI",null,"80111607","Prestación de servicios jurídicos profesionales de abogado para representar los intereses de la Compañía en los procesos judiciales asignado, así como las audiencias de conciliación judicial, prejudicial, en los proceso en que sea parte la Entidad en calidad de demandante o demandado, en las Sucursales de Bogotá, Cundinamarca, Boyacá y Meta.   Igualmente rendir conceptos jurídicos en las áreas especializadas a contratar y prestar la asesoría jurídica que se le solicite.  ","2021-12-01",12,"2022-01-11",12,"Invitación directa","SINIESTRO",400000000,400000000,"NO","N/A","Gerencia de Abastecimiento Estratégico\ncontratacion@positiva.gov.co\nPBX: (1)6502200 Ext: 10641","NO","NO","NO","NO","Pública","-Tipo de información Pública-Prestación de servicios jurídicos profesionales de abogado para representar los intereses de la Compañía en los procesos judiciales asignado, así como las audiencias de conciliación judicial, prejudicial, en los proceso en que sea parte la Entidad en calidad de demandante o demandado, en las Sucursales de Bogotá, Cundinamarca, Boyacá y Meta.   Igualmente rendir conceptos jurídicos en las áreas especializadas a contratar y prestar la asesoría jurídica que se le solicite.  "]
["SECRETARIA GENERAL Y JURÍDICA","GERENCIA JURÍDICA","NO ",null,"80111607","Representar a la Compañía en procesos judiciales de carácter laboral, de seguridad social, civil, comercial o administrativa, donde sea demandada o actúe como demandante por temas de riesgos laborales o por seguros de vida; en procesos de recobros por enfermedad laboral por accidente laboral, por responsabilidad civil y determinación de multiafiliaciones a las administradoras de riesgos laborales, vía extraprocesal o judicial; en Acciones Populares y en Conciliaciones administrativas o extrajudiciales.   ","2021-12-01",12,"2022-01-11",12,"Invitación directa","SINIESTRO","INDETERMINADO","INDETERMINADO","NO","N/A","Gerencia de Abastecimiento Estratégico\ncontratacion@positiva.gov.co\nPBX: (1)6502200 Ext: 10641","NO","NO","NO","NO","Pública","-Tipo de información Pública-Representar a la Compañía en procesos judiciales de carácter laboral, de seguridad social, civil, comercial o administrativa, donde sea demandada o actúe como demandante por temas de riesgos laborales o por seguros de vida; en procesos de recobros por enfermedad laboral por accidente laboral, por responsabilidad civil y determinación de multiafiliaciones a las administradoras de riesgos laborales, vía extraprocesal o judicial; en Acciones Populares y en Conciliaciones administrativas o extrajudiciales.   "]
["SECRETARIA GENERAL Y JURÍDICA","GERENCIA JURÍDICA","NO ",null,"80111607","El contratista se compromete a prestar servicios profesionales como firma de Abogados expertos en Gestión de cobro de cartera y recobros por mora en aportes, mediante el proceso de Cobro Coactivo a favor de Positiva Compañía de Seguros S.A. de las prestaciones asistenciales y/o económicas por mora en aportes y de los aportes a la seguridad social en riesgos laborales que le adeuden a la Compañía, según la asignación de procesos que efectúe la Gerencia Juridica.\n","2021-12-01",12,"2022-01-03",12,"Invitación directa","CONTRA RECAUDO","INDETERMINADO","INDETERMINADO","NO","N/A","Gerencia de Abastecimiento Estratégico\ncontratacion@positiva.gov.co\nPBX: (1)6502200 Ext: 10641","NO","NO","NO","NO","Pública","-Tipo de información Pública-El contratista se compromete a prestar servicios profesionales como firma de Abogados expertos en Gestión de cobro de cartera y recobros por mora en aportes, mediante el proceso de Cobro Coactivo a favor de Positiva Compañía de Seguros S.A. de las prestaciones asistenciales y/o económicas por mora en aportes y de los aportes a la seguridad social en riesgos laborales que le adeuden a la Compañía, según la asignación de procesos que efectúe la Gerencia Juridica.\n"]
["SECRETARIA GENERAL Y JURÍDICA","GERENCIA JURÍDICA","NO ",null,"80111607","EL CONTRATISTA, se compromete con POSITIVA COMPAÑÍA DE SEGUROS S.A., a la prestación de servicios para la investigación, análisis y diagnóstico de fraudes.","2021-12-01",12,"2022-01-15",12,"Invitación directa","SINIESTRO","INDETERMINADO","INDETERMINADO","NO","N/A","Gerencia de Abastecimiento Estratégico\ncontratacion@positiva.gov.co\nPBX: (1)6502200 Ext: 10641","NO","NO","NO","NO","Pública","-Tipo de información Pública-EL CONTRATISTA, se compromete con POSITIVA COMPAÑÍA DE SEGUROS S.A., a la prestación de servicios para la investigación, análisis y diagnóstico de fraudes."]
["SECRETARIA GENERAL Y JURÍDICA","GERENCIA JURÍDICA","SI",null,"80111607"," El contratista se compromete con Positiva Compañía de Seguros S.A. a permitir el acceso al portal de red jurista, con la generación de varios usuarios con claves individuales, con acceso interono y externo.","2021-12-01",12,"2022-01-15",12,"Invitación directa","SINIESTRO",6000000,6000000,"NO","N/A","Gerencia de Abastecimiento Estratégico\ncontratacion@positiva.gov.co\nPBX: (1)6502200 Ext: 10641","NO","NO","NO","NO","Pública","-Tipo de información Pública- El contratista se compromete con Positiva Compañía de Seguros S.A. a permitir el acceso al portal de red jurista, con la generación de varios usuarios con claves individuales, con acceso interono y externo."]
["SECRETARIA GENERAL Y JURÍDICA","GERENCIA JURÍDICA","NO",null,"80111607","Prestar servicios profesionales de firma de Abogados Especializados en el área de Derecho Laboral y Seguridad Social, con el propósito acompañar y estructurar un plan estratégico a seguir para el cierre de casos especiales sin que superen cinco (5) mensuales, más relevantes de abuso del derecho, conforme a las necesidades de Positiva Compañía de Seguros S.A., en el cual se definirán las medias a implementar y las acciones a desarrollar.","2021-12-01",12,"2021-09-20",16,"Invitación directa","SINIESTRO",60690000,60690000,"NO","N/A","Gerencia de Abastecimiento Estratégico\ncontratacion@positiva.gov.co\nPBX: (1)6502200 Ext: 10641","NO","NO","NO","NO","Pública","-Tipo de información Pública-Prestar servicios profesionales de firma de Abogados Especializados en el área de Derecho Laboral y Seguridad Social, con el propósito acompañar y estructurar un plan estratégico a seguir para el cierre de casos especiales sin que superen cinco (5) mensuales, más relevantes de abuso del derecho, conforme a las necesidades de Positiva Compañía de Seguros S.A., en el cual se definirán las medias a implementar y las acciones a desarrollar."]
["SECRETARIA GENERAL Y JURÍDICA","GERENCIA JURÍDICA","NO ",null,"80111607","Representar los intereses de la Compañía en los procesos judiciales asignados, ante la en la jurisdicción de lo contencioso administrativa, respecto de los medios de control de Nulidad Simple, Nulidad y Restablecimiento del Derecho, lesividad, reparación directa, controversias contractuales, repetición, ejecutivos administrativos, en los procesos en que sea parte la Entidad en calidad de demandante o demandado e igualmente en las demás especialidades tales como civil, laboral y seguridad social. ","2021-12-01",12,"2022-01-11",12,"Invitación directa","SINIESTRO",86000000,86000000,"NO","N/A","Gerencia de Abastecimiento Estratégico\ncontratacion@positiva.gov.co\nPBX: (1)6502200 Ext: 10641","NO","NO","NO","NO","Pública","-Tipo de información Pública-Representar los intereses de la Compañía en los procesos judiciales asignados, ante la en la jurisdicción de lo contencioso administrativa, respecto de los medios de control de Nulidad Simple, Nulidad y Restablecimiento del Derecho, lesividad, reparación directa, controversias contractuales, repetición, ejecutivos administrativos, en los procesos en que sea parte la Entidad en calidad de demandante o demandado e igualmente en las demás especialidades tales como civil, laboral y seguridad social. "]
["SECRETARIA GENERAL Y JURÍDICA","GERENCIA JURÍDICA","SI",null,"80111607","Prestar servicios profesionales como abogado especializado en derecho comercial, para atender el proceso concursal de liquidación Forzosa Administrativa de la Sociedad FERTILIZANTES COLOMBIANOS S.A. FERTICOL S.A. EN LIQUIDACIÓN, en aras de cumplir con la debida defensa de los intereses de Positiva Compañía de Seguros S.A.","2021-12-01",12,"2022-01-15","INDETERMINADO","Invitación directa","CONTRA RECAUDO","INDETERMINADO","INDETERMINADO","NO","N/A","Gerencia de Abastecimiento Estratégico\ncontratacion@positiva.gov.co\nPBX: (1)6502200 Ext: 10641","NO","NO","NO","NO","Pública","-Tipo de información Pública-Prestar servicios profesionales como abogado especializado en derecho comercial, para atender el proceso concursal de liquidación Forzosa Administrativa de la Sociedad FERTILIZANTES COLOMBIANOS S.A. FERTICOL S.A. EN LIQUIDACIÓN, en aras de cumplir con la debida defensa de los intereses de Positiva Compañía de Seguros S.A."]
["NEGOCIOS","Riesgos laborales","SI","C35022022",80141625,"Suministro de productos y/o servicios  de acuerdo con los requerimientos, cantidades y precios demandados por la compañía, para satisfacer las necesidades referentes a la entrega de incentivos a la gestión comercial","2022-01-01",1,"2022-12-31",12.133333333333333,"Invitación directa","Gasto Administrativo",50780208,50780208,"SI","APROBADA","Gerencia de Abastecimiento Estratégico\ncontratacion@positiva.gov.co\nPBX: (1)6502200 Ext: 10641","SI","SI","SI","SI","Pública clasificada","C35022022-Tipo de información Pública clasificada-Suministro de productos y/o servicios  de acuerdo con los requerimientos, cantidades y precios demandados por la compañía, para satisfacer las necesidades referentes a la entrega de incentivos a la gestión comercial"]
["NEGOCIOS","Mercadeo y Comunicaciones","NO","C35032022\nC35212022\nC35312022\nC35322022\nC35332022\nC35342022\nC35362022\nC35372022\nC35382022","82101800, 82101701, 82101801, 82101802, 82101900, 82101901, 82101902, 82101903, 82101904, 82101905, 82110000, 82111704, 82111900, 82111801, 82111901, 82111904, 80141607, 80141611, 80141612, 80141613, 80141614, 80141616, 80141618, 80141623, 80141624, 80141625, 80141626, 80141700, 80141902, 80150000, 78102205, 14111608, 86101808, 82100000, 82101600, 80141500, 80141501, 80141509,80141600"," EL CONTRATISTA, se compromete con POSITIVA COMPAÑÍA DE SEGUROS S.A., a la prestación de servicios para la Planeación e Implementación de estrategias de mercadeo y comunicaciones, las cuales se ejecutarán por medio de las diversas actividades y disciplinas del marketing, endomarketing y comunicaciones, orientadas a fortalecer la posición de Positiva Compañía de Seguros S.A. en el mercado y al interior de la compañía, adicionalmente, gestionará investigaciones de mercado y consultorías que se requieran para la compañía.","2022-04-01",4,"2022-12-31",9.1333333333333329,"Invitación pública","Gasto Administrativo",2454553459,2454553459,"NO",null,"Gerencia de Abastecimiento Estratégico\ncontratacion@positiva.gov.co\nPBX: (1)6502200 Ext: 10641","SI","SI","NA","SI","Pública clasificada","C35032022\nC35212022\nC35312022\nC35322022\nC35332022\nC35342022\nC35362022\nC35372022\nC35382022-Tipo de información Pública clasificada- EL CONTRATISTA, se compromete con POSITIVA COMPAÑÍA DE SEGUROS S.A., a la prestación de servicios para la Planeación e Implementación de estrategias de mercadeo y comunicaciones, las cuales se ejecutarán por medio de las diversas actividades y disciplinas del marketing, endomarketing y comunicaciones, orientadas a fortalecer la posición de Positiva Compañía de Seguros S.A. en el mercado y al interior de la compañía, adicionalmente, gestionará investigaciones de mercado y consultorías que se requieran para la compañía."]
["NEGOCIOS","Canales","NO","C35042022",86132001,"Capacitación y entrenamiento Fuerza Comercial","2022-08-01",8,"2022-12-31",5.0666666666666664,"Invitación directa","Gasto Administrativo",0,0,"NO",null,"Gerencia de Abastecimiento Estratégico\ncontratacion@positiva.gov.co\nPBX: (1)6502200 Ext: 10641","SI","SI","NA","SI","Pública clasificada","C35042022-Tipo de información Pública clasificada-Capacitación y entrenamiento Fuerza Comercial"]
["NEGOCIOS","Canales","SI","C35052022",80141625,"Suministro de productos y/o servicios  de acuerdo con los requerimientos, cantidades y precios demandados por la compañía, para satisfacer las necesidades referentes a la entrega de incentivos a la gestión comercial","2022-01-01",1,"2022-12-31",12.133333333333333,"Invitación directa","Gasto Administrativo",94770000,94770000,"SI","APROBADA","Gerencia de Abastecimiento Estratégico\ncontratacion@positiva.gov.co\nPBX: (1)6502200 Ext: 10641","SI","SI","SI","SI","Pública clasificada","C35052022-Tipo de información Pública clasificada-Suministro de productos y/o servicios  de acuerdo con los requerimientos, cantidades y precios demandados por la compañía, para satisfacer las necesidades referentes a la entrega de incentivos a la gestión comercial"]
["NEGOCIOS","Canales","NO","C35062022",86101804,"Prestación de Servicios, Capacitaciones virtuales para la estructura Comercial  e Intermediarios","2022-01-01",1,"2022-12-31",12.133333333333333,"Invitación directa","Gasto Administrativo",105300000,105300000,"NO",null,"Gerencia de Abastecimiento Estratégico\ncontratacion@positiva.gov.co\nPBX: (1)6502200 Ext: 10641","SI","NO","SI","SI","Pública clasificada","C35062022-Tipo de información Pública clasificada-Prestación de Servicios, Capacitaciones virtuales para la estructura Comercial  e Intermediarios"]
["NEGOCIOS","Canales","NO","C35072022",90000000,"Prestación de Servicios - Viajes comerciales - Tiquetes","2022-01-01",1,"2022-12-31",12.133333333333333,"Invitación cerrada","Gasto Administrativo",120000000,120000000,"SI","APROBADA","Gerencia de Abastecimiento Estratégico\ncontratacion@positiva.gov.co\nPBX: (1)6502200 Ext: 10641","SI","NO","NO","SI","Pública clasificada","C35072022-Tipo de información Pública clasificada-Prestación de Servicios - Viajes comerciales - Tiquetes"]
["NEGOCIOS","Canales","SI","C35092022",80141600,"Prestación de servicios Outsorcing de personal","2022-01-01",1,"2022-09-30",9.0666666666666664,"Invitación directa","Gasto Administrativo",4714861730,4714861730,"SI","APROBADA","Gerencia de Abastecimiento Estratégico\ncontratacion@positiva.gov.co\nPBX: (1)6502200 Ext: 10641","SI","SI","NA","SI","Pública clasificada","C35092022-Tipo de información Pública clasificada-Prestación de servicios Outsorcing de personal"]
["NEGOCIOS","Canales","SI","C35122022",43232303,"Prestación de servicios para la habilitación de suscripción Salesforce.com, Marketing Cloud, así como los Servicios de Soporte Tecnológico y capacitación funcional.","2022-01-01",1,"2022-12-31",12.133333333333333,"Invitación directa","Gasto Administrativo",670146211,670146211,"SI","APROBADA","Gerencia de Abastecimiento Estratégico\ncontratacion@positiva.gov.co\nPBX: (1)6502200 Ext: 10641","SI","SI","SI","SI","Pública clasificada","C35122022-Tipo de información Pública clasificada-Prestación de servicios para la habilitación de suscripción Salesforce.com, Marketing Cloud, así como los Servicios de Soporte Tecnológico y capacitación funcional."]
["NEGOCIOS","Canales","SI","C35132022",80141500,"Adquisición de estudio de la calidad del servicio de las ARL","2022-01-29",1,"2022-06-30",5.0666666666666664,"Invitación directa","Gasto Administrativo",14648953,14648953,"SI","APROBADA","Gerencia de Abastecimiento Estratégico\ncontratacion@positiva.gov.co\nPBX: (1)6502200 Ext: 10641","SI","SI","NA","SI","Pública clasificada","C35132022-Tipo de información Pública clasificada-Adquisición de estudio de la calidad del servicio de las ARL"]
["NEGOCIOS","Canales","NO","C35142022",80141500,"Contratar los servicios de una agencia de investigación de mercado,  para realizar investigaciones que permitan recolectar información de interés para la compañía","2022-07-01",7,"2022-12-31",6.1,"Invitación directa","Gasto Administrativo",14197005,14197005,"NO",null,"Gerencia de Abastecimiento Estratégico\ncontratacion@positiva.gov.co\nPBX: (1)6502200 Ext: 10641","SI","SI","NA","NO","Pública","C35142022-Tipo de información Pública-Contratar los servicios de una agencia de investigación de mercado,  para realizar investigaciones que permitan recolectar información de interés para la compañía"]
["NEGOCIOS","Canales","NO","C35152022","82101800, 82101701, 82101801, 82101802, 82101900, 82101901, 82101902, 82101903, 82101904, 82101905, 82110000, 82111704, 82111900, 82111801, 82111901, 82111904, 80141607, 80141611, 80141612, 80141613, 80141614, 80141616, 80141618, 80141623, 80141624, 80141625, 80141626, 80141700, 80141902, 80150000, 78102205, 14111608, 86101808, 82100000, 82101600, 80141500, 80141501, 80141509,80141600","Prestación de servicios para la Planeación e Implementación  de estrategias de mercadeo y comunicaciones, las cuales se ejecutarán por medio de las diversas actividades y disciplinas de marketing, endomarketing y comunicaciones, orientadas a fortalecer la posición de Positiva Compañía de Seguros en el mercado y al interior de la compañía","2022-07-01",7,"2022-12-31",6.1,"Invitación directa","Gasto Administrativo",126360000,126360000,"NO",null,"Gerencia de Abastecimiento Estratégico\ncontratacion@positiva.gov.co\nPBX: (1)6502200 Ext: 10641","SI","SI","NA","SI","Pública clasificada","C35152022-Tipo de información Pública clasificada-Prestación de servicios para la Planeación e Implementación  de estrategias de mercadeo y comunicaciones, las cuales se ejecutarán por medio de las diversas actividades y disciplinas de marketing, endomarketing y comunicaciones, orientadas a fortalecer la posición de Positiva Compañía de Seguros en el mercado y al interior de la compañía"]
["NEGOCIOS","Canales","NO","C35162022",80141607,"Prestación de servicios Plan de Formación","2022-09-01",9,"2022-10-31",2,"Invitación cerrada","Gasto Administrativo",954005884,954005884,"NO",null,"Gerencia de Abastecimiento Estratégico\ncontratacion@positiva.gov.co\nPBX: (1)6502200 Ext: 10641","NO","SI","NA","SI","Pública clasificada","C35162022-Tipo de información Pública clasificada-Prestación de servicios Plan de Formación"]
["NEGOCIOS","Canales","SI","C35172022",14111608,"Suministro de reconocimientos e Incentivos para la fuerza comercial","2022-01-01",1,"2022-12-31",12.133333333333333,"Invitación directa","Gasto Administrativo",47385000,47385000,"SI","APROBADA","Gerencia de Abastecimiento Estratégico\ncontratacion@positiva.gov.co\nPBX: (1)6502200 Ext: 10641","NO","SI","NA","N/A","Pública","C35172022-Tipo de información Pública-Suministro de reconocimientos e Incentivos para la fuerza comercial"]
["NEGOCIOS","Experiencia del cliente","NO","C35222022",86101804,"Prestación de Servicios / Desarrollar el Programa de Educación Financiera  dirigido a los trabajadores de las empresas afiliadas a Riesgos Laborales, Tomadores de Pólizas de Vida y de otros  ramos y/o Clientes potenciales, proveedores, intermediarios y Usuarios en general a través de webinars, talleres y/o conferencias presenciales y/o virtuales, generación de piezas y contenidos para el programa, utilizando el contenido y la metodología definida por POSITIVA.","2022-01-25",1,"2022-12-31",11.333333333333334,"Invitación cerrada","Gasto Administrativo",96760170,96760170,"SI","APROBADA","Gerencia de Abastecimiento Estratégico\ncontratacion@positiva.gov.co\nPBX: (1)6502200 Ext: 10641","NO","SI","NA","NO","Pública","C35222022-Tipo de información Pública-Prestación de Servicios / Desarrollar el Programa de Educación Financiera  dirigido a los trabajadores de las empresas afiliadas a Riesgos Laborales, Tomadores de Pólizas de Vida y de otros  ramos y/o Clientes potenciales, proveedores, intermediarios y Usuarios en general a través de webinars, talleres y/o conferencias presenciales y/o virtuales, generación de piezas y contenidos para el programa, utilizando el contenido y la metodología definida por POSITIVA."]
["NEGOCIOS","Experiencia del cliente","NO","C35232022",81131504,"Prestar los servicios profesionales con plena autonomía técnica y administrativa para apoyar en la medición de la satisfacción de los clientes e intermediarios con el servicio brindado por POSITIVA durante el 2022 y la percepción corporativa de los grupos de interés de la Compañía, conforme a la Ley 1328 de 2009 de protección al consumidor financiero y al Manual de Sistema de Atención al Consumidor (SAC)","2022-09-01",9,"2022-12-31",4.0333333333333332,"Invitación directa","Gasto Administrativo",329790913,329790913,"NO",null,"Gerencia de Abastecimiento Estratégico\ncontratacion@positiva.gov.co\nPBX: (1)6502200 Ext: 10641","NO","SI","NA","SI","Pública clasificada","C35232022-Tipo de información Pública clasificada-Prestar los servicios profesionales con plena autonomía técnica y administrativa para apoyar en la medición de la satisfacción de los clientes e intermediarios con el servicio brindado por POSITIVA durante el 2022 y la percepción corporativa de los grupos de interés de la Compañía, conforme a la Ley 1328 de 2009 de protección al consumidor financiero y al Manual de Sistema de Atención al Consumidor (SAC)"]
["NEGOCIOS","Experiencia del cliente","SI","C35252022",80141600,"Prestación de servicios Outsorcing de personal","2022-01-01",1,"2022-12-31",12.133333333333333,"Invitación directa","Gasto Administrativo",285138270,285138270,"SI","APROBADA","Gerencia de Abastecimiento Estratégico\ncontratacion@positiva.gov.co\nPBX: (1)6502200 Ext: 10641","SI","SI","NA","SI","Pública clasificada","C35252022-Tipo de información Pública clasificada-Prestación de servicios Outsorcing de personal"]
["NEGOCIOS","Experiencia del cliente","NO","C35272022",80111616,"Prestación de Servicios / Contar con el Defensor del Consumidor Financiero","2022-07-01",7,"2022-12-31",6.1,"Invitación directa","Gasto Administrativo",78276664,78276664,"SI","APROBADA","Gerencia de Abastecimiento Estratégico\ncontratacion@positiva.gov.co\nPBX: (1)6502200 Ext: 10641","NO","SI","NA","NO","Pública","C35272022-Tipo de información Pública-Prestación de Servicios / Contar con el Defensor del Consumidor Financiero"]
["NEGOCIOS","Experiencia del cliente","NO","C35292022",14111608,"Prestación de Servicios / Contar con un Programa de Fidelización y Experiencia en los diferentes momentos de verdad","2022-08-01",8,"2022-12-31",5.0666666666666664,"Invitación directa","Gasto Administrativo",53560000,53560000,"NO",null,"Gerencia de Abastecimiento Estratégico\ncontratacion@positiva.gov.co\nPBX: (1)6502200 Ext: 10641","NO","SI","NA","SI","Pública clasificada","C35292022-Tipo de información Pública clasificada-Prestación de Servicios / Contar con un Programa de Fidelización y Experiencia en los diferentes momentos de verdad"]
["NEGOCIOS","Experiencia del cliente","NO","C35302022",81131504,"Prestación de Servicios / Realizar Medición de Satisfacción y Experiencia en tiempo real","2022-08-01",8,"2022-12-31",5.0666666666666664,"Invitación directa","Gasto Administrativo",40224848,40224848,"NO",null,"Gerencia de Abastecimiento Estratégico\ncontratacion@positiva.gov.co\nPBX: (1)6502200 Ext: 10641","NO","SI","NA","SI","Pública clasificada","C35302022-Tipo de información Pública clasificada-Prestación de Servicios / Realizar Medición de Satisfacción y Experiencia en tiempo real"]
["NEGOCIOS","Vida","NO","C35392022",82101500,"Renovación póliza Magisterio contratada por intermedio de LYM","2022-07-01",7,"2022-12-31",6.1,"Invitación directa","Gasto Administrativo",15774450,15774450,"NO",null,"Gerencia de Abastecimiento Estratégico\ncontratacion@positiva.gov.co\nPBX: (1)6502200 Ext: 10641","SI","SI","NA","SI","Pública clasificada","C35392022-Tipo de información Pública clasificada-Renovación póliza Magisterio contratada por intermedio de LYM"]
["NEGOCIOS","Vida","NO","C35402022",82101500,"Impresión papelería negocios renovados para fideliza los clientes de Positiva","2022-07-01",7,"2022-12-31",6.1,"Invitación directa","Gasto Administrativo",20420000,20420000,"NO",null,"Gerencia de Abastecimiento Estratégico\ncontratacion@positiva.gov.co\nPBX: (1)6502200 Ext: 10641","NO","SI","NA","SI","Pública clasificada","C35402022-Tipo de información Pública clasificada-Impresión papelería negocios renovados para fideliza los clientes de Positiva"]
["NEGOCIOS","Vida","NO","C35422022","80141600, 80141606, 80141613","Prestación de servicios de Promoción y Prevención para implementar, mejorar y/o mantener actividades de asesoría, asistencia técnica y de formación en Seguridad y Salud en el Trabajo, del Plan Básico en los programas (Estructura Empresarial, Preparación y Atención de Emergencias, Promoción y Prevención en Salud, Protección Colectiva e individual), Plan Avanzado en los Programas (Gestión de Incidentes y accidentes de Trabajo, Gestión de enfermedad laboral), Plan Especializado (Programa de Vigilancia Epidemiológica), Plan Gestión Integral (Sistemas integrados de Gestión) de la estrategia CREA del modelo de gestión POSITIVA SUMA, de acuerdo a los planes de trabajo pactados con las empresas y cargados en el aplicativo GESTPOS, para empresas afiliadas a Positiva Compañía de Seguros Sucursales Antioquia y Chocó. /  Actividades de formación en prevención de accidentes, para estudiantes  de las  empresas clientes, de Seguros de Vida, especialmente MUNICIPIO DE MEDELLÍN y la empresa ITM de la Sucursal Antioquia de la Zona Antioquia","2022-09-01",9,"2022-12-31",4.0333333333333332,"Invitación directa","Gasto Administrativo",122346654,122346654,"NO",null,"Gerencia de Abastecimiento Estratégico\ncontratacion@positiva.gov.co\nPBX: (1)6502200 Ext: 10641","SI","SI","NA","SI","Pública clasificada","C35422022-Tipo de información Pública clasificada-Prestación de servicios de Promoción y Prevención para implementar, mejorar y/o mantener actividades de asesoría, asistencia técnica y de formación en Seguridad y Salud en el Trabajo, del Plan Básico en los programas (Estructura Empresarial, Preparación y Atención de Emergencias, Promoción y Prevención en Salud, Protección Colectiva e individual), Plan Avanzado en los Programas (Gestión de Incidentes y accidentes de Trabajo, Gestión de enfermedad laboral), Plan Especializado (Programa de Vigilancia Epidemiológica), Plan Gestión Integral (Sistemas integrados de Gestión) de la estrategia CREA del modelo de gestión POSITIVA SUMA, de acuerdo a los planes de trabajo pactados con las empresas y cargados en el aplicativo GESTPOS, para empresas afiliadas a Positiva Compañía de Seguros Sucursales Antioquia y Chocó. /  Actividades de formación en prevención de accidentes, para estudiantes  de las  empresas clientes, de Seguros de Vida, especialmente MUNICIPIO DE MEDELLÍN y la empresa ITM de la Sucursal Antioquia de la Zona Antioquia"]
["NEGOCIOS","Vida","NO","C35442022",14111608,"Incentivar la gestión comercial a partir del cumplimientos de metas","2022-01-18",1,"2022-12-31",11.566666666666666,"Invitación directa","Gasto Administrativo",126212433,126212433,"NO",null,"Gerencia de Abastecimiento Estratégico\ncontratacion@positiva.gov.co\nPBX: (1)6502200 Ext: 10641","NO","SI","NA","SI","Pública clasificada","C35442022-Tipo de información Pública clasificada-Incentivar la gestión comercial a partir del cumplimientos de metas"]
["NEGOCIOS","Vida","NO","C35452022","14111514- 55101509","Suministro de material impreso para  la divulgación de  mensajes  de promoción  y prevención de  accidentes  en  la  póliza  de Accidentes  Personales de  la   Universidad Nacional","2022-07-01",7,"2022-12-31",6.1,"Invitación directa","Gasto Administrativo",84380346,84380346,"NO",null,"Gerencia de Abastecimiento Estratégico\ncontratacion@positiva.gov.co\nPBX: (1)6502200 Ext: 10641","SI","SI","NA","SI","Pública clasificada","C35452022-Tipo de información Pública clasificada-Suministro de material impreso para  la divulgación de  mensajes  de promoción  y prevención de  accidentes  en  la  póliza  de Accidentes  Personales de  la   Universidad Nacional"]
["NEGOCIOS","Vida","NO","C35462022","83121700-83121703-82101903","Manejo de  redes  sociales de  la  Universidad Nacional  que  incluyen campañas  para controlar la  accidentalidad y prevención, vida saludable, valores y actividades","2022-01-18",1,"2022-12-31",11.566666666666666,"Invitación directa","Gasto Administrativo",66000000,66000000,"NO",null,"Gerencia de Abastecimiento Estratégico\ncontratacion@positiva.gov.co\nPBX: (1)6502200 Ext: 10641","SI","SI","NA","SI","Pública clasificada","C35462022-Tipo de información Pública clasificada-Manejo de  redes  sociales de  la  Universidad Nacional  que  incluyen campañas  para controlar la  accidentalidad y prevención, vida saludable, valores y actividades"]
["NEGOCIOS","Vida","NO","C35482022","24141704, 821215","Material impreso compromiso comercial Banco Agrario Licitacion Pública  No  (No. SEG2021–01-DG )","2022-01-18",1,"2022-12-31",11.566666666666666,"Invitación directa","Gasto Administrativo",300000000,300000000,"NO",null,"Gerencia de Abastecimiento Estratégico\ncontratacion@positiva.gov.co\nPBX: (1)6502200 Ext: 10641","NO","SI","NA","SI","Pública clasificada","C35482022-Tipo de información Pública clasificada-Material impreso compromiso comercial Banco Agrario Licitacion Pública  No  (No. SEG2021–01-DG )"]
["Operaciones","Gcia. Recaudo y Cartera","NO","C450142022","80121610","\"Prestación de Servicios de gestion de cobro en etapa persuasiva y prejuridica de firmas externas para Cartera ARL, y recobros por Mora a la Fecha del evento por GESTION DE COBRANZA CARTERA APORTES CONCILIACION\"","2022-06-01",6,"2023-05-31",12,"Invitación directa","GastosAdministrativos",5064905235,2351496667,"SI",null,"Gerencia de Abastecimiento Estratégico\ncontratacion@positiva.gov.co\nPBX: (1)6502200 Ext: 10641","SI","SI","NO","SI","Pública clasificada","C450142022-Tipo de información Pública clasificada-\"Prestación de Servicios de gestion de cobro en etapa persuasiva y prejuridica de firmas externas para Cartera ARL, y recobros por Mora a la Fecha del evento por GESTION DE COBRANZA CARTERA APORTES CONCILIACION\""]
["Operaciones","Gcia. Recaudo y Cartera","NO","C450152022","80121610","\"Prestación de Servicios de gestion de cobro en etapa persuasiva y prejuridica de firmas externas para Cartera ARL, y recobros por Mora a la Fecha del evento por GESTION DE COBRANZA CARTERA APORTES CONCILIACION\"","2022-06-01",6,"2023-05-31",12,"Invitación directa","GastosAdministrativos",{"$f":"+N77*2","v":3966000000},1983000000,"SI",null,"Gerencia de Abastecimiento Estratégico\ncontratacion@positiva.gov.co\nPBX: (1)6502200 Ext: 10641","SI","SI","NO","SI","Pública clasificada","C450152022-Tipo de información Pública clasificada-\"Prestación de Servicios de gestion de cobro en etapa persuasiva y prejuridica de firmas externas para Cartera ARL, y recobros por Mora a la Fecha del evento por GESTION DE COBRANZA CARTERA APORTES CONCILIACION\""]
["Operaciones","Gcia. Recaudo y Cartera","NO","C450162022","80121610","Prestación de Servicios de gestion servicios de gestion de cobro de cartera RAMO DE PERSONAS","2022-06-01",6,"2023-05-31",12,"Invitación directa","GastosAdministrativos",101363889,44982000,"SI",null,"Gerencia de Abastecimiento Estratégico\ncontratacion@positiva.gov.co\nPBX: (1)6502200 Ext: 10641","SI","SI","NO","SI","Pública clasificada","C450162022-Tipo de información Pública clasificada-Prestación de Servicios de gestion servicios de gestion de cobro de cartera RAMO DE PERSONAS"]
["Operaciones","Gcia. Recaudo y Cartera","NO","C450172022","80121610","Administrador de Cartera","2022-10-01",10,"2023-09-30",12,"Invitación directa","GastosAdministrativos",200000000,50000000,"SI",null,"Gerencia de Abastecimiento Estratégico\ncontratacion@positiva.gov.co\nPBX: (1)6502200 Ext: 10641","SI","SI","NO","SI","Pública clasificada","C450172022-Tipo de información Pública clasificada-Administrador de Cartera"]
["Operaciones","Gcia. Recaudo y Cartera","SI","NA","80121610","Prestación de Servicios de Compra de registros al operador de información  por datos Seguridad social sistema de Riesgos laborales.","2022-07-01",7,"2023-06-30",12,"Invitación directa","GastosAdministrativos",10338491160,4894215765,"NO",null,"Gerencia de Abastecimiento Estratégico\ncontratacion@positiva.gov.co\nPBX: (1)6502200 Ext: 10641","SI","SI","NO","SI","Pública clasificada","NA-Tipo de información Pública clasificada-Prestación de Servicios de Compra de registros al operador de información  por datos Seguridad social sistema de Riesgos laborales."]
["Operaciones","Gcia. Recaudo y Cartera","SI","NA","80121610","Prestación de Servicios de Compra de registros al operador de información  por datos Seguridad social sistema de Riesgos laborales.","2022-07-01",7,"2023-06-30",12,"Invitación directa","GastosAdministrativos",{"$f":"+N81","v":290889369},290889369,"NO",null,"Gerencia de Abastecimiento Estratégico\ncontratacion@positiva.gov.co\nPBX: (1)6502200 Ext: 10641","SI","SI","NO","SI","Pública clasificada","NA-Tipo de información Pública clasificada-Prestación de Servicios de Compra de registros al operador de información  por datos Seguridad social sistema de Riesgos laborales."]
["Operaciones","Gcia. Recaudo y Cartera","SI","C45122022","80121610","Prestar sus servicios profesionales a la Gerencia de Recaudo y Cartera de POSITIVA en la revisión y conciliación de la información registrada en los diferentes aplicativos de los procesos de recaudo, cartera y liquidación de comisiones a fin de identificar inconsistencias y realizar los ajustes a que haya lugar; así como a apoyar en la legalización y reporte de los saldos pendientes por recuperar y/o los saldos pendientes por pagar en las cuentas corrientes de los intermediarios.","2022-01-01",1,"2022-12-31",12,"Invitación directa","GastosAdministrativos",{"$f":"+N82","v":124032074},124032074,"NO",null,"Gerencia de Abastecimiento Estratégico\ncontratacion@positiva.gov.co\nPBX: (1)6502200 Ext: 10641","SI","SI","NO","SI","Pública clasificada","C45122022-Tipo de información Pública clasificada-Prestar sus servicios profesionales a la Gerencia de Recaudo y Cartera de POSITIVA en la revisión y conciliación de la información registrada en los diferentes aplicativos de los procesos de recaudo, cartera y liquidación de comisiones a fin de identificar inconsistencias y realizar los ajustes a que haya lugar; así como a apoyar en la legalización y reporte de los saldos pendientes por recuperar y/o los saldos pendientes por pagar en las cuentas corrientes de los intermediarios."]
["Operaciones","Gcia. Recaudo y Cartera","SI","C45092022","80121610","Prestar sus servicios profesionales a la Gerencia de Recaudo y Cartera de POSITIVA en la revisión y conciliación de la información registrada en los diferentes aplicativos de los procesos de recaudo, cartera y liquidación de comisiones a fin de identificar inconsistencias y realizar los ajustes a que haya lugar; así como a apoyar en la legalización y reporte de los saldos pendientes por recuperar y/o los saldos pendientes por pagar en las cuentas corrientes de los intermediarios.","2022-01-01",1,"2022-12-31",12,"Invitación directa","GastosAdministrativos",124032074,124032074,"NO",null,"Gerencia de Abastecimiento Estratégico\ncontratacion@positiva.gov.co\nPBX: (1)6502200 Ext: 10641","SI","SI","NO","SI","Pública clasificada","C45092022-Tipo de información Pública clasificada-Prestar sus servicios profesionales a la Gerencia de Recaudo y Cartera de POSITIVA en la revisión y conciliación de la información registrada en los diferentes aplicativos de los procesos de recaudo, cartera y liquidación de comisiones a fin de identificar inconsistencias y realizar los ajustes a que haya lugar; así como a apoyar en la legalización y reporte de los saldos pendientes por recuperar y/o los saldos pendientes por pagar en las cuentas corrientes de los intermediarios."]
["Operaciones","Gcia. Recaudo y Cartera","SI","C45102022","80121610","Prestar servicios a la Gerencia de Afiliaciones y Novedades y a la Gerencia de Recaudo y Cartera de la Vicepresidencia de Operaciones de POSITIVA S.A en los asuntos administrativos que les competan en materia de afiliaciones, novedades, recaudos, cartera y recobros, así como en los temas específicos de naturaleza análoga que requiera directamente la Vicepresidencia de Operaciones.","2022-01-01",1,"2022-12-31",12,"Invitación directa","GastosAdministrativos",150790197,150790197,"NO",null,"Gerencia de Abastecimiento Estratégico\ncontratacion@positiva.gov.co\nPBX: (1)6502200 Ext: 10641","SI","SI","NO","SI","Pública clasificada","C45102022-Tipo de información Pública clasificada-Prestar servicios a la Gerencia de Afiliaciones y Novedades y a la Gerencia de Recaudo y Cartera de la Vicepresidencia de Operaciones de POSITIVA S.A en los asuntos administrativos que les competan en materia de afiliaciones, novedades, recaudos, cartera y recobros, así como en los temas específicos de naturaleza análoga que requiera directamente la Vicepresidencia de Operaciones."]
["Operaciones","Gcia. Afiliaciones y Novedades","SI","C45112022","80121610","Prestar sus servicios a la Gerencia de Afiliaciones y Novedades en la revisión, validación, conciliación y gestión de los procesos de mantenimiento de pólizas de los ramos de vida individual y colectivo.","2022-01-01",1,"2022-12-31",12,"Invitación directa","GastosAdministrativos",52507822,52507822,"NO",null,"Gerencia de Abastecimiento Estratégico\ncontratacion@positiva.gov.co\nPBX: (1)6502200 Ext: 10641","SI","SI","NO","SI","Pública clasificada","C45112022-Tipo de información Pública clasificada-Prestar sus servicios a la Gerencia de Afiliaciones y Novedades en la revisión, validación, conciliación y gestión de los procesos de mantenimiento de pólizas de los ramos de vida individual y colectivo."]
["Operaciones","Vicepresidencia de operaciones","NO","C450182022","80121610","\"Prestación de servicios de Contact Center de acuerdo a las políticas, normas y características definidas por POSITIVA COMPAÑÍA DE SEGUROS S.A., para ofrecer un soporte integral de información de la compañía, a los afiliados a Riesgos laborales, diferentes ramos de pólizas de vida: vida individual, accidentes personales, vida grupo, exequias, desempleo, planes de salud, rentas vitalicias, conmutaciones pensionales, BEPS y, a los otros ramos que sean autorizados a la compañía  y a los ciudadanos en general; con el objetivo permanente de brindar una información completa y satisfactoria en primer contacto a cada una de las solicitudes, agregando valor a los asegurados y ciudadanos.\"","2022-12-01",12,"2023-11-30",12,"Invitación directa","GastosAdministrativos",400000000,400000000,"NO",null,"Gerencia de Abastecimiento Estratégico\ncontratacion@positiva.gov.co\nPBX: (1)6502200 Ext: 10641","SI","SI","NO","SI","Pública clasificada","C450182022-Tipo de información Pública clasificada-\"Prestación de servicios de Contact Center de acuerdo a las políticas, normas y características definidas por POSITIVA COMPAÑÍA DE SEGUROS S.A., para ofrecer un soporte integral de información de la compañía, a los afiliados a Riesgos laborales, diferentes ramos de pólizas de vida: vida individual, accidentes personales, vida grupo, exequias, desempleo, planes de salud, rentas vitalicias, conmutaciones pensionales, BEPS y, a los otros ramos que sean autorizados a la compañía  y a los ciudadanos en general; con el objetivo permanente de brindar una información completa y satisfactoria en primer contacto a cada una de las solicitudes, agregando valor a los asegurados y ciudadanos.\""]
["SECRETARIA GENERAL Y JURÍDICA","Oficina Gestión Integral de Riesgos ","No","C00022022",80101510,"Capacitación Proveedores en cumplimiento de requisitos de normas relacionadas con la capacitación de proveedores que ejecutan funciones de la compañía","2022-09-01",{"$f":"MONTH(G87)","v":9},"2022-12-31",4,"Invitación directa","GastosAdministrativos",21887599.466699999,21887599.466699999,"No","N/A","Gerencia de Abastecimiento Estratégico\ncontratacion@positiva.gov.co\nPBX: (1)6502200 Ext: 10641","NO","NO","NO","NO",{"$f":"IF(U87=\"SI\",\"Pública clasificada\",\"Pública\")","v":"Pública"},{"$f":"CONCATENATE(D87,\"-\",\"Tipo de información\",\" \",V87,\"-\",F87)","v":"C00022022-Tipo de información Pública-Capacitación Proveedores en cumplimiento de requisitos de normas relacionadas con la capacitación de proveedores que ejecutan funciones de la compañía"}]
["SECRETARIA GENERAL Y JURÍDICA","Oficina Gestión Integral de Riesgos ","No","C00032022",81112201,"Prestar servicios de soporte y mantenimiento de la herramienta ERA (ENTREPRISE RISK ASESSOR) que soporta la gestión de riesgos de la Oficina de Gestión Integral Riesgos.","2022-01-01",1,"2022-07-31",7,"Invitación directa","GastosAdministrativos",9736637.2816020008,9736637.2816020008,"No","N/A","Gerencia de Abastecimiento Estratégico\ncontratacion@positiva.gov.co\nPBX: (1)6502200 Ext: 10641","NO","NO","NO","NO","Pública","C00032022-Tipo de información Pública-Prestar servicios de soporte y mantenimiento de la herramienta ERA (ENTREPRISE RISK ASESSOR) que soporta la gestión de riesgos de la Oficina de Gestión Integral Riesgos."]
["SECRETARIA GENERAL Y JURÍDICA","Oficina Gestión Integral de Riesgos ","No","C00052022",43232300,"Investigaciones externas o internas relacionadas con LAFT, consultas en centrales de riesgo y busqueda de informacion acerca de cliente, proveedores, funcionarios y quienes correspondan.","2022-01-01",1,"2022-12-31",12,"Invitación directa","GastosAdministrativos",9520889.8059,9520889.8059,"No","N/A","Gerencia de Abastecimiento Estratégico\ncontratacion@positiva.gov.co\nPBX: (1)6502200 Ext: 10641","NO","NO","NO","NO","Pública","C00052022-Tipo de información Pública-Investigaciones externas o internas relacionadas con LAFT, consultas en centrales de riesgo y busqueda de informacion acerca de cliente, proveedores, funcionarios y quienes correspondan."]
["SECRETARIA GENERAL Y JURÍDICA","Oficina Gestión Integral de Riesgos ","No","C00042022",43232300,"Investigaciones externas o internas acerca de casos de fraude y/o corrupcion presentados en la entidad","2022-01-01",1,"2022-12-31",12,"Invitación directa","GastosAdministrativos",15691500,15691500,"No","N/A","Gerencia de Abastecimiento Estratégico\ncontratacion@positiva.gov.co\nPBX: (1)6502200 Ext: 10641","NO","NO","NO","NO","Pública","C00042022-Tipo de información Pública-Investigaciones externas o internas acerca de casos de fraude y/o corrupcion presentados en la entidad"]
["SECRETARIA GENERAL Y JURÍDICA","Oficina Gestión Integral de Riesgos ","No","C00062022",43232300,"Actualización de información de clientes - SARLAFT","2022-07-01",7,"2023-08-01",12,"Invitación directa","GastosAdministrativos",20000000,20000000,"No","N/A","Gerencia de Abastecimiento Estratégico\ncontratacion@positiva.gov.co\nPBX: (1)6502200 Ext: 10641","NO","NO","NO","NO","Pública","C00062022-Tipo de información Pública-Actualización de información de clientes - SARLAFT"]
["SECRETARIA GENERAL Y JURÍDICA","Oficina Gestión Integral de Riesgos ","No","C00072022",43232300,"Prestación de servicios para contar con acceso, consulta y verificación de información de Listas Vinculantes y Restrictivas, inhibitorias, informativas y PEPs","2022-09-01",9,"2023-10-01",12,"Invitación directa","GastosAdministrativos",15000000,15000000,"No","N/A","Gerencia de Abastecimiento Estratégico\ncontratacion@positiva.gov.co\nPBX: (1)6502200 Ext: 10641","NO","NO","NO","NO","Pública","C00072022-Tipo de información Pública-Prestación de servicios para contar con acceso, consulta y verificación de información de Listas Vinculantes y Restrictivas, inhibitorias, informativas y PEPs"]
["PyP","Gerencia de administración del riesgo","No","C75012022",93141808,"PRESTACION DE SERVICIOS DE PROMOCION Y PREVENCION – SERVICIOS_ESPECIALIZADOS_ZONA_ANTIOQUIA","1/01/2022",1,"30/11/2022",{"$f":"(I93-G93)/30","v":11.1},"Invitación directa","GastosAdministrativos",200000000,200000000,"No","N/A","Gerencia de Abastecimiento Estratégico\ncontratacion@positiva.gov.co\nPBX: (1)6502200 Ext: 10641","SI","SI","NO","SI","Pública clasificada","C75012022-Tipo de información Pública clasificada-PRESTACION DE SERVICIOS DE PROMOCION Y PREVENCION – SERVICIOS_ESPECIALIZADOS_ZONA_ANTIOQUIA"]
["PyP","Gerencia de administración del riesgo","No","C75022022",93141808,"PRESTACION DE SERVICIOS DE PROMOCION Y PREVENCION – SERVICIOS_ESPECIALIZADOS_ZONA_ANTIOQUIA","1/01/2022",1,"30/11/2022",11.1,"Invitación directa","GastosAdministrativos",47323529,47323529,"No","N/A","Gerencia de Abastecimiento Estratégico\ncontratacion@positiva.gov.co\nPBX: (1)6502200 Ext: 10641","SI","SI","NO","SI","Pública clasificada","C75022022-Tipo de información Pública clasificada-PRESTACION DE SERVICIOS DE PROMOCION Y PREVENCION – SERVICIOS_ESPECIALIZADOS_ZONA_ANTIOQUIA"]
["PyP","Gerencia de administración del riesgo","No","C75032022",93141808,"PRESTACION DE SERVICIOS DE PROMOCION Y PREVENCION – SERVICIOS_ESPECIALIZADOS_ZONA_ANTIOQUIA","1/01/2022",1,"30/11/2022",11.1,"Invitación directa","GastosAdministrativos",206352227,206352227,"No","N/A","Gerencia de Abastecimiento Estratégico\ncontratacion@positiva.gov.co\nPBX: (1)6502200 Ext: 10641","SI","SI","NO","SI","Pública clasificada","C75032022-Tipo de información Pública clasificada-PRESTACION DE SERVICIOS DE PROMOCION Y PREVENCION – SERVICIOS_ESPECIALIZADOS_ZONA_ANTIOQUIA"]
["PyP","Gerencia de administración del riesgo","No","C75042022",93141808,"PRESTACION DE SERVICIOS DE PROMOCION Y PREVENCION – SERVICIOS_ESPECIALIZADOS_ZONA_ANTIOQUIA","1/01/2022",1,"30/11/2022",11.1,"Invitación directa","GastosAdministrativos",54273205,54273205,"No","N/A","Gerencia de Abastecimiento Estratégico\ncontratacion@positiva.gov.co\nPBX: (1)6502200 Ext: 10641","SI","SI","NO","SI","Pública clasificada","C75042022-Tipo de información Pública clasificada-PRESTACION DE SERVICIOS DE PROMOCION Y PREVENCION – SERVICIOS_ESPECIALIZADOS_ZONA_ANTIOQUIA"]
["PyP","Gerencia de administración del riesgo","No","C75052022",93141808,"PRESTACION DE SERVICIOS DE PROMOCION Y PREVENCION – SERVICIOS_ESPECIALIZADOS_ZONA_ANTIOQUIA","1/01/2022",1,"30/11/2022",11.1,"Invitación directa","GastosAdministrativos",65780731,65780731,"No","N/A","Gerencia de Abastecimiento Estratégico\ncontratacion@positiva.gov.co\nPBX: (1)6502200 Ext: 10641","SI","SI","NO","SI","Pública clasificada","C75052022-Tipo de información Pública clasificada-PRESTACION DE SERVICIOS DE PROMOCION Y PREVENCION – SERVICIOS_ESPECIALIZADOS_ZONA_ANTIOQUIA"]
["PyP","Gerencia de administración del riesgo","No","C75062022",93141808,"PRESTACION DE SERVICIOS DE PROMOCION Y PREVENCION – SERVICIOS_ESPECIALIZADOS_ZONA_ANTIOQUIA","1/01/2022",1,"30/11/2022",11.1,"Invitación directa","GastosAdministrativos",349193728,349193728,"No","N/A","Gerencia de Abastecimiento Estratégico\ncontratacion@positiva.gov.co\nPBX: (1)6502200 Ext: 10641","SI","SI","NO","SI","Pública clasificada","C75062022-Tipo de información Pública clasificada-PRESTACION DE SERVICIOS DE PROMOCION Y PREVENCION – SERVICIOS_ESPECIALIZADOS_ZONA_ANTIOQUIA"]
["PyP","Gerencia de administración del riesgo","No","C75072022",93141808,"PRESTACION DE SERVICIOS DE PROMOCION Y PREVENCION – SERVICIOS_ESPECIALIZADOS_ZONA_ANTIOQUIA","1/01/2022",1,"30/11/2022",11.1,"Invitación directa","GastosAdministrativos",243305085,243305085,"No","N/A","Gerencia de Abastecimiento Estratégico\ncontratacion@positiva.gov.co\nPBX: (1)6502200 Ext: 10641","SI","SI","NO","SI","Pública clasificada","C75072022-Tipo de información Pública clasificada-PRESTACION DE SERVICIOS DE PROMOCION Y PREVENCION – SERVICIOS_ESPECIALIZADOS_ZONA_ANTIOQUIA"]
["PyP","Gerencia de administración del riesgo","No","C75082022",93141808,"PRESTACION DE SERVICIOS DE PROMOCION Y PREVENCION – SERVICIOS_ESPECIALIZADOS_ZONA_ANTIOQUIA","1/01/2022",1,"30/11/2022",11.1,"Invitación directa","GastosAdministrativos",85000000,85000000,"No","N/A","Gerencia de Abastecimiento Estratégico\ncontratacion@positiva.gov.co\nPBX: (1)6502200 Ext: 10641","SI","SI","NO","SI","Pública clasificada","C75082022-Tipo de información Pública clasificada-PRESTACION DE SERVICIOS DE PROMOCION Y PREVENCION – SERVICIOS_ESPECIALIZADOS_ZONA_ANTIOQUIA"]
["PyP","Gerencia de administración del riesgo","No","C75092022",93141808,"PRESTACION DE SERVICIOS DE PROMOCION Y PREVENCION – SERVICIOS_ESPECIALIZADOS_ZONA_ANTIOQUIA","1/01/2022",1,"30/11/2022",11.1,"Invitación directa","GastosAdministrativos",90000000,90000000,"No","N/A","Gerencia de Abastecimiento Estratégico\ncontratacion@positiva.gov.co\nPBX: (1)6502200 Ext: 10641","SI","SI","NO","SI","Pública clasificada","C75092022-Tipo de información Pública clasificada-PRESTACION DE SERVICIOS DE PROMOCION Y PREVENCION – SERVICIOS_ESPECIALIZADOS_ZONA_ANTIOQUIA"]
["PyP","Gerencia de administración del riesgo","No","C75102022",93141808,"PRESTACION DE SERVICIOS DE PROMOCION Y PREVENCION – SERVICIOS_ESPECIALIZADOS_ZONA_ANTIOQUIA","1/01/2022",1,"30/11/2022",11.1,"Invitación directa","GastosAdministrativos",30000000,30000000,"No","N/A","Gerencia de Abastecimiento Estratégico\ncontratacion@positiva.gov.co\nPBX: (1)6502200 Ext: 10641","SI","SI","NO","SI","Pública clasificada","C75102022-Tipo de información Pública clasificada-PRESTACION DE SERVICIOS DE PROMOCION Y PREVENCION – SERVICIOS_ESPECIALIZADOS_ZONA_ANTIOQUIA"]
["PyP","Gerencia de administración del riesgo","No","C75112022",93141808,"PRESTACION DE SERVICIOS DE PROMOCION Y PREVENCION – SERVICIOS_ESPECIALIZADOS_ZONA_ANTIOQUIA","1/01/2022",1,"30/11/2022",11.1,"Invitación directa","GastosAdministrativos",163094491,163094491,"No","N/A","Gerencia de Abastecimiento Estratégico\ncontratacion@positiva.gov.co\nPBX: (1)6502200 Ext: 10641","SI","SI","NO","SI","Pública clasificada","C75112022-Tipo de información Pública clasificada-PRESTACION DE SERVICIOS DE PROMOCION Y PREVENCION – SERVICIOS_ESPECIALIZADOS_ZONA_ANTIOQUIA"]
["PyP","Gerencia de administración del riesgo","No","C75122022",93141808,"PRESTACION DE SERVICIOS DE PROMOCION Y PREVENCION – SERVICIOS_ESPECIALIZADOS_ZONA_ANTIOQUIA","1/01/2022",1,"30/11/2022",11.1,"Invitación directa","GastosAdministrativos",214432990,214432990,"No","N/A","Gerencia de Abastecimiento Estratégico\ncontratacion@positiva.gov.co\nPBX: (1)6502200 Ext: 10641","SI","SI","NO","SI","Pública clasificada","C75122022-Tipo de información Pública clasificada-PRESTACION DE SERVICIOS DE PROMOCION Y PREVENCION – SERVICIOS_ESPECIALIZADOS_ZONA_ANTIOQUIA"]
["PyP","Gerencia de administración del riesgo","No","C75132022",93141808,"PRESTACION DE SERVICIOS DE PROMOCION Y PREVENCION – SERVICIOS_ESPECIALIZADOS_ZONA_ANTIOQUIA","1/01/2022",1,"30/11/2022",11.1,"Invitación directa","GastosAdministrativos",95000000,95000000,"No","N/A","Gerencia de Abastecimiento Estratégico\ncontratacion@positiva.gov.co\nPBX: (1)6502200 Ext: 10641","SI","SI","NO","SI","Pública clasificada","C75132022-Tipo de información Pública clasificada-PRESTACION DE SERVICIOS DE PROMOCION Y PREVENCION – SERVICIOS_ESPECIALIZADOS_ZONA_ANTIOQUIA"]
["PyP","Gerencia de administración del riesgo","No","C75142022",93141808,"PRESTACION DE SERVICIOS DE PROMOCION Y PREVENCION – SERVICIOS_ESPECIALIZADOS_ZONA_ANTIOQUIA","1/01/2022",1,"30/11/2022",11.1,"Invitación directa","GastosAdministrativos",62482813,62482813,"No","N/A","Gerencia de Abastecimiento Estratégico\ncontratacion@positiva.gov.co\nPBX: (1)6502200 Ext: 10641","SI","SI","NO","SI","Pública clasificada","C75142022-Tipo de información Pública clasificada-PRESTACION DE SERVICIOS DE PROMOCION Y PREVENCION – SERVICIOS_ESPECIALIZADOS_ZONA_ANTIOQUIA"]
["PyP","Gerencia de administración del riesgo","No","C76012022",93141808,"PRESTACION DE SERVICIOS DE PROMOCION Y PREVENCION – SERVICIOS_ESPECIALIZADOS_ZONA_ATLANTICO","1/01/2022",1,"30/11/2022",11.1,"Invitación directa","GastosAdministrativos",115733143,115733143,"No","N/A","Gerencia de Abastecimiento Estratégico\ncontratacion@positiva.gov.co\nPBX: (1)6502200 Ext: 10641","SI","SI","NO","SI","Pública clasificada","C76012022-Tipo de información Pública clasificada-PRESTACION DE SERVICIOS DE PROMOCION Y PREVENCION – SERVICIOS_ESPECIALIZADOS_ZONA_ATLANTICO"]
["PyP","Gerencia de administración del riesgo","No","C76022022",93141808,"PRESTACION DE SERVICIOS DE PROMOCION Y PREVENCION – SERVICIOS_ESPECIALIZADOS_ZONA_ATLANTICO","1/01/2022",1,"30/11/2022",11.1,"Invitación directa","GastosAdministrativos",38076923,38076923,"No","N/A","Gerencia de Abastecimiento Estratégico\ncontratacion@positiva.gov.co\nPBX: (1)6502200 Ext: 10641","SI","SI","NO","SI","Pública clasificada","C76022022-Tipo de información Pública clasificada-PRESTACION DE SERVICIOS DE PROMOCION Y PREVENCION – SERVICIOS_ESPECIALIZADOS_ZONA_ATLANTICO"]
["PyP","Gerencia de administración del riesgo","No","C76032022",93141808,"PRESTACION DE SERVICIOS DE PROMOCION Y PREVENCION – SERVICIOS_ESPECIALIZADOS_ZONA_ATLANTICO","1/01/2022",1,"30/11/2022",11.1,"Invitación directa","GastosAdministrativos",100000000,100000000,"No","N/A","Gerencia de Abastecimiento Estratégico\ncontratacion@positiva.gov.co\nPBX: (1)6502200 Ext: 10641","SI","SI","NO","SI","Pública clasificada","C76032022-Tipo de información Pública clasificada-PRESTACION DE SERVICIOS DE PROMOCION Y PREVENCION – SERVICIOS_ESPECIALIZADOS_ZONA_ATLANTICO"]
["PyP","Gerencia de administración del riesgo","No","C76042022",93141808,"PRESTACION DE SERVICIOS DE PROMOCION Y PREVENCION – SERVICIOS_ESPECIALIZADOS_ZONA_ATLANTICO","1/01/2022",1,"30/11/2022",11.1,"Invitación directa","GastosAdministrativos",98172315,98172315,"No","N/A","Gerencia de Abastecimiento Estratégico\ncontratacion@positiva.gov.co\nPBX: (1)6502200 Ext: 10641","SI","SI","NO","SI","Pública clasificada","C76042022-Tipo de información Pública clasificada-PRESTACION DE SERVICIOS DE PROMOCION Y PREVENCION – SERVICIOS_ESPECIALIZADOS_ZONA_ATLANTICO"]
["PyP","Gerencia de administración del riesgo","No","C76052022",93141808,"PRESTACION DE SERVICIOS DE PROMOCION Y PREVENCION – SERVICIOS_ESPECIALIZADOS_ZONA_ATLANTICO","1/01/2022",1,"30/11/2022",11.1,"Invitación directa","GastosAdministrativos",110482143,110482143,"No","N/A","Gerencia de Abastecimiento Estratégico\ncontratacion@positiva.gov.co\nPBX: (1)6502200 Ext: 10641","SI","SI","NO","SI","Pública clasificada","C76052022-Tipo de información Pública clasificada-PRESTACION DE SERVICIOS DE PROMOCION Y PREVENCION – SERVICIOS_ESPECIALIZADOS_ZONA_ATLANTICO"]
["PyP","Gerencia de administración del riesgo","No","C76062022",93141808,"PRESTACION DE SERVICIOS DE PROMOCION Y PREVENCION – SERVICIOS_ESPECIALIZADOS_ZONA_ATLANTICO","1/01/2022",1,"30/11/2022",11.1,"Invitación directa","GastosAdministrativos",130339036,130339036,"No","N/A","Gerencia de Abastecimiento Estratégico\ncontratacion@positiva.gov.co\nPBX: (1)6502200 Ext: 10641","SI","SI","NO","SI","Pública clasificada","C76062022-Tipo de información Pública clasificada-PRESTACION DE SERVICIOS DE PROMOCION Y PREVENCION – SERVICIOS_ESPECIALIZADOS_ZONA_ATLANTICO"]
["PyP","Gerencia de administración del riesgo","No","C76072022",93141808,"PRESTACION DE SERVICIOS DE PROMOCION Y PREVENCION – SERVICIOS_ESPECIALIZADOS_ZONA_ATLANTICO","1/01/2022",1,"30/11/2022",11.1,"Invitación directa","GastosAdministrativos",198275000,198275000,"No","N/A","Gerencia de Abastecimiento Estratégico\ncontratacion@positiva.gov.co\nPBX: (1)6502200 Ext: 10641","SI","SI","NO","SI","Pública clasificada","C76072022-Tipo de información Pública clasificada-PRESTACION DE SERVICIOS DE PROMOCION Y PREVENCION – SERVICIOS_ESPECIALIZADOS_ZONA_ATLANTICO"]
["PyP","Gerencia de administración del riesgo","No","C76082022",93141808,"PRESTACION DE SERVICIOS DE PROMOCION Y PREVENCION – SERVICIOS_ESPECIALIZADOS_ZONA_ATLANTICO","1/01/2022",1,"30/11/2022",11.1,"Invitación directa","GastosAdministrativos",94087000,94087000,"No","N/A","Gerencia de Abastecimiento Estratégico\ncontratacion@positiva.gov.co\nPBX: (1)6502200 Ext: 10641","SI","SI","NO","SI","Pública clasificada","C76082022-Tipo de información Pública clasificada-PRESTACION DE SERVICIOS DE PROMOCION Y PREVENCION – SERVICIOS_ESPECIALIZADOS_ZONA_ATLANTICO"]
["PyP","Gerencia de administración del riesgo","No","C76092022",93141808,"PRESTACION DE SERVICIOS DE PROMOCION Y PREVENCION – SERVICIOS_ESPECIALIZADOS_ZONA_ATLANTICO","1/01/2022",1,"30/11/2022",11.1,"Invitación directa","GastosAdministrativos",221453919,221453919,"No","N/A","Gerencia de Abastecimiento Estratégico\ncontratacion@positiva.gov.co\nPBX: (1)6502200 Ext: 10641","SI","SI","NO","SI","Pública clasificada","C76092022-Tipo de información Pública clasificada-PRESTACION DE SERVICIOS DE PROMOCION Y PREVENCION – SERVICIOS_ESPECIALIZADOS_ZONA_ATLANTICO"]
["PyP","Gerencia de administración del riesgo","No","C76102022",93141808,"PRESTACION DE SERVICIOS DE PROMOCION Y PREVENCION – SERVICIOS_ESPECIALIZADOS_ZONA_ATLANTICO","1/01/2022",1,"30/11/2022",11.1,"Invitación directa","GastosAdministrativos",268510373,268510373,"No","N/A","Gerencia de Abastecimiento Estratégico\ncontratacion@positiva.gov.co\nPBX: (1)6502200 Ext: 10641","SI","SI","NO","SI","Pública clasificada","C76102022-Tipo de información Pública clasificada-PRESTACION DE SERVICIOS DE PROMOCION Y PREVENCION – SERVICIOS_ESPECIALIZADOS_ZONA_ATLANTICO"]
["PyP","Gerencia de administración del riesgo","No","C76112022",93141808,"PRESTACION DE SERVICIOS DE PROMOCION Y PREVENCION – SERVICIOS_ESPECIALIZADOS_ZONA_ATLANTICO","1/01/2022",1,"30/11/2022",11.1,"Invitación directa","GastosAdministrativos",1849897080,1849897080,"No","N/A","Gerencia de Abastecimiento Estratégico\ncontratacion@positiva.gov.co\nPBX: (1)6502200 Ext: 10641","SI","SI","NO","SI","Pública clasificada","C76112022-Tipo de información Pública clasificada-PRESTACION DE SERVICIOS DE PROMOCION Y PREVENCION – SERVICIOS_ESPECIALIZADOS_ZONA_ATLANTICO"]
["PyP","Gerencia de administración del riesgo","No","C76122022",93141808,"PRESTACION DE SERVICIOS DE PROMOCION Y PREVENCION – SERVICIOS_ESPECIALIZADOS_ZONA_ATLANTICO","1/01/2022",1,"30/11/2022",11.1,"Invitación directa","GastosAdministrativos",54476190,54476190,"No","N/A","Gerencia de Abastecimiento Estratégico\ncontratacion@positiva.gov.co\nPBX: (1)6502200 Ext: 10641","SI","SI","NO","SI","Pública clasificada","C76122022-Tipo de información Pública clasificada-PRESTACION DE SERVICIOS DE PROMOCION Y PREVENCION – SERVICIOS_ESPECIALIZADOS_ZONA_ATLANTICO"]
["PyP","Gerencia de administración del riesgo","No","C76132022",93141808,"PRESTACION DE SERVICIOS DE PROMOCION Y PREVENCION – SERVICIOS_ESPECIALIZADOS_ZONA_ATLANTICO","1/01/2022",1,"30/11/2022",11.1,"Invitación directa","GastosAdministrativos",94087000,94087000,"No","N/A","Gerencia de Abastecimiento Estratégico\ncontratacion@positiva.gov.co\nPBX: (1)6502200 Ext: 10641","SI","SI","NO","SI","Pública clasificada","C76132022-Tipo de información Pública clasificada-PRESTACION DE SERVICIOS DE PROMOCION Y PREVENCION – SERVICIOS_ESPECIALIZADOS_ZONA_ATLANTICO"]
["PyP","Gerencia de administración del riesgo","No","C76142022",93141808,"PRESTACION DE SERVICIOS DE PROMOCION Y PREVENCION – SERVICIOS_ESPECIALIZADOS_ZONA_ATLANTICO","1/01/2022",1,"30/11/2022",11.1,"Invitación directa","GastosAdministrativos",100000000,100000000,"No","N/A","Gerencia de Abastecimiento Estratégico\ncontratacion@positiva.gov.co\nPBX: (1)6502200 Ext: 10641","SI","SI","NO","SI","Pública clasificada","C76142022-Tipo de información Pública clasificada-PRESTACION DE SERVICIOS DE PROMOCION Y PREVENCION – SERVICIOS_ESPECIALIZADOS_ZONA_ATLANTICO"]
["PyP","Gerencia de administración del riesgo","No","C76152022",93141808,"PRESTACION DE SERVICIOS DE PROMOCION Y PREVENCION – SERVICIOS_ESPECIALIZADOS_ZONA_ATLANTICO","1/01/2022",1,"30/11/2022",11.1,"Invitación directa","GastosAdministrativos",103339036,103339036,"No","N/A","Gerencia de Abastecimiento Estratégico\ncontratacion@positiva.gov.co\nPBX: (1)6502200 Ext: 10641","SI","SI","NO","SI","Pública clasificada","C76152022-Tipo de información Pública clasificada-PRESTACION DE SERVICIOS DE PROMOCION Y PREVENCION – SERVICIOS_ESPECIALIZADOS_ZONA_ATLANTICO"]
["PyP","Gerencia de administración del riesgo","No","C76162022",93141808,"PRESTACION DE SERVICIOS DE PROMOCION Y PREVENCION – SERVICIOS_ESPECIALIZADOS_ZONA_ATLANTICO","1/01/2022",1,"30/11/2022",11.1,"Invitación directa","GastosAdministrativos",115000000,115000000,"No","N/A","Gerencia de Abastecimiento Estratégico\ncontratacion@positiva.gov.co\nPBX: (1)6502200 Ext: 10641","SI","SI","NO","SI","Pública clasificada","C76162022-Tipo de información Pública clasificada-PRESTACION DE SERVICIOS DE PROMOCION Y PREVENCION – SERVICIOS_ESPECIALIZADOS_ZONA_ATLANTICO"]
["PyP","Gerencia de administración del riesgo","No","C76172022",93141808,"PRESTACION DE SERVICIOS DE PROMOCION Y PREVENCION – SERVICIOS_ESPECIALIZADOS_ZONA_ATLANTICO","1/01/2022",1,"30/11/2022",11.1,"Invitación directa","GastosAdministrativos",40000000,40000000,"No","N/A","Gerencia de Abastecimiento Estratégico\ncontratacion@positiva.gov.co\nPBX: (1)6502200 Ext: 10641","SI","SI","NO","SI","Pública clasificada","C76172022-Tipo de información Pública clasificada-PRESTACION DE SERVICIOS DE PROMOCION Y PREVENCION – SERVICIOS_ESPECIALIZADOS_ZONA_ATLANTICO"]
["PyP","Gerencia de administración del riesgo","No","C76182022",93141808,"PRESTACION DE SERVICIOS DE PROMOCION Y PREVENCION – SERVICIOS_ESPECIALIZADOS_ZONA_ATLANTICO","1/01/2022",1,"30/11/2022",11.1,"Invitación directa","GastosAdministrativos",54544219,54544219,"No","N/A","Gerencia de Abastecimiento Estratégico\ncontratacion@positiva.gov.co\nPBX: (1)6502200 Ext: 10641","SI","SI","NO","SI","Pública clasificada","C76182022-Tipo de información Pública clasificada-PRESTACION DE SERVICIOS DE PROMOCION Y PREVENCION – SERVICIOS_ESPECIALIZADOS_ZONA_ATLANTICO"]
["PyP","Gerencia de administración del riesgo","No","C76192022",93141808,"PRESTACION DE SERVICIOS DE PROMOCION Y PREVENCION – SERVICIOS_ESPECIALIZADOS_ZONA_ATLANTICO","1/01/2022",1,"30/11/2022",11.1,"Invitación directa","GastosAdministrativos",220358306,220358306,"No","N/A","Gerencia de Abastecimiento Estratégico\ncontratacion@positiva.gov.co\nPBX: (1)6502200 Ext: 10641","SI","SI","NO","SI","Pública clasificada","C76192022-Tipo de información Pública clasificada-PRESTACION DE SERVICIOS DE PROMOCION Y PREVENCION – SERVICIOS_ESPECIALIZADOS_ZONA_ATLANTICO"]
["PyP","Gerencia de administración del riesgo","No","C76202022",93141808,"PRESTACION DE SERVICIOS DE PROMOCION Y PREVENCION – SERVICIOS_ESPECIALIZADOS_ZONA_ATLANTICO","1/01/2022",1,"30/11/2022",11.1,"Invitación directa","GastosAdministrativos",121302817,121302817,"No","N/A","Gerencia de Abastecimiento Estratégico\ncontratacion@positiva.gov.co\nPBX: (1)6502200 Ext: 10641","SI","SI","NO","SI","Pública clasificada","C76202022-Tipo de información Pública clasificada-PRESTACION DE SERVICIOS DE PROMOCION Y PREVENCION – SERVICIOS_ESPECIALIZADOS_ZONA_ATLANTICO"]
["PyP","Gerencia de administración del riesgo","No","C76212022",93141808,"PRESTACION DE SERVICIOS DE PROMOCION Y PREVENCION – SERVICIOS_ESPECIALIZADOS_ZONA_ATLANTICO","1/01/2022",1,"30/11/2022",11.1,"Invitación directa","GastosAdministrativos",181725352,181725352,"No","N/A","Gerencia de Abastecimiento Estratégico\ncontratacion@positiva.gov.co\nPBX: (1)6502200 Ext: 10641","SI","SI","NO","SI","Pública clasificada","C76212022-Tipo de información Pública clasificada-PRESTACION DE SERVICIOS DE PROMOCION Y PREVENCION – SERVICIOS_ESPECIALIZADOS_ZONA_ATLANTICO"]
["PyP","Gerencia de administración del riesgo","No","C76222022",93141808,"PRESTACION DE SERVICIOS DE PROMOCION Y PREVENCION – SERVICIOS_ESPECIALIZADOS_ZONA_ATLANTICO","1/01/2022",1,"30/11/2022",11.1,"Invitación directa","GastosAdministrativos",156679181,156679181,"No","N/A","Gerencia de Abastecimiento Estratégico\ncontratacion@positiva.gov.co\nPBX: (1)6502200 Ext: 10641","SI","SI","NO","SI","Pública clasificada","C76222022-Tipo de información Pública clasificada-PRESTACION DE SERVICIOS DE PROMOCION Y PREVENCION – SERVICIOS_ESPECIALIZADOS_ZONA_ATLANTICO"]
["PyP","Gerencia de administración del riesgo","No","C76232022",93141808,"PRESTACION DE SERVICIOS DE PROMOCION Y PREVENCION – SERVICIOS_ESPECIALIZADOS_ZONA_ATLANTICO","1/01/2022",1,"30/11/2022",11.1,"Invitación directa","GastosAdministrativos",11000000,11000000,"No","N/A","Gerencia de Abastecimiento Estratégico\ncontratacion@positiva.gov.co\nPBX: (1)6502200 Ext: 10641","SI","SI","NO","SI","Pública clasificada","C76232022-Tipo de información Pública clasificada-PRESTACION DE SERVICIOS DE PROMOCION Y PREVENCION – SERVICIOS_ESPECIALIZADOS_ZONA_ATLANTICO"]
["PyP","Gerencia de administración del riesgo","No","C76242022",93141808,"PRESTACION DE SERVICIOS DE PROMOCION Y PREVENCION – SERVICIOS_ESPECIALIZADOS_ZONA_ATLANTICO","1/01/2022",1,"30/11/2022",11.1,"Invitación directa","GastosAdministrativos",76769039,76769039,"No","N/A","Gerencia de Abastecimiento Estratégico\ncontratacion@positiva.gov.co\nPBX: (1)6502200 Ext: 10641","SI","SI","NO","SI","Pública clasificada","C76242022-Tipo de información Pública clasificada-PRESTACION DE SERVICIOS DE PROMOCION Y PREVENCION – SERVICIOS_ESPECIALIZADOS_ZONA_ATLANTICO"]
["PyP","Gerencia de administración del riesgo","No","C76252022",93141808,"PRESTACION DE SERVICIOS DE PROMOCION Y PREVENCION – SERVICIOS_ESPECIALIZADOS_ZONA_ATLANTICO","1/01/2022",1,"30/11/2022",11.1,"Invitación directa","GastosAdministrativos",1417564738,1417564738,"No","N/A","Gerencia de Abastecimiento Estratégico\ncontratacion@positiva.gov.co\nPBX: (1)6502200 Ext: 10641","SI","SI","NO","SI","Pública clasificada","C76252022-Tipo de información Pública clasificada-PRESTACION DE SERVICIOS DE PROMOCION Y PREVENCION – SERVICIOS_ESPECIALIZADOS_ZONA_ATLANTICO"]
["PyP","Gerencia de administración del riesgo","No","C76262022",93141808,"PRESTACION DE SERVICIOS DE PROMOCION Y PREVENCION – SERVICIOS_ESPECIALIZADOS_ZONA_ATLANTICO","1/01/2022",1,"30/11/2022",11.1,"Invitación directa","GastosAdministrativos",131291688,131291688,"No","N/A","Gerencia de Abastecimiento Estratégico\ncontratacion@positiva.gov.co\nPBX: (1)6502200 Ext: 10641","SI","SI","NO","SI","Pública clasificada","C76262022-Tipo de información Pública clasificada-PRESTACION DE SERVICIOS DE PROMOCION Y PREVENCION – SERVICIOS_ESPECIALIZADOS_ZONA_ATLANTICO"]
["PyP","Gerencia de administración del riesgo","No","C76272022",93141808,"PRESTACION DE SERVICIOS DE PROMOCION Y PREVENCION – SERVICIOS_ESPECIALIZADOS_ZONA_ATLANTICO","1/01/2022",1,"30/11/2022",11.1,"Invitación directa","GastosAdministrativos",16791649,16791649,"No","N/A","Gerencia de Abastecimiento Estratégico\ncontratacion@positiva.gov.co\nPBX: (1)6502200 Ext: 10641","SI","SI","NO","SI","Pública clasificada","C76272022-Tipo de información Pública clasificada-PRESTACION DE SERVICIOS DE PROMOCION Y PREVENCION – SERVICIOS_ESPECIALIZADOS_ZONA_ATLANTICO"]
["PyP","Gerencia de administración del riesgo","No","C76282022",93141808,"PRESTACION DE SERVICIOS DE PROMOCION Y PREVENCION – SERVICIOS_ESPECIALIZADOS_ZONA_ATLANTICO","1/01/2022",1,"30/11/2022",11.1,"Invitación directa","GastosAdministrativos",309497143,309497143,"No","N/A","Gerencia de Abastecimiento Estratégico\ncontratacion@positiva.gov.co\nPBX: (1)6502200 Ext: 10641","SI","SI","NO","SI","Pública clasificada","C76282022-Tipo de información Pública clasificada-PRESTACION DE SERVICIOS DE PROMOCION Y PREVENCION – SERVICIOS_ESPECIALIZADOS_ZONA_ATLANTICO"]
["PyP","Gerencia de administración del riesgo","No","C76292022",93141808,"PRESTACION DE SERVICIOS DE PROMOCION Y PREVENCION – SERVICIOS_ESPECIALIZADOS_ZONA_ATLANTICO","1/01/2022",1,"30/11/2022",11.1,"Invitación directa","GastosAdministrativos",32258400,32258400,"No","N/A","Gerencia de Abastecimiento Estratégico\ncontratacion@positiva.gov.co\nPBX: (1)6502200 Ext: 10641","SI","SI","NO","SI","Pública clasificada","C76292022-Tipo de información Pública clasificada-PRESTACION DE SERVICIOS DE PROMOCION Y PREVENCION – SERVICIOS_ESPECIALIZADOS_ZONA_ATLANTICO"]
["PyP","Gerencia de administración del riesgo","No","C76302022",93141808,"PRESTACION DE SERVICIOS DE PROMOCION Y PREVENCION – SERVICIOS_ESPECIALIZADOS_ZONA_ATLANTICO","1/01/2022",1,"30/11/2022",11.1,"Invitación directa","GastosAdministrativos",69665466,69665466,"No","N/A","Gerencia de Abastecimiento Estratégico\ncontratacion@positiva.gov.co\nPBX: (1)6502200 Ext: 10641","SI","SI","NO","SI","Pública clasificada","C76302022-Tipo de información Pública clasificada-PRESTACION DE SERVICIOS DE PROMOCION Y PREVENCION – SERVICIOS_ESPECIALIZADOS_ZONA_ATLANTICO"]
["PyP","Gerencia de administración del riesgo","No","C76312022",93141808,"PRESTACION DE SERVICIOS DE PROMOCION Y PREVENCION – SERVICIOS_ESPECIALIZADOS_ZONA_ATLANTICO","1/01/2022",1,"30/11/2022",11.1,"Invitación directa","GastosAdministrativos",118715998,118715998,"No","N/A","Gerencia de Abastecimiento Estratégico\ncontratacion@positiva.gov.co\nPBX: (1)6502200 Ext: 10641","SI","SI","NO","SI","Pública clasificada","C76312022-Tipo de información Pública clasificada-PRESTACION DE SERVICIOS DE PROMOCION Y PREVENCION – SERVICIOS_ESPECIALIZADOS_ZONA_ATLANTICO"]
["PyP","Gerencia de administración del riesgo","No","C77012022",93141808,"PRESTACION DE SERVICIOS DE PROMOCION Y PREVENCION – SERVICIOS_ESPECIALIZADOS_ZONA_BOGOTA","1/01/2022",1,"30/11/2022",11.1,"Invitación directa","GastosAdministrativos",183827812,183827812,"No","N/A","Gerencia de Abastecimiento Estratégico\ncontratacion@positiva.gov.co\nPBX: (1)6502200 Ext: 10641","SI","SI","NO","SI","Pública clasificada","C77012022-Tipo de información Pública clasificada-PRESTACION DE SERVICIOS DE PROMOCION Y PREVENCION – SERVICIOS_ESPECIALIZADOS_ZONA_BOGOTA"]
["PyP","Gerencia de administración del riesgo","No","C77022022",93141808,"PRESTACION DE SERVICIOS DE PROMOCION Y PREVENCION – SERVICIOS_ESPECIALIZADOS_ZONA_BOGOTA","1/01/2022",1,"30/11/2022",11.1,"Invitación directa","GastosAdministrativos",15000000,15000000,"No","N/A","Gerencia de Abastecimiento Estratégico\ncontratacion@positiva.gov.co\nPBX: (1)6502200 Ext: 10641","SI","SI","NO","SI","Pública clasificada","C77022022-Tipo de información Pública clasificada-PRESTACION DE SERVICIOS DE PROMOCION Y PREVENCION – SERVICIOS_ESPECIALIZADOS_ZONA_BOGOTA"]
["PyP","Gerencia de administración del riesgo","No","C77032022",93141808,"PRESTACION DE SERVICIOS DE PROMOCION Y PREVENCION – SERVICIOS_ESPECIALIZADOS_ZONA_BOGOTA","1/01/2022",1,"30/11/2022",11.1,"Invitación directa","GastosAdministrativos",70000000,70000000,"No","N/A","Gerencia de Abastecimiento Estratégico\ncontratacion@positiva.gov.co\nPBX: (1)6502200 Ext: 10641","SI","SI","NO","SI","Pública clasificada","C77032022-Tipo de información Pública clasificada-PRESTACION DE SERVICIOS DE PROMOCION Y PREVENCION – SERVICIOS_ESPECIALIZADOS_ZONA_BOGOTA"]
["PyP","Gerencia de administración del riesgo","No","C81012022",93141808,"PRESTACION DE SERVICIOS DE PROMOCION Y PREVENCION – SERVICIOS_ESPECIALIZADOS_CUENTA_RAMA","1/01/2022",1,"30/11/2022",11.1,"Invitación directa","GastosAdministrativos",109678560,109678560,"No","N/A","Gerencia de Abastecimiento Estratégico\ncontratacion@positiva.gov.co\nPBX: (1)6502200 Ext: 10641","SI","SI","NO","SI","Pública clasificada","C81012022-Tipo de información Pública clasificada-PRESTACION DE SERVICIOS DE PROMOCION Y PREVENCION – SERVICIOS_ESPECIALIZADOS_CUENTA_RAMA"]
["PyP","Gerencia de administración del riesgo","No","C81022022",93141808,"PRESTACION DE SERVICIOS DE PROMOCION Y PREVENCION – SERVICIOS_ESPECIALIZADOS_CUENTA_RAMA","1/01/2022",1,"30/11/2022",11.1,"Invitación directa","GastosAdministrativos",260766485,260766485,"No","N/A","Gerencia de Abastecimiento Estratégico\ncontratacion@positiva.gov.co\nPBX: (1)6502200 Ext: 10641","SI","SI","NO","SI","Pública clasificada","C81022022-Tipo de información Pública clasificada-PRESTACION DE SERVICIOS DE PROMOCION Y PREVENCION – SERVICIOS_ESPECIALIZADOS_CUENTA_RAMA"]
["PyP","Gerencia de administración del riesgo","No","C81032022",93141808,"PRESTACION DE SERVICIOS DE PROMOCION Y PREVENCION – SERVICIOS_ESPECIALIZADOS_CUENTA_RAMA","1/01/2022",1,"30/11/2022",11.1,"Invitación directa","GastosAdministrativos",343750000,343750000,"No","N/A","Gerencia de Abastecimiento Estratégico\ncontratacion@positiva.gov.co\nPBX: (1)6502200 Ext: 10641","SI","SI","NO","SI","Pública clasificada","C81032022-Tipo de información Pública clasificada-PRESTACION DE SERVICIOS DE PROMOCION Y PREVENCION – SERVICIOS_ESPECIALIZADOS_CUENTA_RAMA"]
["PyP","Gerencia de administración del riesgo","No","C79012022",93141808,"PRESTACION DE SERVICIOS DE PROMOCION Y PREVENCION – SERVICIOS_ESPECIALIZADOS_ZONA_SANTANDER","1/01/2022",1,"30/11/2022",11.1,"Invitación directa","GastosAdministrativos",150000000,150000000,"No","N/A","Gerencia de Abastecimiento Estratégico\ncontratacion@positiva.gov.co\nPBX: (1)6502200 Ext: 10641","SI","SI","NO","SI","Pública clasificada","C79012022-Tipo de información Pública clasificada-PRESTACION DE SERVICIOS DE PROMOCION Y PREVENCION – SERVICIOS_ESPECIALIZADOS_ZONA_SANTANDER"]
["PyP","Gerencia de administración del riesgo","No","C79022022",93141808,"PRESTACION DE SERVICIOS DE PROMOCION Y PREVENCION – SERVICIOS_ESPECIALIZADOS_ZONA_SANTANDER","1/01/2022",1,"30/11/2022",11.1,"Invitación directa","GastosAdministrativos",220000000,220000000,"No","N/A","Gerencia de Abastecimiento Estratégico\ncontratacion@positiva.gov.co\nPBX: (1)6502200 Ext: 10641","SI","SI","NO","SI","Pública clasificada","C79022022-Tipo de información Pública clasificada-PRESTACION DE SERVICIOS DE PROMOCION Y PREVENCION – SERVICIOS_ESPECIALIZADOS_ZONA_SANTANDER"]
["PyP","Gerencia de administración del riesgo","No","C79032022",93141808,"PRESTACION DE SERVICIOS DE PROMOCION Y PREVENCION – SERVICIOS_ESPECIALIZADOS_ZONA_SANTANDER","1/01/2022",1,"30/11/2022",11.1,"Invitación directa","GastosAdministrativos",60000000,60000000,"No","N/A","Gerencia de Abastecimiento Estratégico\ncontratacion@positiva.gov.co\nPBX: (1)6502200 Ext: 10641","SI","SI","NO","SI","Pública clasificada","C79032022-Tipo de información Pública clasificada-PRESTACION DE SERVICIOS DE PROMOCION Y PREVENCION – SERVICIOS_ESPECIALIZADOS_ZONA_SANTANDER"]
["PyP","Gerencia de administración del riesgo","No","C79042022",93141808,"PRESTACION DE SERVICIOS DE PROMOCION Y PREVENCION – SERVICIOS_ESPECIALIZADOS_ZONA_SANTANDER","1/01/2022",1,"30/11/2022",11.1,"Invitación directa","GastosAdministrativos",220000000,220000000,"No","N/A","Gerencia de Abastecimiento Estratégico\ncontratacion@positiva.gov.co\nPBX: (1)6502200 Ext: 10641","SI","SI","NO","SI","Pública clasificada","C79042022-Tipo de información Pública clasificada-PRESTACION DE SERVICIOS DE PROMOCION Y PREVENCION – SERVICIOS_ESPECIALIZADOS_ZONA_SANTANDER"]
["PyP","Gerencia de administración del riesgo","No","C79052022",93141808,"PRESTACION DE SERVICIOS DE PROMOCION Y PREVENCION – SERVICIOS_ESPECIALIZADOS_ZONA_SANTANDER","1/01/2022",1,"30/11/2022",11.1,"Invitación directa","GastosAdministrativos",85000000,85000000,"No","N/A","Gerencia de Abastecimiento Estratégico\ncontratacion@positiva.gov.co\nPBX: (1)6502200 Ext: 10641","SI","SI","NO","SI","Pública clasificada","C79052022-Tipo de información Pública clasificada-PRESTACION DE SERVICIOS DE PROMOCION Y PREVENCION – SERVICIOS_ESPECIALIZADOS_ZONA_SANTANDER"]
["PyP","Gerencia de administración del riesgo","No","C79062022",93141808,"PRESTACION DE SERVICIOS DE PROMOCION Y PREVENCION – SERVICIOS_ESPECIALIZADOS_ZONA_SANTANDER","1/01/2022",1,"30/11/2022",11.1,"Invitación directa","GastosAdministrativos",133462870,133462870,"No","N/A","Gerencia de Abastecimiento Estratégico\ncontratacion@positiva.gov.co\nPBX: (1)6502200 Ext: 10641","SI","SI","NO","SI","Pública clasificada","C79062022-Tipo de información Pública clasificada-PRESTACION DE SERVICIOS DE PROMOCION Y PREVENCION – SERVICIOS_ESPECIALIZADOS_ZONA_SANTANDER"]
["PyP","Gerencia de administración del riesgo","No","C79072022",93141808,"PRESTACION DE SERVICIOS DE PROMOCION Y PREVENCION – SERVICIOS_ESPECIALIZADOS_ZONA_SANTANDER","1/01/2022",1,"30/11/2022",11.1,"Invitación directa","GastosAdministrativos",90000000,90000000,"No","N/A","Gerencia de Abastecimiento Estratégico\ncontratacion@positiva.gov.co\nPBX: (1)6502200 Ext: 10641","SI","SI","NO","SI","Pública clasificada","C79072022-Tipo de información Pública clasificada-PRESTACION DE SERVICIOS DE PROMOCION Y PREVENCION – SERVICIOS_ESPECIALIZADOS_ZONA_SANTANDER"]
["PyP","Gerencia de administración del riesgo","No","C79082022",93141808,"PRESTACION DE SERVICIOS DE PROMOCION Y PREVENCION – SERVICIOS_ESPECIALIZADOS_ZONA_SANTANDER","1/01/2022",{"$f":"MONTH(G151)","v":1},"30/11/2022",11.1,"Invitación directa","GastosAdministrativos",150000000,150000000,"No","N/A","Gerencia de Abastecimiento Estratégico\ncontratacion@positiva.gov.co\nPBX: (1)6502200 Ext: 10641","SI","SI","NO","SI",{"$f":"IF(U151=\"SI\",\"Pública clasificada\",\"Pública\")","v":"Pública clasificada"},{"$f":"CONCATENATE(D151,\"-\",\"Tipo de información\",\" \",V151,\"-\",F151)","v":"C79082022-Tipo de información Pública clasificada-PRESTACION DE SERVICIOS DE PROMOCION Y PREVENCION – SERVICIOS_ESPECIALIZADOS_ZONA_SANTANDER"}]
["PyP","Gerencia de administración del riesgo","No","C79092022",93141808,"PRESTACION DE SERVICIOS DE PROMOCION Y PREVENCION – SERVICIOS_ESPECIALIZADOS_ZONA_SANTANDER","1/01/2022",1,"30/11/2022",11.1,"Invitación directa","GastosAdministrativos",35000000,35000000,"No","N/A","Gerencia de Abastecimiento Estratégico\ncontratacion@positiva.gov.co\nPBX: (1)6502200 Ext: 10641","SI","SI","NO","SI","Pública clasificada","C79092022-Tipo de información Pública clasificada-PRESTACION DE SERVICIOS DE PROMOCION Y PREVENCION – SERVICIOS_ESPECIALIZADOS_ZONA_SANTANDER"]
["PyP","Gerencia de administración del riesgo","No","C79102022",93141808,"PRESTACION DE SERVICIOS DE PROMOCION Y PREVENCION – SERVICIOS_ESPECIALIZADOS_ZONA_SANTANDER","1/01/2022",1,"30/11/2022",11.1,"Invitación directa","GastosAdministrativos",210722891,210722891,"No","N/A","Gerencia de Abastecimiento Estratégico\ncontratacion@positiva.gov.co\nPBX: (1)6502200 Ext: 10641","SI","SI","NO","SI","Pública clasificada","C79102022-Tipo de información Pública clasificada-PRESTACION DE SERVICIOS DE PROMOCION Y PREVENCION – SERVICIOS_ESPECIALIZADOS_ZONA_SANTANDER"]
["PyP","Gerencia de administración del riesgo","No","C79112022",93141808,"PRESTACION DE SERVICIOS DE PROMOCION Y PREVENCION – SERVICIOS_ESPECIALIZADOS_ZONA_SANTANDER","1/01/2022",1,"30/11/2022",11.1,"Invitación directa","GastosAdministrativos",100000000,100000000,"No","N/A","Gerencia de Abastecimiento Estratégico\ncontratacion@positiva.gov.co\nPBX: (1)6502200 Ext: 10641","SI","SI","NO","SI","Pública clasificada","C79112022-Tipo de información Pública clasificada-PRESTACION DE SERVICIOS DE PROMOCION Y PREVENCION – SERVICIOS_ESPECIALIZADOS_ZONA_SANTANDER"]
["PyP","Gerencia de administración del riesgo","No","C79122022",93141808,"PRESTACION DE SERVICIOS DE PROMOCION Y PREVENCION – SERVICIOS_ESPECIALIZADOS_ZONA_SANTANDER","1/01/2022",1,"30/11/2022",11.1,"Invitación directa","GastosAdministrativos",35000000,35000000,"No","N/A","Gerencia de Abastecimiento Estratégico\ncontratacion@positiva.gov.co\nPBX: (1)6502200 Ext: 10641","SI","SI","NO","SI","Pública clasificada","C79122022-Tipo de información Pública clasificada-PRESTACION DE SERVICIOS DE PROMOCION Y PREVENCION – SERVICIOS_ESPECIALIZADOS_ZONA_SANTANDER"]
["PyP","Gerencia de administración del riesgo","No","C79132022",93141808,"PRESTACION DE SERVICIOS DE PROMOCION Y PREVENCION – SERVICIOS_ESPECIALIZADOS_ZONA_SANTANDER","1/01/2022",1,"30/11/2022",11.1,"Invitación directa","GastosAdministrativos",184545296,184545296,"No","N/A","Gerencia de Abastecimiento Estratégico\ncontratacion@positiva.gov.co\nPBX: (1)6502200 Ext: 10641","SI","SI","NO","SI","Pública clasificada","C79132022-Tipo de información Pública clasificada-PRESTACION DE SERVICIOS DE PROMOCION Y PREVENCION – SERVICIOS_ESPECIALIZADOS_ZONA_SANTANDER"]
["PyP","Gerencia de administración del riesgo","No","C79142022",93141808,"PRESTACION DE SERVICIOS DE PROMOCION Y PREVENCION – SERVICIOS_ESPECIALIZADOS_ZONA_SANTANDER","1/01/2022",1,"30/11/2022",{"$f":"(I157-G157)/30","v":11.1},"Invitación directa","GastosAdministrativos",226000000,226000000,"No","N/A","Gerencia de Abastecimiento Estratégico\ncontratacion@positiva.gov.co\nPBX: (1)6502200 Ext: 10641","SI","SI","NO","SI","Pública clasificada","C79142022-Tipo de información Pública clasificada-PRESTACION DE SERVICIOS DE PROMOCION Y PREVENCION – SERVICIOS_ESPECIALIZADOS_ZONA_SANTANDER"]
["PyP","Gerencia de administración del riesgo","No","C79152022",93141808,"PRESTACION DE SERVICIOS DE PROMOCION Y PREVENCION – SERVICIOS_ESPECIALIZADOS_ZONA_SANTANDER","1/01/2022",1,"30/11/2022",11.1,"Invitación directa","GastosAdministrativos",50000000,50000000,"No","N/A","Gerencia de Abastecimiento Estratégico\ncontratacion@positiva.gov.co\nPBX: (1)6502200 Ext: 10641","SI","SI","NO","SI","Pública clasificada","C79152022-Tipo de información Pública clasificada-PRESTACION DE SERVICIOS DE PROMOCION Y PREVENCION – SERVICIOS_ESPECIALIZADOS_ZONA_SANTANDER"]
["PyP","Gerencia de administración del riesgo","No","C79162022",93141808,"PRESTACION DE SERVICIOS DE PROMOCION Y PREVENCION – SERVICIOS_ESPECIALIZADOS_ZONA_SANTANDER","1/01/2022",1,"30/11/2022",11.1,"Invitación directa","GastosAdministrativos",65000000,65000000,"No","N/A","Gerencia de Abastecimiento Estratégico\ncontratacion@positiva.gov.co\nPBX: (1)6502200 Ext: 10641","SI","SI","NO","SI","Pública clasificada","C79162022-Tipo de información Pública clasificada-PRESTACION DE SERVICIOS DE PROMOCION Y PREVENCION – SERVICIOS_ESPECIALIZADOS_ZONA_SANTANDER"]
["PyP","Gerencia de administración del riesgo","No","C79172022",93141808,"PRESTACION DE SERVICIOS DE PROMOCION Y PREVENCION – SERVICIOS_ESPECIALIZADOS_ZONA_SANTANDER","1/01/2022",1,"30/11/2022",11.1,"Invitación directa","GastosAdministrativos",100000000,100000000,"No","N/A","Gerencia de Abastecimiento Estratégico\ncontratacion@positiva.gov.co\nPBX: (1)6502200 Ext: 10641","SI","SI","NO","SI","Pública clasificada","C79172022-Tipo de información Pública clasificada-PRESTACION DE SERVICIOS DE PROMOCION Y PREVENCION – SERVICIOS_ESPECIALIZADOS_ZONA_SANTANDER"]
["PyP","Gerencia de administración del riesgo","No","C79182022",93141808,"PRESTACION DE SERVICIOS DE PROMOCION Y PREVENCION – SERVICIOS_ESPECIALIZADOS_ZONA_SANTANDER","1/01/2022",1,"30/11/2022",11.1,"Invitación directa","GastosAdministrativos",170000000,170000000,"No","N/A","Gerencia de Abastecimiento Estratégico\ncontratacion@positiva.gov.co\nPBX: (1)6502200 Ext: 10641","SI","SI","NO","SI","Pública clasificada","C79182022-Tipo de información Pública clasificada-PRESTACION DE SERVICIOS DE PROMOCION Y PREVENCION – SERVICIOS_ESPECIALIZADOS_ZONA_SANTANDER"]
["PyP","Gerencia de administración del riesgo","No","C79192022",93141808,"PRESTACION DE SERVICIOS DE PROMOCION Y PREVENCION – SERVICIOS_ESPECIALIZADOS_ZONA_SANTANDER","1/01/2022",1,"30/11/2022",11.1,"Invitación directa","GastosAdministrativos",176000000,176000000,"No","N/A","Gerencia de Abastecimiento Estratégico\ncontratacion@positiva.gov.co\nPBX: (1)6502200 Ext: 10641","SI","SI","NO","SI","Pública clasificada","C79192022-Tipo de información Pública clasificada-PRESTACION DE SERVICIOS DE PROMOCION Y PREVENCION – SERVICIOS_ESPECIALIZADOS_ZONA_SANTANDER"]
["PyP","Gerencia de administración del riesgo","No","C79202022",93141808,"PRESTACION DE SERVICIOS DE PROMOCION Y PREVENCION – SERVICIOS_ESPECIALIZADOS_ZONA_SANTANDER","1/01/2022",1,"30/11/2022",11.1,"Invitación directa","GastosAdministrativos",330000000,330000000,"No","N/A","Gerencia de Abastecimiento Estratégico\ncontratacion@positiva.gov.co\nPBX: (1)6502200 Ext: 10641","SI","SI","NO","SI","Pública clasificada","C79202022-Tipo de información Pública clasificada-PRESTACION DE SERVICIOS DE PROMOCION Y PREVENCION – SERVICIOS_ESPECIALIZADOS_ZONA_SANTANDER"]
["PyP","Gerencia de administración del riesgo","No","C79212022",93141808,"PRESTACION DE SERVICIOS DE PROMOCION Y PREVENCION – SERVICIOS_ESPECIALIZADOS_ZONA_SANTANDER","1/01/2022",1,"30/11/2022",11.1,"Invitación directa","GastosAdministrativos",65000000,65000000,"No","N/A","Gerencia de Abastecimiento Estratégico\ncontratacion@positiva.gov.co\nPBX: (1)6502200 Ext: 10641","SI","SI","NO","SI","Pública clasificada","C79212022-Tipo de información Pública clasificada-PRESTACION DE SERVICIOS DE PROMOCION Y PREVENCION – SERVICIOS_ESPECIALIZADOS_ZONA_SANTANDER"]
["PyP","Gerencia de administración del riesgo","No","C79222022",93141808,"PRESTACION DE SERVICIOS DE PROMOCION Y PREVENCION – SERVICIOS_ESPECIALIZADOS_ZONA_SANTANDER","1/01/2022",1,"30/11/2022",11.1,"Invitación directa","GastosAdministrativos",50470128,50470128,"No","N/A","Gerencia de Abastecimiento Estratégico\ncontratacion@positiva.gov.co\nPBX: (1)6502200 Ext: 10641","SI","SI","NO","SI","Pública clasificada","C79222022-Tipo de información Pública clasificada-PRESTACION DE SERVICIOS DE PROMOCION Y PREVENCION – SERVICIOS_ESPECIALIZADOS_ZONA_SANTANDER"]
["PyP","Gerencia de administración del riesgo","No","C79232022",93141808,"PRESTACION DE SERVICIOS DE PROMOCION Y PREVENCION – SERVICIOS_ESPECIALIZADOS_ZONA_SANTANDER","1/01/2022",1,"30/11/2022",11.1,"Invitación directa","GastosAdministrativos",55000000,55000000,"No","N/A","Gerencia de Abastecimiento Estratégico\ncontratacion@positiva.gov.co\nPBX: (1)6502200 Ext: 10641","SI","SI","NO","SI","Pública clasificada","C79232022-Tipo de información Pública clasificada-PRESTACION DE SERVICIOS DE PROMOCION Y PREVENCION – SERVICIOS_ESPECIALIZADOS_ZONA_SANTANDER"]
["PyP","Gerencia de administración del riesgo","No","C80012022",93141808,"PRESTACION DE SERVICIOS DE PROMOCION Y PREVENCION – SERVICIOS_ESPECIALIZADOS_ZONA_VALLE","1/01/2022",1,"30/11/2022",11.1,"Invitación directa","GastosAdministrativos",160714286,160714286,"No","N/A","Gerencia de Abastecimiento Estratégico\ncontratacion@positiva.gov.co\nPBX: (1)6502200 Ext: 10641","SI","SI","NO","SI","Pública clasificada","C80012022-Tipo de información Pública clasificada-PRESTACION DE SERVICIOS DE PROMOCION Y PREVENCION – SERVICIOS_ESPECIALIZADOS_ZONA_VALLE"]
["PyP","Gerencia de administración del riesgo","No","C80022022",93141808,"PRESTACION DE SERVICIOS DE PROMOCION Y PREVENCION – SERVICIOS_ESPECIALIZADOS_ZONA_VALLE","1/01/2022",1,"30/11/2022",11.1,"Invitación directa","GastosAdministrativos",56701031,56701031,"No","N/A","Gerencia de Abastecimiento Estratégico\ncontratacion@positiva.gov.co\nPBX: (1)6502200 Ext: 10641","SI","SI","NO","SI","Pública clasificada","C80022022-Tipo de información Pública clasificada-PRESTACION DE SERVICIOS DE PROMOCION Y PREVENCION – SERVICIOS_ESPECIALIZADOS_ZONA_VALLE"]
["PyP","Gerencia de administración del riesgo","No","C80032022",93141808,"PRESTACION DE SERVICIOS DE PROMOCION Y PREVENCION – SERVICIOS_ESPECIALIZADOS_ZONA_VALLE","1/01/2022",1,"30/11/2022",11.1,"Invitación directa","GastosAdministrativos",105201342,105201342,"No","N/A","Gerencia de Abastecimiento Estratégico\ncontratacion@positiva.gov.co\nPBX: (1)6502200 Ext: 10641","SI","SI","NO","SI","Pública clasificada","C80032022-Tipo de información Pública clasificada-PRESTACION DE SERVICIOS DE PROMOCION Y PREVENCION – SERVICIOS_ESPECIALIZADOS_ZONA_VALLE"]
["PyP","Gerencia de administración del riesgo","No","C80042022",93141808,"PRESTACION DE SERVICIOS DE PROMOCION Y PREVENCION – SERVICIOS_ESPECIALIZADOS_ZONA_VALLE","1/01/2022",1,"30/11/2022",11.1,"Invitación directa","GastosAdministrativos",174834437,174834437,"No","N/A","Gerencia de Abastecimiento Estratégico\ncontratacion@positiva.gov.co\nPBX: (1)6502200 Ext: 10641","SI","SI","NO","SI","Pública clasificada","C80042022-Tipo de información Pública clasificada-PRESTACION DE SERVICIOS DE PROMOCION Y PREVENCION – SERVICIOS_ESPECIALIZADOS_ZONA_VALLE"]
["PyP","Gerencia de administración del riesgo","No","C80052022",93141808,"PRESTACION DE SERVICIOS DE PROMOCION Y PREVENCION – SERVICIOS_ESPECIALIZADOS_ZONA_VALLE","1/01/2022",1,"30/11/2022",11.1,"Invitación directa","GastosAdministrativos",382108894,382108894,"No","N/A","Gerencia de Abastecimiento Estratégico\ncontratacion@positiva.gov.co\nPBX: (1)6502200 Ext: 10641","SI","SI","NO","SI","Pública clasificada","C80052022-Tipo de información Pública clasificada-PRESTACION DE SERVICIOS DE PROMOCION Y PREVENCION – SERVICIOS_ESPECIALIZADOS_ZONA_VALLE"]
["PyP","Gerencia de administración del riesgo","No","C80062022",93141808,"PRESTACION DE SERVICIOS DE PROMOCION Y PREVENCION – SERVICIOS_ESPECIALIZADOS_ZONA_VALLE","1/01/2022",1,"30/11/2022",11.1,"Invitación directa","GastosAdministrativos",889221557,889221557,"No","N/A","Gerencia de Abastecimiento Estratégico\ncontratacion@positiva.gov.co\nPBX: (1)6502200 Ext: 10641","SI","SI","NO","SI","Pública clasificada","C80062022-Tipo de información Pública clasificada-PRESTACION DE SERVICIOS DE PROMOCION Y PREVENCION – SERVICIOS_ESPECIALIZADOS_ZONA_VALLE"]
["PyP","Gerencia de administración del riesgo","No","C80072022",93141808,"PRESTACION DE SERVICIOS DE PROMOCION Y PREVENCION – SERVICIOS_ESPECIALIZADOS_ZONA_VALLE","1/01/2022",1,"30/11/2022",11.1,"Invitación directa","GastosAdministrativos",316530612,316530612,"No","N/A","Gerencia de Abastecimiento Estratégico\ncontratacion@positiva.gov.co\nPBX: (1)6502200 Ext: 10641","SI","SI","NO","SI","Pública clasificada","C80072022-Tipo de información Pública clasificada-PRESTACION DE SERVICIOS DE PROMOCION Y PREVENCION – SERVICIOS_ESPECIALIZADOS_ZONA_VALLE"]
["PyP","Gerencia de administración del riesgo","No","C80082022",93141808,"PRESTACION DE SERVICIOS DE PROMOCION Y PREVENCION – SERVICIOS_ESPECIALIZADOS_ZONA_VALLE","1/01/2022",1,"30/11/2022",11.1,"Invitación directa","GastosAdministrativos",200000000,200000000,"No","N/A","Gerencia de Abastecimiento Estratégico\ncontratacion@positiva.gov.co\nPBX: (1)6502200 Ext: 10641","SI","SI","NO","SI","Pública clasificada","C80082022-Tipo de información Pública clasificada-PRESTACION DE SERVICIOS DE PROMOCION Y PREVENCION – SERVICIOS_ESPECIALIZADOS_ZONA_VALLE"]
["PyP","Gerencia de administración del riesgo","No","C80092022",93141808,"PRESTACION DE SERVICIOS DE PROMOCION Y PREVENCION – SERVICIOS_ESPECIALIZADOS_ZONA_VALLE","1/01/2022",1,"30/11/2022",11.1,"Invitación directa","GastosAdministrativos",200000000,200000000,"No","N/A","Gerencia de Abastecimiento Estratégico\ncontratacion@positiva.gov.co\nPBX: (1)6502200 Ext: 10641","SI","SI","NO","SI","Pública clasificada","C80092022-Tipo de información Pública clasificada-PRESTACION DE SERVICIOS DE PROMOCION Y PREVENCION – SERVICIOS_ESPECIALIZADOS_ZONA_VALLE"]
["PyP","Gerencia de administración del riesgo","No","C80102022",93141808,"PRESTACION DE SERVICIOS DE PROMOCION Y PREVENCION – SERVICIOS_ESPECIALIZADOS_ZONA_VALLE","1/01/2022",1,"30/11/2022",11.1,"Invitación directa","GastosAdministrativos",60000000,60000000,"No","N/A","Gerencia de Abastecimiento Estratégico\ncontratacion@positiva.gov.co\nPBX: (1)6502200 Ext: 10641","SI","SI","NO","SI","Pública clasificada","C80102022-Tipo de información Pública clasificada-PRESTACION DE SERVICIOS DE PROMOCION Y PREVENCION – SERVICIOS_ESPECIALIZADOS_ZONA_VALLE"]
["PyP","Gerencia de administración del riesgo","No","C80112022",93141808,"PRESTACION DE SERVICIOS DE PROMOCION Y PREVENCION – SERVICIOS_ESPECIALIZADOS_ZONA_VALLE","1/01/2022",1,"30/11/2022",11.1,"Invitación directa","GastosAdministrativos",90000000,90000000,"No","N/A","Gerencia de Abastecimiento Estratégico\ncontratacion@positiva.gov.co\nPBX: (1)6502200 Ext: 10641","SI","SI","NO","SI","Pública clasificada","C80112022-Tipo de información Pública clasificada-PRESTACION DE SERVICIOS DE PROMOCION Y PREVENCION – SERVICIOS_ESPECIALIZADOS_ZONA_VALLE"]
["PyP","Gerencia de administración del riesgo","No","C80122022",93141808,"PRESTACION DE SERVICIOS DE PROMOCION Y PREVENCION – SERVICIOS_ESPECIALIZADOS_ZONA_VALLE","1/01/2022",1,"30/11/2022",11.1,"Invitación directa","GastosAdministrativos",75000000,75000000,"No","N/A","Gerencia de Abastecimiento Estratégico\ncontratacion@positiva.gov.co\nPBX: (1)6502200 Ext: 10641","SI","SI","NO","SI","Pública clasificada","C80122022-Tipo de información Pública clasificada-PRESTACION DE SERVICIOS DE PROMOCION Y PREVENCION – SERVICIOS_ESPECIALIZADOS_ZONA_VALLE"]
["PyP","Gerencia de administración del riesgo","No","C80132022",93141808,"PRESTACION DE SERVICIOS DE PROMOCION Y PREVENCION – SERVICIOS_ESPECIALIZADOS_ZONA_VALLE","1/01/2022",1,"30/11/2022",11.1,"Invitación directa","GastosAdministrativos",450000000,450000000,"No","N/A","Gerencia de Abastecimiento Estratégico\ncontratacion@positiva.gov.co\nPBX: (1)6502200 Ext: 10641","SI","SI","NO","SI","Pública clasificada","C80132022-Tipo de información Pública clasificada-PRESTACION DE SERVICIOS DE PROMOCION Y PREVENCION – SERVICIOS_ESPECIALIZADOS_ZONA_VALLE"]
["PyP","Gerencia de administración del riesgo","No","C80142022",93141808,"PRESTACION DE SERVICIOS DE PROMOCION Y PREVENCION – SERVICIOS_ESPECIALIZADOS_ZONA_VALLE","1/01/2022",1,"30/11/2022",11.1,"Invitación directa","GastosAdministrativos",60000000,60000000,"No","N/A","Gerencia de Abastecimiento Estratégico\ncontratacion@positiva.gov.co\nPBX: (1)6502200 Ext: 10641","SI","SI","NO","SI","Pública clasificada","C80142022-Tipo de información Pública clasificada-PRESTACION DE SERVICIOS DE PROMOCION Y PREVENCION – SERVICIOS_ESPECIALIZADOS_ZONA_VALLE"]
["PyP","Gerencia de administración del riesgo","No","C80152022",93141808,"PRESTACION DE SERVICIOS DE PROMOCION Y PREVENCION – SERVICIOS_ESPECIALIZADOS_ZONA_VALLE","1/01/2022",1,"30/11/2022",11.1,"Invitación directa","GastosAdministrativos",90000000,90000000,"No","N/A","Gerencia de Abastecimiento Estratégico\ncontratacion@positiva.gov.co\nPBX: (1)6502200 Ext: 10641","SI","SI","NO","SI","Pública clasificada","C80152022-Tipo de información Pública clasificada-PRESTACION DE SERVICIOS DE PROMOCION Y PREVENCION – SERVICIOS_ESPECIALIZADOS_ZONA_VALLE"]
["PyP","Gerencia de administración del riesgo","No","C80162022",93141808,"PRESTACION DE SERVICIOS DE PROMOCION Y PREVENCION – SERVICIOS_ESPECIALIZADOS_ZONA_VALLE","1/01/2022",1,"30/11/2022",11.1,"Invitación directa","GastosAdministrativos",416701769,416701769,"No","N/A","Gerencia de Abastecimiento Estratégico\ncontratacion@positiva.gov.co\nPBX: (1)6502200 Ext: 10641","SI","SI","NO","SI","Pública clasificada","C80162022-Tipo de información Pública clasificada-PRESTACION DE SERVICIOS DE PROMOCION Y PREVENCION – SERVICIOS_ESPECIALIZADOS_ZONA_VALLE"]
["PyP","Gerencia de administración del riesgo","No","C80172022",93141808,"PRESTACION DE SERVICIOS DE PROMOCION Y PREVENCION – SERVICIOS_ESPECIALIZADOS_ZONA_VALLE","1/01/2022",1,"30/11/2022",11.1,"Invitación directa","GastosAdministrativos",22000000,22000000,"No","N/A","Gerencia de Abastecimiento Estratégico\ncontratacion@positiva.gov.co\nPBX: (1)6502200 Ext: 10641","SI","SI","NO","SI","Pública clasificada","C80172022-Tipo de información Pública clasificada-PRESTACION DE SERVICIOS DE PROMOCION Y PREVENCION – SERVICIOS_ESPECIALIZADOS_ZONA_VALLE"]
["PyP","Gerencia de administración del riesgo","No","C80182022",93141808,"PRESTACION DE SERVICIOS DE PROMOCION Y PREVENCION – SERVICIOS_ESPECIALIZADOS_ZONA_VALLE","1/01/2022",1,"30/11/2022",11.1,"Invitación directa","GastosAdministrativos",572068711,572068711,"No","N/A","Gerencia de Abastecimiento Estratégico\ncontratacion@positiva.gov.co\nPBX: (1)6502200 Ext: 10641","SI","SI","NO","SI","Pública clasificada","C80182022-Tipo de información Pública clasificada-PRESTACION DE SERVICIOS DE PROMOCION Y PREVENCION – SERVICIOS_ESPECIALIZADOS_ZONA_VALLE"]
["PyP","Gerencia de administración del riesgo","No","C80192022",93141808,"PRESTACION DE SERVICIOS DE PROMOCION Y PREVENCION – SERVICIOS_ESPECIALIZADOS_ZONA_VALLE","1/01/2022",1,"30/11/2022",11.1,"Invitación directa","GastosAdministrativos",55000000,55000000,"No","N/A","Gerencia de Abastecimiento Estratégico\ncontratacion@positiva.gov.co\nPBX: (1)6502200 Ext: 10641","SI","SI","NO","SI","Pública clasificada","C80192022-Tipo de información Pública clasificada-PRESTACION DE SERVICIOS DE PROMOCION Y PREVENCION – SERVICIOS_ESPECIALIZADOS_ZONA_VALLE"]
["PyP","Gerencia de administración del riesgo","No","C80202022",93141808,"PRESTACION DE SERVICIOS DE PROMOCION Y PREVENCION – SERVICIOS_ESPECIALIZADOS_ZONA_VALLE","1/01/2022",1,"30/11/2022",11.1,"Invitación cerrada","GastosAdministrativos",450000000,450000000,"No","N/A","Gerencia de Abastecimiento Estratégico\ncontratacion@positiva.gov.co\nPBX: (1)6502200 Ext: 10641","SI","SI","NO","SI","Pública clasificada","C80202022-Tipo de información Pública clasificada-PRESTACION DE SERVICIOS DE PROMOCION Y PREVENCION – SERVICIOS_ESPECIALIZADOS_ZONA_VALLE"]
["PyP","Gerencia de administración del riesgo","No","C80212022",93141808,"PRESTACION DE SERVICIOS DE PROMOCION Y PREVENCION – SERVICIOS_ESPECIALIZADOS_ZONA_VALLE","1/01/2022",1,"30/11/2022",11.1,"Invitación directa","GastosAdministrativos",200000000,200000000,"No","N/A","Gerencia de Abastecimiento Estratégico\ncontratacion@positiva.gov.co\nPBX: (1)6502200 Ext: 10641","SI","SI","NO","SI","Pública clasificada","C80212022-Tipo de información Pública clasificada-PRESTACION DE SERVICIOS DE PROMOCION Y PREVENCION – SERVICIOS_ESPECIALIZADOS_ZONA_VALLE"]
["PyP","Gerencia de administración del riesgo","No","C80222022",93141808,"PRESTACION DE SERVICIOS DE PROMOCION Y PREVENCION – SERVICIOS_ESPECIALIZADOS_ZONA_VALLE","1/01/2022",1,"30/11/2022",11.1,"Invitación directa","GastosAdministrativos",100000000,100000000,"No","N/A","Gerencia de Abastecimiento Estratégico\ncontratacion@positiva.gov.co\nPBX: (1)6502200 Ext: 10641","SI","SI","NO","SI","Pública clasificada","C80222022-Tipo de información Pública clasificada-PRESTACION DE SERVICIOS DE PROMOCION Y PREVENCION – SERVICIOS_ESPECIALIZADOS_ZONA_VALLE"]
["PyP","Gerencia de administración del riesgo","No","C80232022",93141808,"PRESTACION DE SERVICIOS DE PROMOCION Y PREVENCION – SERVICIOS_ESPECIALIZADOS_ZONA_VALLE","1/01/2022",1,"30/11/2022",11.1,"Invitación directa","GastosAdministrativos",27000000,27000000,"No","N/A","Gerencia de Abastecimiento Estratégico\ncontratacion@positiva.gov.co\nPBX: (1)6502200 Ext: 10641","SI","SI","NO","SI","Pública clasificada","C80232022-Tipo de información Pública clasificada-PRESTACION DE SERVICIOS DE PROMOCION Y PREVENCION – SERVICIOS_ESPECIALIZADOS_ZONA_VALLE"]
["PyP","Gerencia de administración del riesgo","No","C80242022",93141808,"PRESTACION DE SERVICIOS DE PROMOCION Y PREVENCION – SERVICIOS_ESPECIALIZADOS_ZONA_VALLE","1/01/2022",1,"30/11/2022",11.1,"Invitación directa","GastosAdministrativos",138914237,138914237,"No","N/A","Gerencia de Abastecimiento Estratégico\ncontratacion@positiva.gov.co\nPBX: (1)6502200 Ext: 10641","SI","SI","NO","SI","Pública clasificada","C80242022-Tipo de información Pública clasificada-PRESTACION DE SERVICIOS DE PROMOCION Y PREVENCION – SERVICIOS_ESPECIALIZADOS_ZONA_VALLE"]
["PyP","Gerencia de administración del riesgo","No","C80252022",93141808,"PRESTACION DE SERVICIOS DE PROMOCION Y PREVENCION – SERVICIOS_ESPECIALIZADOS_ZONA_VALLE","1/01/2022",1,"30/11/2022",11.1,"Invitación directa","GastosAdministrativos",199450549,199450549,"No","N/A","Gerencia de Abastecimiento Estratégico\ncontratacion@positiva.gov.co\nPBX: (1)6502200 Ext: 10641","SI","SI","NO","SI","Pública clasificada","C80252022-Tipo de información Pública clasificada-PRESTACION DE SERVICIOS DE PROMOCION Y PREVENCION – SERVICIOS_ESPECIALIZADOS_ZONA_VALLE"]
["PyP","Gerencia de administración del riesgo","No","C80262022",93141808,"PRESTACION DE SERVICIOS DE PROMOCION Y PREVENCION – SERVICIOS_ESPECIALIZADOS_ZONA_VALLE","1/01/2022",1,"30/11/2022",11.1,"Invitación directa","GastosAdministrativos",127729791,127729791,"No","N/A","Gerencia de Abastecimiento Estratégico\ncontratacion@positiva.gov.co\nPBX: (1)6502200 Ext: 10641","SI","SI","NO","SI","Pública clasificada","C80262022-Tipo de información Pública clasificada-PRESTACION DE SERVICIOS DE PROMOCION Y PREVENCION – SERVICIOS_ESPECIALIZADOS_ZONA_VALLE"]
["PyP","Gerencia de administración del riesgo","No","C76322022",93141808,"PRESTACION DE SERVICIOS DE PROMOCION Y PREVENCION – SERVICIOS_ESPECIALIZADOS_ZONA_ATLANTICO","1/01/2022",1,"30/11/2022",11.1,"Invitación directa","GastosAdministrativos",34946600,34946600,"No","N/A","Gerencia de Abastecimiento Estratégico\ncontratacion@positiva.gov.co\nPBX: (1)6502200 Ext: 10641","SI","SI","NO","SI","Pública clasificada","C76322022-Tipo de información Pública clasificada-PRESTACION DE SERVICIOS DE PROMOCION Y PREVENCION – SERVICIOS_ESPECIALIZADOS_ZONA_ATLANTICO"]
["PyP","Gerencia de administración del riesgo","No","C77042022",93141808,"PRESTACION DE SERVICIOS DE PROMOCION Y PREVENCION – SERVICIOS_ESPECIALIZADOS_ZONA_BOGOTA","1/01/2022",1,"30/11/2022",11.1,"Invitación directa","GastosAdministrativos",1200000000,1200000000,"No","N/A","Gerencia de Abastecimiento Estratégico\ncontratacion@positiva.gov.co\nPBX: (1)6502200 Ext: 10641","SI","SI","NO","SI","Pública clasificada","C77042022-Tipo de información Pública clasificada-PRESTACION DE SERVICIOS DE PROMOCION Y PREVENCION – SERVICIOS_ESPECIALIZADOS_ZONA_BOGOTA"]
["PyP","Gerencia de administración del riesgo","No","C77052022",93141808,"PRESTACION DE SERVICIOS DE PROMOCION Y PREVENCION – SERVICIOS_ESPECIALIZADOS_ZONA_BOGOTA","1/01/2022",1,"30/11/2022",11.1,"Invitación directa","GastosAdministrativos",175220196,175220196,"No","N/A","Gerencia de Abastecimiento Estratégico\ncontratacion@positiva.gov.co\nPBX: (1)6502200 Ext: 10641","SI","SI","NO","SI","Pública clasificada","C77052022-Tipo de información Pública clasificada-PRESTACION DE SERVICIOS DE PROMOCION Y PREVENCION – SERVICIOS_ESPECIALIZADOS_ZONA_BOGOTA"]
["PyP","Gerencia de administración del riesgo","No","C77062022",93141808,"PRESTACION DE SERVICIOS DE PROMOCION Y PREVENCION – SERVICIOS_ESPECIALIZADOS_ZONA_BOGOTA","1/01/2022",1,"30/11/2022",11.1,"Invitación directa","GastosAdministrativos",300000000,300000000,"No","N/A","Gerencia de Abastecimiento Estratégico\ncontratacion@positiva.gov.co\nPBX: (1)6502200 Ext: 10641","SI","SI","NO","SI","Pública clasificada","C77062022-Tipo de información Pública clasificada-PRESTACION DE SERVICIOS DE PROMOCION Y PREVENCION – SERVICIOS_ESPECIALIZADOS_ZONA_BOGOTA"]
["PyP","Gerencia de administración del riesgo","No","C77072022",93141808,"PRESTACION DE SERVICIOS DE PROMOCION Y PREVENCION – SERVICIOS_ESPECIALIZADOS_ZONA_BOGOTA","1/01/2022",1,"30/11/2022",11.1,"Invitación directa","GastosAdministrativos",300000000,300000000,"No","N/A","Gerencia de Abastecimiento Estratégico\ncontratacion@positiva.gov.co\nPBX: (1)6502200 Ext: 10641","SI","SI","NO","SI","Pública clasificada","C77072022-Tipo de información Pública clasificada-PRESTACION DE SERVICIOS DE PROMOCION Y PREVENCION – SERVICIOS_ESPECIALIZADOS_ZONA_BOGOTA"]
["PyP","Gerencia de administración del riesgo","No","C77082022",93141808,"PRESTACION DE SERVICIOS DE PROMOCION Y PREVENCION – SERVICIOS_ESPECIALIZADOS_ZONA_BOGOTA","1/01/2022",1,"30/11/2022",11.1,"Invitación directa","GastosAdministrativos",130000000,130000000,"No","N/A","Gerencia de Abastecimiento Estratégico\ncontratacion@positiva.gov.co\nPBX: (1)6502200 Ext: 10641","SI","SI","NO","SI","Pública clasificada","C77082022-Tipo de información Pública clasificada-PRESTACION DE SERVICIOS DE PROMOCION Y PREVENCION – SERVICIOS_ESPECIALIZADOS_ZONA_BOGOTA"]
["PyP","Gerencia de administración del riesgo","No","C77092022",93141808,"PRESTACION DE SERVICIOS DE PROMOCION Y PREVENCION – SERVICIOS_ESPECIALIZADOS_ZONA_BOGOTA","1/01/2022",1,"30/11/2022",11.1,"Invitación directa","GastosAdministrativos",60000000,60000000,"No","N/A","Gerencia de Abastecimiento Estratégico\ncontratacion@positiva.gov.co\nPBX: (1)6502200 Ext: 10641","SI","SI","NO","SI","Pública clasificada","C77092022-Tipo de información Pública clasificada-PRESTACION DE SERVICIOS DE PROMOCION Y PREVENCION – SERVICIOS_ESPECIALIZADOS_ZONA_BOGOTA"]
["PyP","Gerencia de administración del riesgo","No","C77102022",93141808,"PRESTACION DE SERVICIOS DE PROMOCION Y PREVENCION – SERVICIOS_ESPECIALIZADOS_ZONA_BOGOTA","1/01/2022",1,"30/11/2022",11.1,"Invitación directa","GastosAdministrativos",70000000,70000000,"No","N/A","Gerencia de Abastecimiento Estratégico\ncontratacion@positiva.gov.co\nPBX: (1)6502200 Ext: 10641","SI","SI","NO","SI","Pública clasificada","C77102022-Tipo de información Pública clasificada-PRESTACION DE SERVICIOS DE PROMOCION Y PREVENCION – SERVICIOS_ESPECIALIZADOS_ZONA_BOGOTA"]
["PyP","Gerencia de administración del riesgo","No","C77112022",93141808,"PRESTACION DE SERVICIOS DE PROMOCION Y PREVENCION – SERVICIOS_ESPECIALIZADOS_ZONA_BOGOTA","1/01/2022",1,"30/11/2022",11.1,"Invitación directa","GastosAdministrativos",700000000,700000000,"No","N/A","Gerencia de Abastecimiento Estratégico\ncontratacion@positiva.gov.co\nPBX: (1)6502200 Ext: 10641","SI","SI","NO","SI","Pública clasificada","C77112022-Tipo de información Pública clasificada-PRESTACION DE SERVICIOS DE PROMOCION Y PREVENCION – SERVICIOS_ESPECIALIZADOS_ZONA_BOGOTA"]
["PyP","Gerencia de administración del riesgo","No","C79242022",93141808,"PRESTACION DE SERVICIOS DE PROMOCION Y PREVENCION – SERVICIOS_ESPECIALIZADOS_ZONA_SANTANDER","1/01/2022",1,"30/11/2022",11.1,"Invitación directa","GastosAdministrativos",61256250,61256250,"No","N/A","Gerencia de Abastecimiento Estratégico\ncontratacion@positiva.gov.co\nPBX: (1)6502200 Ext: 10641","SI","SI","NO","SI","Pública clasificada","C79242022-Tipo de información Pública clasificada-PRESTACION DE SERVICIOS DE PROMOCION Y PREVENCION – SERVICIOS_ESPECIALIZADOS_ZONA_SANTANDER"]
["PyP","Gerencia de administración del riesgo","No","C79252022",93141808,"PRESTACION DE SERVICIOS DE PROMOCION Y PREVENCION – SERVICIOS_ESPECIALIZADOS_ZONA_SANTANDER","1/01/2022",1,"30/11/2022",11.1,"Invitación directa","GastosAdministrativos",63845928,63845928,"No","N/A","Gerencia de Abastecimiento Estratégico\ncontratacion@positiva.gov.co\nPBX: (1)6502200 Ext: 10641","SI","SI","NO","SI","Pública clasificada","C79252022-Tipo de información Pública clasificada-PRESTACION DE SERVICIOS DE PROMOCION Y PREVENCION – SERVICIOS_ESPECIALIZADOS_ZONA_SANTANDER"]
["PyP","Gerencia de administración del riesgo","No","C79262022",93141808,"PRESTACION DE SERVICIOS DE PROMOCION Y PREVENCION – SERVICIOS_ESPECIALIZADOS_ZONA_SANTANDER","1/01/2022",1,"30/11/2022",11.1,"Invitación directa","GastosAdministrativos",14895833,14895833,"No","N/A","Gerencia de Abastecimiento Estratégico\ncontratacion@positiva.gov.co\nPBX: (1)6502200 Ext: 10641","SI","SI","NO","SI","Pública clasificada","C79262022-Tipo de información Pública clasificada-PRESTACION DE SERVICIOS DE PROMOCION Y PREVENCION – SERVICIOS_ESPECIALIZADOS_ZONA_SANTANDER"]
["PyP","Gerencia de administración del riesgo","No","C79272022",93141808,"PRESTACION DE SERVICIOS DE PROMOCION Y PREVENCION – SERVICIOS_ESPECIALIZADOS_ZONA_SANTANDER","1/01/2022",1,"30/11/2022",11.1,"Invitación directa","GastosAdministrativos",79113439,79113439,"No","N/A","Gerencia de Abastecimiento Estratégico\ncontratacion@positiva.gov.co\nPBX: (1)6502200 Ext: 10641","SI","SI","NO","SI","Pública clasificada","C79272022-Tipo de información Pública clasificada-PRESTACION DE SERVICIOS DE PROMOCION Y PREVENCION – SERVICIOS_ESPECIALIZADOS_ZONA_SANTANDER"]
["PyP","Gerencia de administración del riesgo","No","C79282022",93141808,"PRESTACION DE SERVICIOS DE PROMOCION Y PREVENCION – SERVICIOS_ESPECIALIZADOS_ZONA_SANTANDER","1/01/2022",1,"30/11/2022",11.1,"Invitación directa","GastosAdministrativos",13678756,13678756,"No","N/A","Gerencia de Abastecimiento Estratégico\ncontratacion@positiva.gov.co\nPBX: (1)6502200 Ext: 10641","SI","SI","NO","SI","Pública clasificada","C79282022-Tipo de información Pública clasificada-PRESTACION DE SERVICIOS DE PROMOCION Y PREVENCION – SERVICIOS_ESPECIALIZADOS_ZONA_SANTANDER"]
["PyP","Gerencia de administración del riesgo","No","C79292022",93141808,"PRESTACION DE SERVICIOS DE PROMOCION Y PREVENCION – SERVICIOS_ESPECIALIZADOS_ZONA_SANTANDER","1/01/2022",1,"30/11/2022",11.1,"Invitación directa","GastosAdministrativos",50000000,50000000,"No","N/A","Gerencia de Abastecimiento Estratégico\ncontratacion@positiva.gov.co\nPBX: (1)6502200 Ext: 10641","SI","SI","NO","SI","Pública clasificada","C79292022-Tipo de información Pública clasificada-PRESTACION DE SERVICIOS DE PROMOCION Y PREVENCION – SERVICIOS_ESPECIALIZADOS_ZONA_SANTANDER"]
["PyP","Gerencia de administración del riesgo","No","C79302022",93141808,"PRESTACION DE SERVICIOS DE PROMOCION Y PREVENCION – SERVICIOS_ESPECIALIZADOS_ZONA_SANTANDER","1/01/2022",1,"30/11/2022",11.1,"Invitación directa","GastosAdministrativos",30000000,30000000,"No","N/A","Gerencia de Abastecimiento Estratégico\ncontratacion@positiva.gov.co\nPBX: (1)6502200 Ext: 10641","SI","SI","NO","SI","Pública clasificada","C79302022-Tipo de información Pública clasificada-PRESTACION DE SERVICIOS DE PROMOCION Y PREVENCION – SERVICIOS_ESPECIALIZADOS_ZONA_SANTANDER"]
["PyP","Gerencia de administración del riesgo","No","C79312022",93141808,"PRESTACION DE SERVICIOS DE PROMOCION Y PREVENCION – SERVICIOS_ESPECIALIZADOS_ZONA_SANTANDER","1/01/2022",1,"30/11/2022",11.1,"Invitación directa","GastosAdministrativos",15000000,15000000,"No","N/A","Gerencia de Abastecimiento Estratégico\ncontratacion@positiva.gov.co\nPBX: (1)6502200 Ext: 10641","SI","SI","NO","SI","Pública clasificada","C79312022-Tipo de información Pública clasificada-PRESTACION DE SERVICIOS DE PROMOCION Y PREVENCION – SERVICIOS_ESPECIALIZADOS_ZONA_SANTANDER"]
["PyP","Gerencia de administración del riesgo","No","C79322022",93141808,"PRESTACION DE SERVICIOS DE PROMOCION Y PREVENCION – SERVICIOS_ESPECIALIZADOS_ZONA_SANTANDER","1/01/2022",1,"30/11/2022",11.1,"Invitación directa","GastosAdministrativos",60000000,60000000,"No","N/A","Gerencia de Abastecimiento Estratégico\ncontratacion@positiva.gov.co\nPBX: (1)6502200 Ext: 10641","SI","SI","NO","SI","Pública clasificada","C79322022-Tipo de información Pública clasificada-PRESTACION DE SERVICIOS DE PROMOCION Y PREVENCION – SERVICIOS_ESPECIALIZADOS_ZONA_SANTANDER"]
["PyP","Gerencia de administración del riesgo","No","C79332022",93141808,"PRESTACION DE SERVICIOS DE PROMOCION Y PREVENCION – SERVICIOS_ESPECIALIZADOS_ZONA_SANTANDER","1/01/2022",1,"30/11/2022",11.1,"Invitación directa","GastosAdministrativos",140196078,140196078,"No","N/A","Gerencia de Abastecimiento Estratégico\ncontratacion@positiva.gov.co\nPBX: (1)6502200 Ext: 10641","SI","SI","NO","SI","Pública clasificada","C79332022-Tipo de información Pública clasificada-PRESTACION DE SERVICIOS DE PROMOCION Y PREVENCION – SERVICIOS_ESPECIALIZADOS_ZONA_SANTANDER"]
["PyP","Gerencia de administración del riesgo","No","C79342022",93141808,"PRESTACION DE SERVICIOS DE PROMOCION Y PREVENCION – SERVICIOS_ESPECIALIZADOS_ZONA_SANTANDER","1/01/2022",1,"30/11/2022",11.1,"Invitación directa","GastosAdministrativos",71920266,71920266,"No","N/A","Gerencia de Abastecimiento Estratégico\ncontratacion@positiva.gov.co\nPBX: (1)6502200 Ext: 10641","SI","SI","NO","SI","Pública clasificada","C79342022-Tipo de información Pública clasificada-PRESTACION DE SERVICIOS DE PROMOCION Y PREVENCION – SERVICIOS_ESPECIALIZADOS_ZONA_SANTANDER"]
["PyP","Gerencia de administración del riesgo","No","C79352022",93141808,"PRESTACION DE SERVICIOS DE PROMOCION Y PREVENCION – SERVICIOS_ESPECIALIZADOS_ZONA_SANTANDER","1/01/2022",1,"30/11/2022",11.1,"Invitación directa","GastosAdministrativos",170000000,170000000,"No","N/A","Gerencia de Abastecimiento Estratégico\ncontratacion@positiva.gov.co\nPBX: (1)6502200 Ext: 10641","SI","SI","NO","SI","Pública clasificada","C79352022-Tipo de información Pública clasificada-PRESTACION DE SERVICIOS DE PROMOCION Y PREVENCION – SERVICIOS_ESPECIALIZADOS_ZONA_SANTANDER"]
["PyP","Gerencia de administración del riesgo","No","C80272022",93141808,"PRESTACION DE SERVICIOS DE PROMOCION Y PREVENCION – SERVICIOS_ESPECIALIZADOS_ZONA_VALLE","1/01/2022",1,"30/11/2022",11.1,"Invitación directa","GastosAdministrativos",100000000,100000000,"No","N/A","Gerencia de Abastecimiento Estratégico\ncontratacion@positiva.gov.co\nPBX: (1)6502200 Ext: 10641","SI","SI","NO","SI","Pública clasificada","C80272022-Tipo de información Pública clasificada-PRESTACION DE SERVICIOS DE PROMOCION Y PREVENCION – SERVICIOS_ESPECIALIZADOS_ZONA_VALLE"]
["PyP","Gerencia de administración del riesgo","No","C80282022",93141808,"PRESTACION DE SERVICIOS DE PROMOCION Y PREVENCION – SERVICIOS_ESPECIALIZADOS_ZONA_VALLE","1/01/2022",{"$f":"MONTH(G215)","v":1},"30/11/2022",11.1,"Invitación directa","GastosAdministrativos",54214286,54214286,"No","N/A","Gerencia de Abastecimiento Estratégico\ncontratacion@positiva.gov.co\nPBX: (1)6502200 Ext: 10641","SI","SI","NO","SI",{"$f":"IF(U215=\"SI\",\"Pública clasificada\",\"Pública\")","v":"Pública clasificada"},{"$f":"CONCATENATE(D215,\"-\",\"Tipo de información\",\" \",V215,\"-\",F215)","v":"C80282022-Tipo de información Pública clasificada-PRESTACION DE SERVICIOS DE PROMOCION Y PREVENCION – SERVICIOS_ESPECIALIZADOS_ZONA_VALLE"}]
["PyP","Gerencia de administración del riesgo","No","C80292022",93141808,"PRESTACION DE SERVICIOS DE PROMOCION Y PREVENCION – SERVICIOS_ESPECIALIZADOS_ZONA_VALLE","1/01/2022",1,"30/11/2022",11.1,"Invitación directa","GastosAdministrativos",72262774,72262774,"No","N/A","Gerencia de Abastecimiento Estratégico\ncontratacion@positiva.gov.co\nPBX: (1)6502200 Ext: 10641","SI","SI","NO","SI","Pública clasificada","C80292022-Tipo de información Pública clasificada-PRESTACION DE SERVICIOS DE PROMOCION Y PREVENCION – SERVICIOS_ESPECIALIZADOS_ZONA_VALLE"]
["PyP","Gerencia de administración del riesgo","No","C80302022",93141808,"PRESTACION DE SERVICIOS DE PROMOCION Y PREVENCION – SERVICIOS_ESPECIALIZADOS_ZONA_VALLE","1/01/2022",1,"30/11/2022",11.1,"Invitación directa","GastosAdministrativos",92288136,92288136,"No","N/A","Gerencia de Abastecimiento Estratégico\ncontratacion@positiva.gov.co\nPBX: (1)6502200 Ext: 10641","SI","SI","NO","SI","Pública clasificada","C80302022-Tipo de información Pública clasificada-PRESTACION DE SERVICIOS DE PROMOCION Y PREVENCION – SERVICIOS_ESPECIALIZADOS_ZONA_VALLE"]
["PyP","Gerencia de administración del riesgo","No","C80312022",93141808,"PRESTACION DE SERVICIOS DE PROMOCION Y PREVENCION – SERVICIOS_ESPECIALIZADOS_ZONA_VALLE","1/01/2022",1,"30/11/2022",11.1,"Invitación directa","GastosAdministrativos",110000000,110000000,"No","N/A","Gerencia de Abastecimiento Estratégico\ncontratacion@positiva.gov.co\nPBX: (1)6502200 Ext: 10641","SI","SI","NO","SI","Pública clasificada","C80312022-Tipo de información Pública clasificada-PRESTACION DE SERVICIOS DE PROMOCION Y PREVENCION – SERVICIOS_ESPECIALIZADOS_ZONA_VALLE"]
["PyP","Gerencia de administración del riesgo","No","C81042022",93141808,"PRESTACION DE SERVICIOS DE PROMOCION Y PREVENCION – SERVICIOS_ESPECIALIZADOS_CUENTA_FGN","1/01/2022",1,"30/11/2022",11.1,"Invitación directa","GastosAdministrativos",594000000,594000000,"No","N/A","Gerencia de Abastecimiento Estratégico\ncontratacion@positiva.gov.co\nPBX: (1)6502200 Ext: 10641","SI","SI","NO","SI","Pública clasificada","C81042022-Tipo de información Pública clasificada-PRESTACION DE SERVICIOS DE PROMOCION Y PREVENCION – SERVICIOS_ESPECIALIZADOS_CUENTA_FGN"]
["PyP","Gerencia de administración del riesgo","No","C81052022",93141808,"PRESTACION DE SERVICIOS DE PROMOCION Y PREVENCION – SERVICIOS_ESPECIALIZADOS_CUENTA_FGN","1/01/2022",1,"30/11/2022",11.1,"Invitación directa","GastosAdministrativos",1110000000,1110000000,"No","N/A","Gerencia de Abastecimiento Estratégico\ncontratacion@positiva.gov.co\nPBX: (1)6502200 Ext: 10641","SI","SI","NO","SI","Pública clasificada","C81052022-Tipo de información Pública clasificada-PRESTACION DE SERVICIOS DE PROMOCION Y PREVENCION – SERVICIOS_ESPECIALIZADOS_CUENTA_FGN"]
["PyP","Gerencia de administración del riesgo","No","C81062022",93141808,"PRESTACION DE SERVICIOS DE PROMOCION Y PREVENCION – SERVICIOS_ESPECIALIZADOS_CUENTA_FGN","1/01/2022",1,"30/11/2022",{"$f":"(I221-G221)/30","v":11.1},"Invitación directa","GastosAdministrativos",120000000,120000000,"No","N/A","Gerencia de Abastecimiento Estratégico\ncontratacion@positiva.gov.co\nPBX: (1)6502200 Ext: 10641","SI","SI","NO","SI","Pública clasificada","C81062022-Tipo de información Pública clasificada-PRESTACION DE SERVICIOS DE PROMOCION Y PREVENCION – SERVICIOS_ESPECIALIZADOS_CUENTA_FGN"]
["PyP","Gerencia de administración del riesgo","No","C81072022",93141808,"PRESTACION DE SERVICIOS DE PROMOCION Y PREVENCION – SERVICIOS_ESPECIALIZADOS_CUENTA_FGN","1/01/2022",1,"30/11/2022",11.1,"Invitación directa","GastosAdministrativos",1264000000,1264000000,"No","N/A","Gerencia de Abastecimiento Estratégico\ncontratacion@positiva.gov.co\nPBX: (1)6502200 Ext: 10641","SI","SI","NO","SI","Pública clasificada","C81072022-Tipo de información Pública clasificada-PRESTACION DE SERVICIOS DE PROMOCION Y PREVENCION – SERVICIOS_ESPECIALIZADOS_CUENTA_FGN"]
["PyP","Gerencia de administración del riesgo","No","C81082022",93141808,"PRESTACION DE SERVICIOS DE PROMOCION Y PREVENCION – SERVICIOS_ESPECIALIZADOS_CUENTA_FGN","1/01/2022",1,"30/11/2022",11.1,"Invitación directa","GastosAdministrativos",209000000,209000000,"No","N/A","Gerencia de Abastecimiento Estratégico\ncontratacion@positiva.gov.co\nPBX: (1)6502200 Ext: 10641","SI","SI","NO","SI","Pública clasificada","C81082022-Tipo de información Pública clasificada-PRESTACION DE SERVICIOS DE PROMOCION Y PREVENCION – SERVICIOS_ESPECIALIZADOS_CUENTA_FGN"]
["PyP","Gerencia de administración del riesgo","No","C81092022",93141808,"PRESTACION DE SERVICIOS DE PROMOCION Y PREVENCION – SERVICIOS_ESPECIALIZADOS_CUENTA_FGN","1/01/2022",1,"30/11/2022",11.1,"Invitación directa","GastosAdministrativos",121000000,121000000,"No","N/A","Gerencia de Abastecimiento Estratégico\ncontratacion@positiva.gov.co\nPBX: (1)6502200 Ext: 10641","SI","SI","NO","SI","Pública clasificada","C81092022-Tipo de información Pública clasificada-PRESTACION DE SERVICIOS DE PROMOCION Y PREVENCION – SERVICIOS_ESPECIALIZADOS_CUENTA_FGN"]
["PyP","Gerencia de administración del riesgo","No","C81102022",93141808,"PRESTACION DE SERVICIOS DE PROMOCION Y PREVENCION – SERVICIOS_ESPECIALIZADOS_CUENTA_FGN","1/01/2022",1,"30/11/2022",11.1,"Invitación directa","GastosAdministrativos",204811587,204811587,"No","N/A","Gerencia de Abastecimiento Estratégico\ncontratacion@positiva.gov.co\nPBX: (1)6502200 Ext: 10641","SI","SI","NO","SI","Pública clasificada","C81102022-Tipo de información Pública clasificada-PRESTACION DE SERVICIOS DE PROMOCION Y PREVENCION – SERVICIOS_ESPECIALIZADOS_CUENTA_FGN"]
["PyP","Gerencia de administración del riesgo","No","C81112022",93141808,"PRESTACION DE SERVICIOS DE PROMOCION Y PREVENCION – SERVICIOS_ESPECIALIZADOS_CUENTA_FGN","1/01/2022",1,"30/11/2022",11.1,"Invitación directa","GastosAdministrativos",167200000,167200000,"No","N/A","Gerencia de Abastecimiento Estratégico\ncontratacion@positiva.gov.co\nPBX: (1)6502200 Ext: 10641","SI","SI","NO","SI","Pública clasificada","C81112022-Tipo de información Pública clasificada-PRESTACION DE SERVICIOS DE PROMOCION Y PREVENCION – SERVICIOS_ESPECIALIZADOS_CUENTA_FGN"]
["PyP","Gerencia de administración del riesgo","No","C81122022",93141808,"PRESTACION DE SERVICIOS DE PROMOCION Y PREVENCION – SERVICIOS_ESPECIALIZADOS_CUENTA_FGN","1/01/2022",1,"30/11/2022",11.1,"Invitación directa","GastosAdministrativos",123200000,123200000,"No","N/A","Gerencia de Abastecimiento Estratégico\ncontratacion@positiva.gov.co\nPBX: (1)6502200 Ext: 10641","SI","SI","NO","SI","Pública clasificada","C81122022-Tipo de información Pública clasificada-PRESTACION DE SERVICIOS DE PROMOCION Y PREVENCION – SERVICIOS_ESPECIALIZADOS_CUENTA_FGN"]
["PyP","Gerencia de administración del riesgo","No","C81132022",93141808,"PRESTACION DE SERVICIOS DE PROMOCION Y PREVENCION – SERVICIOS_ESPECIALIZADOS_CUENTA_FGN","1/01/2022",1,"30/11/2022",11.1,"Invitación directa","GastosAdministrativos",200000000,200000000,"No","N/A","Gerencia de Abastecimiento Estratégico\ncontratacion@positiva.gov.co\nPBX: (1)6502200 Ext: 10641","SI","SI","NO","SI","Pública clasificada","C81132022-Tipo de información Pública clasificada-PRESTACION DE SERVICIOS DE PROMOCION Y PREVENCION – SERVICIOS_ESPECIALIZADOS_CUENTA_FGN"]
["PyP","Gerencia de administración del riesgo","No","C81142022",93141808,"PRESTACION DE SERVICIOS DE PROMOCION Y PREVENCION – SERVICIOS_ESPECIALIZADOS_CUENTA_FGN","1/01/2022",1,"30/11/2022",11.1,"Invitación directa","GastosAdministrativos",60000000,60000000,"No","N/A","Gerencia de Abastecimiento Estratégico\ncontratacion@positiva.gov.co\nPBX: (1)6502200 Ext: 10641","SI","SI","NO","SI","Pública clasificada","C81142022-Tipo de información Pública clasificada-PRESTACION DE SERVICIOS DE PROMOCION Y PREVENCION – SERVICIOS_ESPECIALIZADOS_CUENTA_FGN"]
["PyP","Gerencia de administración del riesgo","No","C81152022",93141808,"PRESTACION DE SERVICIOS DE PROMOCION Y PREVENCION – SERVICIOS_ESPECIALIZADOS_CUENTA_FGN","1/01/2022",1,"30/11/2022",11.1,"Invitación directa","GastosAdministrativos",120000000,120000000,"No","N/A","Gerencia de Abastecimiento Estratégico\ncontratacion@positiva.gov.co\nPBX: (1)6502200 Ext: 10641","SI","SI","NO","SI","Pública clasificada","C81152022-Tipo de información Pública clasificada-PRESTACION DE SERVICIOS DE PROMOCION Y PREVENCION – SERVICIOS_ESPECIALIZADOS_CUENTA_FGN"]
["PyP","Gerencia de administración del riesgo","No","C81162022",93141808,"PRESTACION DE SERVICIOS DE PROMOCION Y PREVENCION – SERVICIOS_ESPECIALIZADOS_CUENTA_FGN","1/01/2022",1,"30/11/2022",11.1,"Invitación directa","GastosAdministrativos",700000000,700000000,"No","N/A","Gerencia de Abastecimiento Estratégico\ncontratacion@positiva.gov.co\nPBX: (1)6502200 Ext: 10641","SI","SI","NO","SI","Pública clasificada","C81162022-Tipo de información Pública clasificada-PRESTACION DE SERVICIOS DE PROMOCION Y PREVENCION – SERVICIOS_ESPECIALIZADOS_CUENTA_FGN"]
["PyP","Gerencia de administración del riesgo","No","C81172022",93141808,"PRESTACION DE SERVICIOS DE PROMOCION Y PREVENCION – SERVICIOS_ESPECIALIZADOS_CUENTA_FGN","1/01/2022",1,"30/11/2022",11.1,"Invitación directa","GastosAdministrativos",140000000,140000000,"No","N/A","Gerencia de Abastecimiento Estratégico\ncontratacion@positiva.gov.co\nPBX: (1)6502200 Ext: 10641","SI","SI","NO","SI","Pública clasificada","C81172022-Tipo de información Pública clasificada-PRESTACION DE SERVICIOS DE PROMOCION Y PREVENCION – SERVICIOS_ESPECIALIZADOS_CUENTA_FGN"]
["PyP","Gerencia de administración del riesgo","No","C84012022",93141808,"PRESTACION DE SERVICIOS DE PROMOCION Y PREVENCION – GRAN_MIPYME","1/01/2022",1,"30/11/2022",11.1,"Invitación directa","GastosAdministrativos",1350000000,1350000000,"No","N/A","Gerencia de Abastecimiento Estratégico\ncontratacion@positiva.gov.co\nPBX: (1)6502200 Ext: 10641","SI","SI","NO","SI","Pública clasificada","C84012022-Tipo de información Pública clasificada-PRESTACION DE SERVICIOS DE PROMOCION Y PREVENCION – GRAN_MIPYME"]
["PyP","Gerencia de administración del riesgo","No","C84022022",93141808,"PRESTACION DE SERVICIOS DE PROMOCION Y PREVENCION – GRAN_MIPYME","1/01/2022",1,"30/11/2022",11.1,"Invitación directa","GastosAdministrativos",602382645,602382645,"No","N/A","Gerencia de Abastecimiento Estratégico\ncontratacion@positiva.gov.co\nPBX: (1)6502200 Ext: 10641","SI","SI","NO","SI","Pública clasificada","C84022022-Tipo de información Pública clasificada-PRESTACION DE SERVICIOS DE PROMOCION Y PREVENCION – GRAN_MIPYME"]
["PyP","Gerencia de administración del riesgo","No","C84032022",93141808,"PRESTACION DE SERVICIOS DE PROMOCION Y PREVENCION – GRAN_MIPYME","1/01/2022",1,"30/11/2022",11.1,"Invitación directa","GastosAdministrativos",700000000,700000000,"No","N/A","Gerencia de Abastecimiento Estratégico\ncontratacion@positiva.gov.co\nPBX: (1)6502200 Ext: 10641","SI","SI","NO","SI","Pública clasificada","C84032022-Tipo de información Pública clasificada-PRESTACION DE SERVICIOS DE PROMOCION Y PREVENCION – GRAN_MIPYME"]
["PyP","Gerencia de administración del riesgo","No","C84042022",93141808,"PRESTACION DE SERVICIOS DE PROMOCION Y PREVENCION – GRAN_MIPYME","1/01/2022",1,"30/11/2022",11.1,"Invitación directa","GastosAdministrativos",1350000000,1350000000,"No","N/A","Gerencia de Abastecimiento Estratégico\ncontratacion@positiva.gov.co\nPBX: (1)6502200 Ext: 10641","SI","SI","NO","SI","Pública clasificada","C84042022-Tipo de información Pública clasificada-PRESTACION DE SERVICIOS DE PROMOCION Y PREVENCION – GRAN_MIPYME"]
["PyP","Gerencia de administración del riesgo","No","C84052022",93141808,"PRESTACION DE SERVICIOS DE PROMOCION Y PREVENCION – GRAN_MIPYME","1/01/2022",1,"30/11/2022",11.1,"Invitación directa","GastosAdministrativos",1070000000,1070000000,"No","N/A","Gerencia de Abastecimiento Estratégico\ncontratacion@positiva.gov.co\nPBX: (1)6502200 Ext: 10641","SI","SI","NO","SI","Pública clasificada","C84052022-Tipo de información Pública clasificada-PRESTACION DE SERVICIOS DE PROMOCION Y PREVENCION – GRAN_MIPYME"]
["PyP","Gerencia de administración del riesgo","No","C84062022",93141808,"PRESTACION DE SERVICIOS DE PROMOCION Y PREVENCION – GRAN_MIPYME","1/01/2022",1,"30/11/2022",11.1,"Invitación directa","GastosAdministrativos",1070000000,1070000000,"No","N/A","Gerencia de Abastecimiento Estratégico\ncontratacion@positiva.gov.co\nPBX: (1)6502200 Ext: 10641","SI","SI","NO","SI","Pública clasificada","C84062022-Tipo de información Pública clasificada-PRESTACION DE SERVICIOS DE PROMOCION Y PREVENCION – GRAN_MIPYME"]
["PyP","Gerencia de administración del riesgo","No","C84072022",93141808,"PRESTACION DE SERVICIOS DE PROMOCION Y PREVENCION – GRAN_MIPYME","1/01/2022",1,"30/11/2022",11.1,"Invitación directa","GastosAdministrativos",1350000000,1350000000,"No","N/A","Gerencia de Abastecimiento Estratégico\ncontratacion@positiva.gov.co\nPBX: (1)6502200 Ext: 10641","SI","SI","NO","SI","Pública clasificada","C84072022-Tipo de información Pública clasificada-PRESTACION DE SERVICIOS DE PROMOCION Y PREVENCION – GRAN_MIPYME"]
["PyP","Gerencia de administración del riesgo","No","C84082022",93141808,"PRESTACION DE SERVICIOS DE PROMOCION Y PREVENCION – INVESTIGACION_AT","1/01/2022",1,"30/11/2022",11.1,"Invitación directa","GastosAdministrativos",950000000,950000000,"No","N/A","Gerencia de Abastecimiento Estratégico\ncontratacion@positiva.gov.co\nPBX: (1)6502200 Ext: 10641","SI","SI","NO","SI","Pública clasificada","C84082022-Tipo de información Pública clasificada-PRESTACION DE SERVICIOS DE PROMOCION Y PREVENCION – INVESTIGACION_AT"]
["PyP","Gerencia de administración del riesgo","No","C75152022",93141808,"PRESTACION DE SERVICIOS DE PROMOCION Y PREVENCION – SERVICIOS_ESPECIALIZADOS_ZONA_ANTIOQUIA","1/01/2022",1,"30/11/2022",11.1,"Invitación directa","GastosAdministrativos",280000000,280000000,"No","N/A","Gerencia de Abastecimiento Estratégico\ncontratacion@positiva.gov.co\nPBX: (1)6502200 Ext: 10641","SI","SI","NO","SI","Pública clasificada","C75152022-Tipo de información Pública clasificada-PRESTACION DE SERVICIOS DE PROMOCION Y PREVENCION – SERVICIOS_ESPECIALIZADOS_ZONA_ANTIOQUIA"]
["PyP","Gerencia de administración del riesgo","No","C75162022",93141808,"PRESTACION DE SERVICIOS DE PROMOCION Y PREVENCION – SERVICIOS_ESPECIALIZADOS_ZONA_ANTIOQUIA","1/01/2022",1,"30/11/2022",11.1,"Invitación directa","GastosAdministrativos",250000000,250000000,"No","N/A","Gerencia de Abastecimiento Estratégico\ncontratacion@positiva.gov.co\nPBX: (1)6502200 Ext: 10641","SI","SI","NO","SI","Pública clasificada","C75162022-Tipo de información Pública clasificada-PRESTACION DE SERVICIOS DE PROMOCION Y PREVENCION – SERVICIOS_ESPECIALIZADOS_ZONA_ANTIOQUIA"]
["PyP","Gerencia de administración del riesgo","No","C75172022",93141808,"PRESTACION DE SERVICIOS DE PROMOCION Y PREVENCION – SERVICIOS_ESPECIALIZADOS_ZONA_ANTIOQUIA","1/01/2022",1,"30/11/2022",11.1,"Invitación directa","GastosAdministrativos",100303951,100303951,"No","N/A","Gerencia de Abastecimiento Estratégico\ncontratacion@positiva.gov.co\nPBX: (1)6502200 Ext: 10641","SI","SI","NO","SI","Pública clasificada","C75172022-Tipo de información Pública clasificada-PRESTACION DE SERVICIOS DE PROMOCION Y PREVENCION – SERVICIOS_ESPECIALIZADOS_ZONA_ANTIOQUIA"]
["PyP","Gerencia de administración del riesgo","No","C75182022",93141808,"PRESTACION DE SERVICIOS DE PROMOCION Y PREVENCION – SERVICIOS_ESPECIALIZADOS_ZONA_ANTIOQUIA","1/01/2022",1,"30/11/2022",11.1,"Invitación directa","GastosAdministrativos",343488828,343488828,"No","N/A","Gerencia de Abastecimiento Estratégico\ncontratacion@positiva.gov.co\nPBX: (1)6502200 Ext: 10641","SI","SI","NO","SI","Pública clasificada","C75182022-Tipo de información Pública clasificada-PRESTACION DE SERVICIOS DE PROMOCION Y PREVENCION – SERVICIOS_ESPECIALIZADOS_ZONA_ANTIOQUIA"]
["PyP","Gerencia de administración del riesgo","No","C75192022",93141808,"PRESTACION DE SERVICIOS DE PROMOCION Y PREVENCION – SERVICIOS_ESPECIALIZADOS_ZONA_ANTIOQUIA","1/01/2022",1,"30/11/2022",11.1,"Invitación directa","GastosAdministrativos",150000000,150000000,"No","N/A","Gerencia de Abastecimiento Estratégico\ncontratacion@positiva.gov.co\nPBX: (1)6502200 Ext: 10641","SI","SI","NO","SI","Pública clasificada","C75192022-Tipo de información Pública clasificada-PRESTACION DE SERVICIOS DE PROMOCION Y PREVENCION – SERVICIOS_ESPECIALIZADOS_ZONA_ANTIOQUIA"]
["PyP","Gerencia de administración del riesgo","No","C75202022",93141808,"PRESTACION DE SERVICIOS DE PROMOCION Y PREVENCION – SERVICIOS_ESPECIALIZADOS_ZONA_ANTIOQUIA","1/01/2022",1,"30/11/2022",11.1,"Invitación directa","GastosAdministrativos",290000000,290000000,"No","N/A","Gerencia de Abastecimiento Estratégico\ncontratacion@positiva.gov.co\nPBX: (1)6502200 Ext: 10641","SI","SI","NO","SI","Pública clasificada","C75202022-Tipo de información Pública clasificada-PRESTACION DE SERVICIOS DE PROMOCION Y PREVENCION – SERVICIOS_ESPECIALIZADOS_ZONA_ANTIOQUIA"]
["PyP","Gerencia de administración del riesgo","No","C75212022",93141808,"PRESTACION DE SERVICIOS DE PROMOCION Y PREVENCION – SERVICIOS_ESPECIALIZADOS_ZONA_ANTIOQUIA","1/01/2022",1,"30/11/2022",11.1,"Invitación directa","GastosAdministrativos",100000000,100000000,"No","N/A","Gerencia de Abastecimiento Estratégico\ncontratacion@positiva.gov.co\nPBX: (1)6502200 Ext: 10641","SI","SI","NO","SI","Pública clasificada","C75212022-Tipo de información Pública clasificada-PRESTACION DE SERVICIOS DE PROMOCION Y PREVENCION – SERVICIOS_ESPECIALIZADOS_ZONA_ANTIOQUIA"]
["PyP","Gerencia de administración del riesgo","No","C76332022",93141808,"PRESTACION DE SERVICIOS DE PROMOCION Y PREVENCION – SERVICIOS_ESPECIALIZADOS_ZONA_ATLANTICO","1/01/2022",1,"30/11/2022",11.1,"Invitación directa","GastosAdministrativos",21505600,21505600,"No","N/A","Gerencia de Abastecimiento Estratégico\ncontratacion@positiva.gov.co\nPBX: (1)6502200 Ext: 10641","SI","SI","NO","SI","Pública clasificada","C76332022-Tipo de información Pública clasificada-PRESTACION DE SERVICIOS DE PROMOCION Y PREVENCION – SERVICIOS_ESPECIALIZADOS_ZONA_ATLANTICO"]
["PyP","Gerencia de administración del riesgo","No","C77122022",93141808,"PRESTACION DE SERVICIOS DE PROMOCION Y PREVENCION – SERVICIOS_ESPECIALIZADOS_ZONA_BOGOTA","1/01/2022",1,"30/11/2022",11.1,"Invitación directa","GastosAdministrativos",2500000000,2500000000,"No","N/A","Gerencia de Abastecimiento Estratégico\ncontratacion@positiva.gov.co\nPBX: (1)6502200 Ext: 10641","SI","SI","NO","SI","Pública clasificada","C77122022-Tipo de información Pública clasificada-PRESTACION DE SERVICIOS DE PROMOCION Y PREVENCION – SERVICIOS_ESPECIALIZADOS_ZONA_BOGOTA"]
["PyP","Gerencia de administración del riesgo","No","C77132022",93141808,"PRESTACION DE SERVICIOS DE PROMOCION Y PREVENCION – SERVICIOS_ESPECIALIZADOS_ZONA_BOGOTA","1/01/2022",1,"30/11/2022",11.1,"Invitación directa","GastosAdministrativos",280000000,280000000,"No","N/A","Gerencia de Abastecimiento Estratégico\ncontratacion@positiva.gov.co\nPBX: (1)6502200 Ext: 10641","SI","SI","NO","SI","Pública clasificada","C77132022-Tipo de información Pública clasificada-PRESTACION DE SERVICIOS DE PROMOCION Y PREVENCION – SERVICIOS_ESPECIALIZADOS_ZONA_BOGOTA"]
["PyP","Gerencia de administración del riesgo","No","C77142022",93141808,"PRESTACION DE SERVICIOS DE PROMOCION Y PREVENCION – SERVICIOS_ESPECIALIZADOS_ZONA_BOGOTA","1/01/2022",1,"30/11/2022",11.1,"Invitación directa","GastosAdministrativos",50000000,50000000,"No","N/A","Gerencia de Abastecimiento Estratégico\ncontratacion@positiva.gov.co\nPBX: (1)6502200 Ext: 10641","SI","SI","NO","SI","Pública clasificada","C77142022-Tipo de información Pública clasificada-PRESTACION DE SERVICIOS DE PROMOCION Y PREVENCION – SERVICIOS_ESPECIALIZADOS_ZONA_BOGOTA"]
["PyP","Gerencia de administración del riesgo","No","C77152022",93141808,"PRESTACION DE SERVICIOS DE PROMOCION Y PREVENCION – SERVICIOS_ESPECIALIZADOS_ZONA_BOGOTA","1/01/2022",1,"30/11/2022",11.1,"Invitación directa","GastosAdministrativos",2100000000,2100000000,"No","N/A","Gerencia de Abastecimiento Estratégico\ncontratacion@positiva.gov.co\nPBX: (1)6502200 Ext: 10641","SI","SI","NO","SI","Pública clasificada","C77152022-Tipo de información Pública clasificada-PRESTACION DE SERVICIOS DE PROMOCION Y PREVENCION – SERVICIOS_ESPECIALIZADOS_ZONA_BOGOTA"]
["PyP","Gerencia de administración del riesgo","No","C77162022",93141808,"PRESTACION DE SERVICIOS DE PROMOCION Y PREVENCION – SERVICIOS_ESPECIALIZADOS_ZONA_BOGOTA","1/01/2022",1,"30/11/2022",11.1,"Invitación directa","GastosAdministrativos",170000000,170000000,"No","N/A","Gerencia de Abastecimiento Estratégico\ncontratacion@positiva.gov.co\nPBX: (1)6502200 Ext: 10641","SI","SI","NO","SI","Pública clasificada","C77162022-Tipo de información Pública clasificada-PRESTACION DE SERVICIOS DE PROMOCION Y PREVENCION – SERVICIOS_ESPECIALIZADOS_ZONA_BOGOTA"]
["PyP","Gerencia de administración del riesgo","No","C77172022",93141808,"PRESTACION DE SERVICIOS DE PROMOCION Y PREVENCION – SERVICIOS_ESPECIALIZADOS_ZONA_BOGOTA","1/01/2022",1,"30/11/2022",11.1,"Invitación directa","GastosAdministrativos",270000000,270000000,"No","N/A","Gerencia de Abastecimiento Estratégico\ncontratacion@positiva.gov.co\nPBX: (1)6502200 Ext: 10641","SI","SI","NO","SI","Pública clasificada","C77172022-Tipo de información Pública clasificada-PRESTACION DE SERVICIOS DE PROMOCION Y PREVENCION – SERVICIOS_ESPECIALIZADOS_ZONA_BOGOTA"]
["PyP","Gerencia de administración del riesgo","No","C77182022",93141808,"PRESTACION DE SERVICIOS DE PROMOCION Y PREVENCION – SERVICIOS_ESPECIALIZADOS_ZONA_BOGOTA","1/01/2022",1,"30/11/2022",11.1,"Invitación directa","GastosAdministrativos",180000000,180000000,"No","N/A","Gerencia de Abastecimiento Estratégico\ncontratacion@positiva.gov.co\nPBX: (1)6502200 Ext: 10641","SI","SI","NO","SI","Pública clasificada","C77182022-Tipo de información Pública clasificada-PRESTACION DE SERVICIOS DE PROMOCION Y PREVENCION – SERVICIOS_ESPECIALIZADOS_ZONA_BOGOTA"]
["PyP","Gerencia de administración del riesgo","No","C77192022",93141808,"PRESTACION DE SERVICIOS DE PROMOCION Y PREVENCION – SERVICIOS_ESPECIALIZADOS_ZONA_BOGOTA","1/01/2022",1,"30/11/2022",11.1,"Invitación directa","GastosAdministrativos",350000000,350000000,"No","N/A","Gerencia de Abastecimiento Estratégico\ncontratacion@positiva.gov.co\nPBX: (1)6502200 Ext: 10641","SI","SI","NO","SI","Pública clasificada","C77192022-Tipo de información Pública clasificada-PRESTACION DE SERVICIOS DE PROMOCION Y PREVENCION – SERVICIOS_ESPECIALIZADOS_ZONA_BOGOTA"]
["PyP","Gerencia de administración del riesgo","No","C77202022",93141808,"PRESTACION DE SERVICIOS DE PROMOCION Y PREVENCION – SERVICIOS_ESPECIALIZADOS_ZONA_BOGOTA","1/01/2022",1,"30/11/2022",11.1,"Invitación directa","GastosAdministrativos",200000000,200000000,"No","N/A","Gerencia de Abastecimiento Estratégico\ncontratacion@positiva.gov.co\nPBX: (1)6502200 Ext: 10641","SI","SI","NO","SI","Pública clasificada","C77202022-Tipo de información Pública clasificada-PRESTACION DE SERVICIOS DE PROMOCION Y PREVENCION – SERVICIOS_ESPECIALIZADOS_ZONA_BOGOTA"]
["PyP","Gerencia de administración del riesgo","No","C77212022",93141808,"PRESTACION DE SERVICIOS DE PROMOCION Y PREVENCION – SERVICIOS_ESPECIALIZADOS_ZONA_BOGOTA","1/01/2022",1,"30/11/2022",11.1,"Invitación directa","GastosAdministrativos",206968641,206968641,"No","N/A","Gerencia de Abastecimiento Estratégico\ncontratacion@positiva.gov.co\nPBX: (1)6502200 Ext: 10641","SI","SI","NO","SI","Pública clasificada","C77212022-Tipo de información Pública clasificada-PRESTACION DE SERVICIOS DE PROMOCION Y PREVENCION – SERVICIOS_ESPECIALIZADOS_ZONA_BOGOTA"]
["PyP","Gerencia de administración del riesgo","No","C77222022",93141808,"PRESTACION DE SERVICIOS DE PROMOCION Y PREVENCION – SERVICIOS_ESPECIALIZADOS_ZONA_BOGOTA","1/01/2022",1,"30/11/2022",11.1,"Invitación directa","GastosAdministrativos",103846154,103846154,"No","N/A","Gerencia de Abastecimiento Estratégico\ncontratacion@positiva.gov.co\nPBX: (1)6502200 Ext: 10641","SI","SI","NO","SI","Pública clasificada","C77222022-Tipo de información Pública clasificada-PRESTACION DE SERVICIOS DE PROMOCION Y PREVENCION – SERVICIOS_ESPECIALIZADOS_ZONA_BOGOTA"]
["PyP","Gerencia de administración del riesgo","No","C77232022",93141808,"PRESTACION DE SERVICIOS DE PROMOCION Y PREVENCION – SERVICIOS_ESPECIALIZADOS_ZONA_BOGOTA","1/01/2022",1,"30/11/2022",11.1,"Invitación directa","GastosAdministrativos",250000000,250000000,"No","N/A","Gerencia de Abastecimiento Estratégico\ncontratacion@positiva.gov.co\nPBX: (1)6502200 Ext: 10641","SI","SI","NO","SI","Pública clasificada","C77232022-Tipo de información Pública clasificada-PRESTACION DE SERVICIOS DE PROMOCION Y PREVENCION – SERVICIOS_ESPECIALIZADOS_ZONA_BOGOTA"]
["PyP","Gerencia de administración del riesgo","No","C77242022",93141808,"PRESTACION DE SERVICIOS DE PROMOCION Y PREVENCION – SERVICIOS_ESPECIALIZADOS_ZONA_BOGOTA","1/01/2022",1,"30/11/2022",11.1,"Invitación directa","GastosAdministrativos",54214286,54214286,"No","N/A","Gerencia de Abastecimiento Estratégico\ncontratacion@positiva.gov.co\nPBX: (1)6502200 Ext: 10641","SI","SI","NO","SI","Pública clasificada","C77242022-Tipo de información Pública clasificada-PRESTACION DE SERVICIOS DE PROMOCION Y PREVENCION – SERVICIOS_ESPECIALIZADOS_ZONA_BOGOTA"]
["PyP","Gerencia de administración del riesgo","No","C77252022",93141808,"PRESTACION DE SERVICIOS DE PROMOCION Y PREVENCION – SERVICIOS_ESPECIALIZADOS_ZONA_BOGOTA","1/01/2022",1,"30/11/2022",11.1,"Invitación directa","GastosAdministrativos",95306859,95306859,"No","N/A","Gerencia de Abastecimiento Estratégico\ncontratacion@positiva.gov.co\nPBX: (1)6502200 Ext: 10641","SI","SI","NO","SI","Pública clasificada","C77252022-Tipo de información Pública clasificada-PRESTACION DE SERVICIOS DE PROMOCION Y PREVENCION – SERVICIOS_ESPECIALIZADOS_ZONA_BOGOTA"]
["PyP","Gerencia de administración del riesgo","No","C77262022",93141808,"PRESTACION DE SERVICIOS DE PROMOCION Y PREVENCION – SERVICIOS_ESPECIALIZADOS_ZONA_BOGOTA","1/01/2022",1,"30/11/2022",11.1,"Invitación directa","GastosAdministrativos",380000000,380000000,"No","N/A","Gerencia de Abastecimiento Estratégico\ncontratacion@positiva.gov.co\nPBX: (1)6502200 Ext: 10641","SI","SI","NO","SI","Pública clasificada","C77262022-Tipo de información Pública clasificada-PRESTACION DE SERVICIOS DE PROMOCION Y PREVENCION – SERVICIOS_ESPECIALIZADOS_ZONA_BOGOTA"]
["PyP","Gerencia de administración del riesgo","No","C77272022",93141808,"PRESTACION DE SERVICIOS DE PROMOCION Y PREVENCION – SERVICIOS_ESPECIALIZADOS_ZONA_BOGOTA","1/01/2022",1,"30/11/2022",11.1,"Invitación directa","GastosAdministrativos",320000000,320000000,"No","N/A","Gerencia de Abastecimiento Estratégico\ncontratacion@positiva.gov.co\nPBX: (1)6502200 Ext: 10641","SI","SI","NO","SI","Pública clasificada","C77272022-Tipo de información Pública clasificada-PRESTACION DE SERVICIOS DE PROMOCION Y PREVENCION – SERVICIOS_ESPECIALIZADOS_ZONA_BOGOTA"]
["PyP","Gerencia de administración del riesgo","No","C77282022",93141808,"PRESTACION DE SERVICIOS DE PROMOCION Y PREVENCION – SERVICIOS_ESPECIALIZADOS_ZONA_BOGOTA","1/01/2022",1,"30/11/2022",11.1,"Invitación directa","GastosAdministrativos",180000000,180000000,"No","N/A","Gerencia de Abastecimiento Estratégico\ncontratacion@positiva.gov.co\nPBX: (1)6502200 Ext: 10641","SI","SI","NO","SI","Pública clasificada","C77282022-Tipo de información Pública clasificada-PRESTACION DE SERVICIOS DE PROMOCION Y PREVENCION – SERVICIOS_ESPECIALIZADOS_ZONA_BOGOTA"]
["PyP","Gerencia de administración del riesgo","No","C77292022",93141808,"PRESTACION DE SERVICIOS DE PROMOCION Y PREVENCION – SERVICIOS_ESPECIALIZADOS_ZONA_BOGOTA","1/01/2022",1,"30/11/2022",11.1,"Invitación directa","GastosAdministrativos",800000000,800000000,"No","N/A","Gerencia de Abastecimiento Estratégico\ncontratacion@positiva.gov.co\nPBX: (1)6502200 Ext: 10641","SI","SI","NO","SI","Pública clasificada","C77292022-Tipo de información Pública clasificada-PRESTACION DE SERVICIOS DE PROMOCION Y PREVENCION – SERVICIOS_ESPECIALIZADOS_ZONA_BOGOTA"]
["PyP","Gerencia de administración del riesgo","No","C77302022",93141808,"PRESTACION DE SERVICIOS DE PROMOCION Y PREVENCION – SERVICIOS_ESPECIALIZADOS_ZONA_BOGOTA","1/01/2022",1,"30/11/2022",11.1,"Invitación directa","GastosAdministrativos",68041237,68041237,"No","N/A","Gerencia de Abastecimiento Estratégico\ncontratacion@positiva.gov.co\nPBX: (1)6502200 Ext: 10641","SI","SI","NO","SI","Pública clasificada","C77302022-Tipo de información Pública clasificada-PRESTACION DE SERVICIOS DE PROMOCION Y PREVENCION – SERVICIOS_ESPECIALIZADOS_ZONA_BOGOTA"]
["PyP","Gerencia de administración del riesgo","No","C77312022",93141808,"PRESTACION DE SERVICIOS DE PROMOCION Y PREVENCION – SERVICIOS_ESPECIALIZADOS_ZONA_BOGOTA","1/01/2022",1,"30/11/2022",11.1,"Invitación directa","GastosAdministrativos",400000000,400000000,"No","N/A","Gerencia de Abastecimiento Estratégico\ncontratacion@positiva.gov.co\nPBX: (1)6502200 Ext: 10641","SI","SI","NO","SI","Pública clasificada","C77312022-Tipo de información Pública clasificada-PRESTACION DE SERVICIOS DE PROMOCION Y PREVENCION – SERVICIOS_ESPECIALIZADOS_ZONA_BOGOTA"]
["PyP","Gerencia de administración del riesgo","No","C77322022",93141808,"PRESTACION DE SERVICIOS DE PROMOCION Y PREVENCION – SERVICIOS_ESPECIALIZADOS_ZONA_BOGOTA","1/01/2022",1,"30/11/2022",11.1,"Invitación directa","GastosAdministrativos",120000000,120000000,"No","N/A","Gerencia de Abastecimiento Estratégico\ncontratacion@positiva.gov.co\nPBX: (1)6502200 Ext: 10641","SI","SI","NO","SI","Pública clasificada","C77322022-Tipo de información Pública clasificada-PRESTACION DE SERVICIOS DE PROMOCION Y PREVENCION – SERVICIOS_ESPECIALIZADOS_ZONA_BOGOTA"]
["PyP","Gerencia de administración del riesgo","No","C77332022",93141808,"PRESTACION DE SERVICIOS DE PROMOCION Y PREVENCION – SERVICIOS_ESPECIALIZADOS_ZONA_BOGOTA","1/01/2022",1,"30/11/2022",11.1,"Invitación directa","GastosAdministrativos",89491525,89491525,"No","N/A","Gerencia de Abastecimiento Estratégico\ncontratacion@positiva.gov.co\nPBX: (1)6502200 Ext: 10641","SI","SI","NO","SI","Pública clasificada","C77332022-Tipo de información Pública clasificada-PRESTACION DE SERVICIOS DE PROMOCION Y PREVENCION – SERVICIOS_ESPECIALIZADOS_ZONA_BOGOTA"]
["PyP","Gerencia de administración del riesgo","No","C77342022",93141808,"PRESTACION DE SERVICIOS DE PROMOCION Y PREVENCION – SERVICIOS_ESPECIALIZADOS_ZONA_BOGOTA","1/01/2022",1,"30/11/2022",11.1,"Invitación directa","GastosAdministrativos",250000000,250000000,"No","N/A","Gerencia de Abastecimiento Estratégico\ncontratacion@positiva.gov.co\nPBX: (1)6502200 Ext: 10641","SI","SI","NO","SI","Pública clasificada","C77342022-Tipo de información Pública clasificada-PRESTACION DE SERVICIOS DE PROMOCION Y PREVENCION – SERVICIOS_ESPECIALIZADOS_ZONA_BOGOTA"]
["PyP","Gerencia de administración del riesgo","No","C77352022",93141808,"PRESTACION DE SERVICIOS DE PROMOCION Y PREVENCION – SERVICIOS_ESPECIALIZADOS_ZONA_BOGOTA","1/01/2022",1,"30/11/2022",11.1,"Invitación directa","GastosAdministrativos",800000000,800000000,"No","N/A","Gerencia de Abastecimiento Estratégico\ncontratacion@positiva.gov.co\nPBX: (1)6502200 Ext: 10641","SI","SI","NO","SI","Pública clasificada","C77352022-Tipo de información Pública clasificada-PRESTACION DE SERVICIOS DE PROMOCION Y PREVENCION – SERVICIOS_ESPECIALIZADOS_ZONA_BOGOTA"]
["PyP","Gerencia de administración del riesgo","No","C77362022",93141808,"PRESTACION DE SERVICIOS DE PROMOCION Y PREVENCION – SERVICIOS_ESPECIALIZADOS_ZONA_BOGOTA","1/01/2022",1,"30/11/2022",11.1,"Invitación directa","GastosAdministrativos",1800000000,1800000000,"No","N/A","Gerencia de Abastecimiento Estratégico\ncontratacion@positiva.gov.co\nPBX: (1)6502200 Ext: 10641","SI","SI","NO","SI","Pública clasificada","C77362022-Tipo de información Pública clasificada-PRESTACION DE SERVICIOS DE PROMOCION Y PREVENCION – SERVICIOS_ESPECIALIZADOS_ZONA_BOGOTA"]
["PyP","Gerencia de administración del riesgo","No","C77372022",93141808,"PRESTACION DE SERVICIOS DE PROMOCION Y PREVENCION – SERVICIOS_ESPECIALIZADOS_ZONA_BOGOTA","1/01/2022",1,"30/11/2022",11.1,"Invitación directa","GastosAdministrativos",33600000,33600000,"No","N/A","Gerencia de Abastecimiento Estratégico\ncontratacion@positiva.gov.co\nPBX: (1)6502200 Ext: 10641","SI","SI","NO","SI","Pública clasificada","C77372022-Tipo de información Pública clasificada-PRESTACION DE SERVICIOS DE PROMOCION Y PREVENCION – SERVICIOS_ESPECIALIZADOS_ZONA_BOGOTA"]
["PyP","Gerencia de administración del riesgo","No","C77382022",93141808,"PRESTACION DE SERVICIOS DE PROMOCION Y PREVENCION – SERVICIOS_ESPECIALIZADOS_ZONA_BOGOTA","1/01/2022",1,"30/11/2022",11.1,"Invitación directa","GastosAdministrativos",118972589,118972589,"No","N/A","Gerencia de Abastecimiento Estratégico\ncontratacion@positiva.gov.co\nPBX: (1)6502200 Ext: 10641","SI","SI","NO","SI","Pública clasificada","C77382022-Tipo de información Pública clasificada-PRESTACION DE SERVICIOS DE PROMOCION Y PREVENCION – SERVICIOS_ESPECIALIZADOS_ZONA_BOGOTA"]
["PyP","Gerencia de administración del riesgo","No","C77392022",93141808,"PRESTACION DE SERVICIOS DE PROMOCION Y PREVENCION – SERVICIOS_ESPECIALIZADOS_ZONA_BOGOTA","1/01/2022",1,"30/11/2022",11.1,"Invitación directa","GastosAdministrativos",250000000,250000000,"No","N/A","Gerencia de Abastecimiento Estratégico\ncontratacion@positiva.gov.co\nPBX: (1)6502200 Ext: 10641","SI","SI","NO","SI","Pública clasificada","C77392022-Tipo de información Pública clasificada-PRESTACION DE SERVICIOS DE PROMOCION Y PREVENCION – SERVICIOS_ESPECIALIZADOS_ZONA_BOGOTA"]
["PyP","Gerencia de administración del riesgo","No","C77402022",93141808,"PRESTACION DE SERVICIOS DE PROMOCION Y PREVENCION – SERVICIOS_ESPECIALIZADOS_ZONA_BOGOTA","1/01/2022",1,"30/11/2022",11.1,"Invitación directa","GastosAdministrativos",500000000,500000000,"No","N/A","Gerencia de Abastecimiento Estratégico\ncontratacion@positiva.gov.co\nPBX: (1)6502200 Ext: 10641","SI","SI","NO","SI","Pública clasificada","C77402022-Tipo de información Pública clasificada-PRESTACION DE SERVICIOS DE PROMOCION Y PREVENCION – SERVICIOS_ESPECIALIZADOS_ZONA_BOGOTA"]
["PyP","Gerencia de administración del riesgo","No","C77412022",93141808,"PRESTACION DE SERVICIOS DE PROMOCION Y PREVENCION – SERVICIOS_ESPECIALIZADOS_ZONA_BOGOTA","1/01/2022",1,"30/11/2022",11.1,"Invitación directa","GastosAdministrativos",210000000,210000000,"No","N/A","Gerencia de Abastecimiento Estratégico\ncontratacion@positiva.gov.co\nPBX: (1)6502200 Ext: 10641","SI","SI","NO","SI","Pública clasificada","C77412022-Tipo de información Pública clasificada-PRESTACION DE SERVICIOS DE PROMOCION Y PREVENCION – SERVICIOS_ESPECIALIZADOS_ZONA_BOGOTA"]
["PyP","Gerencia de administración del riesgo","No","C77422022",93141808,"PRESTACION DE SERVICIOS DE PROMOCION Y PREVENCION – SERVICIOS_ESPECIALIZADOS_ZONA_BOGOTA","1/01/2022",{"$f":"MONTH(G279)","v":1},"30/11/2022",11.1,"Invitación directa","GastosAdministrativos",130000000,130000000,"No","N/A","Gerencia de Abastecimiento Estratégico\ncontratacion@positiva.gov.co\nPBX: (1)6502200 Ext: 10641","SI","SI","NO","SI",{"$f":"IF(U279=\"SI\",\"Pública clasificada\",\"Pública\")","v":"Pública clasificada"},{"$f":"CONCATENATE(D279,\"-\",\"Tipo de información\",\" \",V279,\"-\",F279)","v":"C77422022-Tipo de información Pública clasificada-PRESTACION DE SERVICIOS DE PROMOCION Y PREVENCION – SERVICIOS_ESPECIALIZADOS_ZONA_BOGOTA"}]
["PyP","Gerencia de administración del riesgo","No","C77432022",93141808,"PRESTACION DE SERVICIOS DE PROMOCION Y PREVENCION – SERVICIOS_ESPECIALIZADOS_ZONA_BOGOTA","1/01/2022",1,"30/11/2022",11.1,"Invitación directa","GastosAdministrativos",140000000,140000000,"No","N/A","Gerencia de Abastecimiento Estratégico\ncontratacion@positiva.gov.co\nPBX: (1)6502200 Ext: 10641","SI","SI","NO","SI","Pública clasificada","C77432022-Tipo de información Pública clasificada-PRESTACION DE SERVICIOS DE PROMOCION Y PREVENCION – SERVICIOS_ESPECIALIZADOS_ZONA_BOGOTA"]
["PyP","Gerencia de administración del riesgo","No","C77442022",93141808,"PRESTACION DE SERVICIOS DE PROMOCION Y PREVENCION – SERVICIOS_ESPECIALIZADOS_ZONA_BOGOTA","1/01/2022",1,"30/11/2022",11.1,"Invitación directa","GastosAdministrativos",59000000,59000000,"No","N/A","Gerencia de Abastecimiento Estratégico\ncontratacion@positiva.gov.co\nPBX: (1)6502200 Ext: 10641","SI","SI","NO","SI","Pública clasificada","C77442022-Tipo de información Pública clasificada-PRESTACION DE SERVICIOS DE PROMOCION Y PREVENCION – SERVICIOS_ESPECIALIZADOS_ZONA_BOGOTA"]
["PyP","Gerencia de administración del riesgo","No","C77452022",93141808,"PRESTACION DE SERVICIOS DE PROMOCION Y PREVENCION – SERVICIOS_ESPECIALIZADOS_ZONA_BOGOTA","1/01/2022",1,"30/11/2022",11.1,"Invitación directa","GastosAdministrativos",470000000,470000000,"No","N/A","Gerencia de Abastecimiento Estratégico\ncontratacion@positiva.gov.co\nPBX: (1)6502200 Ext: 10641","SI","SI","NO","SI","Pública clasificada","C77452022-Tipo de información Pública clasificada-PRESTACION DE SERVICIOS DE PROMOCION Y PREVENCION – SERVICIOS_ESPECIALIZADOS_ZONA_BOGOTA"]
["PyP","Gerencia de administración del riesgo","No","C77462022",93141808,"PRESTACION DE SERVICIOS DE PROMOCION Y PREVENCION – SERVICIOS_ESPECIALIZADOS_ZONA_BOGOTA","1/01/2022",1,"30/11/2022",11.1,"Invitación directa","GastosAdministrativos",40000000,40000000,"No","N/A","Gerencia de Abastecimiento Estratégico\ncontratacion@positiva.gov.co\nPBX: (1)6502200 Ext: 10641","SI","SI","NO","SI","Pública clasificada","C77462022-Tipo de información Pública clasificada-PRESTACION DE SERVICIOS DE PROMOCION Y PREVENCION – SERVICIOS_ESPECIALIZADOS_ZONA_BOGOTA"]
["PyP","Gerencia de administración del riesgo","No","C77472022",93141808,"PRESTACION DE SERVICIOS DE PROMOCION Y PREVENCION – SERVICIOS_ESPECIALIZADOS_ZONA_BOGOTA","1/01/2022",1,"30/11/2022",11.1,"Invitación directa","GastosAdministrativos",67000000,67000000,"No","N/A","Gerencia de Abastecimiento Estratégico\ncontratacion@positiva.gov.co\nPBX: (1)6502200 Ext: 10641","SI","SI","NO","SI","Pública clasificada","C77472022-Tipo de información Pública clasificada-PRESTACION DE SERVICIOS DE PROMOCION Y PREVENCION – SERVICIOS_ESPECIALIZADOS_ZONA_BOGOTA"]
["PyP","Gerencia de administración del riesgo","No","C77482022",93141808,"PRESTACION DE SERVICIOS DE PROMOCION Y PREVENCION – SERVICIOS_ESPECIALIZADOS_ZONA_BOGOTA","1/01/2022",1,"30/11/2022",{"$f":"(I285-G285)/30","v":11.1},"Invitación directa","GastosAdministrativos",2500000000,2500000000,"No","N/A","Gerencia de Abastecimiento Estratégico\ncontratacion@positiva.gov.co\nPBX: (1)6502200 Ext: 10641","SI","SI","NO","SI","Pública clasificada","C77482022-Tipo de información Pública clasificada-PRESTACION DE SERVICIOS DE PROMOCION Y PREVENCION – SERVICIOS_ESPECIALIZADOS_ZONA_BOGOTA"]
["PyP","Gerencia de administración del riesgo","No","C77492022",93141808,"PRESTACION DE SERVICIOS DE PROMOCION Y PREVENCION – SERVICIOS_ESPECIALIZADOS_ZONA_BOGOTA","1/01/2022",1,"30/11/2022",11.1,"Invitación directa","GastosAdministrativos",400000000,400000000,"No","N/A","Gerencia de Abastecimiento Estratégico\ncontratacion@positiva.gov.co\nPBX: (1)6502200 Ext: 10641","SI","SI","NO","SI","Pública clasificada","C77492022-Tipo de información Pública clasificada-PRESTACION DE SERVICIOS DE PROMOCION Y PREVENCION – SERVICIOS_ESPECIALIZADOS_ZONA_BOGOTA"]
["PyP","Gerencia de administración del riesgo","No","C77502022",93141808,"PRESTACION DE SERVICIOS DE PROMOCION Y PREVENCION – SERVICIOS_ESPECIALIZADOS_ZONA_BOGOTA","1/01/2022",1,"30/11/2022",11.1,"Invitación directa","GastosAdministrativos",150000000,150000000,"No","N/A","Gerencia de Abastecimiento Estratégico\ncontratacion@positiva.gov.co\nPBX: (1)6502200 Ext: 10641","SI","SI","NO","SI","Pública clasificada","C77502022-Tipo de información Pública clasificada-PRESTACION DE SERVICIOS DE PROMOCION Y PREVENCION – SERVICIOS_ESPECIALIZADOS_ZONA_BOGOTA"]
["PyP","Gerencia de administración del riesgo","No","C77512022",93141808,"PRESTACION DE SERVICIOS DE PROMOCION Y PREVENCION – SERVICIOS_ESPECIALIZADOS_ZONA_BOGOTA","1/01/2022",1,"30/11/2022",11.1,"Invitación directa","GastosAdministrativos",500000000,500000000,"No","N/A","Gerencia de Abastecimiento Estratégico\ncontratacion@positiva.gov.co\nPBX: (1)6502200 Ext: 10641","SI","SI","NO","SI","Pública clasificada","C77512022-Tipo de información Pública clasificada-PRESTACION DE SERVICIOS DE PROMOCION Y PREVENCION – SERVICIOS_ESPECIALIZADOS_ZONA_BOGOTA"]
["PyP","Gerencia de administración del riesgo","No","C77522022",93141808,"PRESTACION DE SERVICIOS DE PROMOCION Y PREVENCION – SERVICIOS_ESPECIALIZADOS_ZONA_BOGOTA","1/01/2022",1,"30/11/2022",11.1,"Invitación directa","GastosAdministrativos",150000000,150000000,"No","N/A","Gerencia de Abastecimiento Estratégico\ncontratacion@positiva.gov.co\nPBX: (1)6502200 Ext: 10641","SI","SI","NO","SI","Pública clasificada","C77522022-Tipo de información Pública clasificada-PRESTACION DE SERVICIOS DE PROMOCION Y PREVENCION – SERVICIOS_ESPECIALIZADOS_ZONA_BOGOTA"]
["PyP","Gerencia de administración del riesgo","No","C77532022",93141808,"PRESTACION DE SERVICIOS DE PROMOCION Y PREVENCION – SERVICIOS_ESPECIALIZADOS_ZONA_BOGOTA","1/01/2022",1,"30/11/2022",11.1,"Invitación directa","GastosAdministrativos",56000000,56000000,"No","N/A","Gerencia de Abastecimiento Estratégico\ncontratacion@positiva.gov.co\nPBX: (1)6502200 Ext: 10641","SI","SI","NO","SI","Pública clasificada","C77532022-Tipo de información Pública clasificada-PRESTACION DE SERVICIOS DE PROMOCION Y PREVENCION – SERVICIOS_ESPECIALIZADOS_ZONA_BOGOTA"]
["PyP","Gerencia de administración del riesgo","No","C79362022",93141808,"PRESTACION DE SERVICIOS DE PROMOCION Y PREVENCION – SERVICIOS_ESPECIALIZADOS_ZONA_SANTANDER","1/01/2022",1,"30/11/2022",11.1,"Invitación directa","GastosAdministrativos",40000000,40000000,"No","N/A","Gerencia de Abastecimiento Estratégico\ncontratacion@positiva.gov.co\nPBX: (1)6502200 Ext: 10641","SI","SI","NO","SI","Pública clasificada","C79362022-Tipo de información Pública clasificada-PRESTACION DE SERVICIOS DE PROMOCION Y PREVENCION – SERVICIOS_ESPECIALIZADOS_ZONA_SANTANDER"]
["PyP","Gerencia de administración del riesgo","No","C81182022",93141808,"PRESTACION DE SERVICIOS DE PROMOCION Y PREVENCION – SERVICIOS_ESPECIALIZADOS_CUENTA_FGN","1/01/2022",1,"30/11/2022",11.1,"Invitación directa","GastosAdministrativos",40000000,40000000,"No","N/A","Gerencia de Abastecimiento Estratégico\ncontratacion@positiva.gov.co\nPBX: (1)6502200 Ext: 10641","SI","SI","NO","SI","Pública clasificada","C81182022-Tipo de información Pública clasificada-PRESTACION DE SERVICIOS DE PROMOCION Y PREVENCION – SERVICIOS_ESPECIALIZADOS_CUENTA_FGN"]
["PyP","Gerencia de administración del riesgo","No","C81192022",93141808,"PRESTACION DE SERVICIOS DE PROMOCION Y PREVENCION – SERVICIOS_ESPECIALIZADOS_CUENTA_FGN","1/01/2022",1,"30/11/2022",11.1,"Invitación directa","GastosAdministrativos",46000000,46000000,"No","N/A","Gerencia de Abastecimiento Estratégico\ncontratacion@positiva.gov.co\nPBX: (1)6502200 Ext: 10641","SI","SI","NO","SI","Pública clasificada","C81192022-Tipo de información Pública clasificada-PRESTACION DE SERVICIOS DE PROMOCION Y PREVENCION – SERVICIOS_ESPECIALIZADOS_CUENTA_FGN"]
["PyP","Gerencia de administración del riesgo","No","C81202022",93141808,"PRESTACION DE SERVICIOS DE PROMOCION Y PREVENCION – SERVICIOS_ESPECIALIZADOS_CUENTA_FGN","1/01/2022",1,"30/11/2022",11.1,"Invitación directa","GastosAdministrativos",75000000,75000000,"No","N/A","Gerencia de Abastecimiento Estratégico\ncontratacion@positiva.gov.co\nPBX: (1)6502200 Ext: 10641","SI","SI","NO","SI","Pública clasificada","C81202022-Tipo de información Pública clasificada-PRESTACION DE SERVICIOS DE PROMOCION Y PREVENCION – SERVICIOS_ESPECIALIZADOS_CUENTA_FGN"]
["PyP","Gerencia de administración del riesgo","No","C81212022",93141808,"PRESTACION DE SERVICIOS DE PROMOCION Y PREVENCION – SERVICIOS_ESPECIALIZADOS_CUENTA_FGN","1/01/2022",1,"30/11/2022",11.1,"Invitación directa","GastosAdministrativos",35000000,35000000,"No","N/A","Gerencia de Abastecimiento Estratégico\ncontratacion@positiva.gov.co\nPBX: (1)6502200 Ext: 10641","SI","SI","NO","SI","Pública clasificada","C81212022-Tipo de información Pública clasificada-PRESTACION DE SERVICIOS DE PROMOCION Y PREVENCION – SERVICIOS_ESPECIALIZADOS_CUENTA_FGN"]
["PyP","Gerencia de administración del riesgo","No","C81222022",93141808,"PRESTACION DE SERVICIOS DE PROMOCION Y PREVENCION – SERVICIOS_ESPECIALIZADOS_CUENTA_FGN","1/01/2022",1,"30/11/2022",11.1,"Invitación directa","GastosAdministrativos",75000000,75000000,"No","N/A","Gerencia de Abastecimiento Estratégico\ncontratacion@positiva.gov.co\nPBX: (1)6502200 Ext: 10641","SI","SI","NO","SI","Pública clasificada","C81222022-Tipo de información Pública clasificada-PRESTACION DE SERVICIOS DE PROMOCION Y PREVENCION – SERVICIOS_ESPECIALIZADOS_CUENTA_FGN"]
["PyP","Gerencia de administración del riesgo","No","C81232022",93141808,"PRESTACION DE SERVICIOS DE PROMOCION Y PREVENCION – SERVICIOS_ESPECIALIZADOS_CUENTA_FGN","1/01/2022",1,"30/11/2022",11.1,"Invitación directa","GastosAdministrativos",22000000,22000000,"No","N/A","Gerencia de Abastecimiento Estratégico\ncontratacion@positiva.gov.co\nPBX: (1)6502200 Ext: 10641","SI","SI","NO","SI","Pública clasificada","C81232022-Tipo de información Pública clasificada-PRESTACION DE SERVICIOS DE PROMOCION Y PREVENCION – SERVICIOS_ESPECIALIZADOS_CUENTA_FGN"]
["PyP","Gerencia de administración del riesgo","No","C81242022",93141808,"PRESTACION DE SERVICIOS DE PROMOCION Y PREVENCION – SERVICIOS_ESPECIALIZADOS_CUENTA_FGN","1/01/2022",1,"30/11/2022",11.1,"Invitación directa","GastosAdministrativos",45000000,45000000,"No","N/A","Gerencia de Abastecimiento Estratégico\ncontratacion@positiva.gov.co\nPBX: (1)6502200 Ext: 10641","SI","SI","NO","SI","Pública clasificada","C81242022-Tipo de información Pública clasificada-PRESTACION DE SERVICIOS DE PROMOCION Y PREVENCION – SERVICIOS_ESPECIALIZADOS_CUENTA_FGN"]
["PyP","Gerencia de administración del riesgo","No","C81252022",93141808,"PRESTACION DE SERVICIOS DE PROMOCION Y PREVENCION – SERVICIOS_ESPECIALIZADOS_CUENTA_FGN","1/01/2022",1,"30/11/2022",11.1,"Invitación directa","GastosAdministrativos",35000000,35000000,"No","N/A","Gerencia de Abastecimiento Estratégico\ncontratacion@positiva.gov.co\nPBX: (1)6502200 Ext: 10641","SI","SI","NO","SI","Pública clasificada","C81252022-Tipo de información Pública clasificada-PRESTACION DE SERVICIOS DE PROMOCION Y PREVENCION – SERVICIOS_ESPECIALIZADOS_CUENTA_FGN"]
["PyP","Gerencia de administración del riesgo","No","C81262022",93141808,"PRESTACION DE SERVICIOS DE PROMOCION Y PREVENCION – SERVICIOS_ESPECIALIZADOS_CUENTA_FGN","1/01/2022",1,"30/11/2022",11.1,"Invitación directa","GastosAdministrativos",23000000,23000000,"No","N/A","Gerencia de Abastecimiento Estratégico\ncontratacion@positiva.gov.co\nPBX: (1)6502200 Ext: 10641","SI","SI","NO","SI","Pública clasificada","C81262022-Tipo de información Pública clasificada-PRESTACION DE SERVICIOS DE PROMOCION Y PREVENCION – SERVICIOS_ESPECIALIZADOS_CUENTA_FGN"]
["PyP","Gerencia de administración del riesgo","No","C81272022",93141808,"PRESTACION DE SERVICIOS DE PROMOCION Y PREVENCION – SERVICIOS_ESPECIALIZADOS_CUENTA_FGN","1/01/2022",1,"30/11/2022",11.1,"Invitación directa","GastosAdministrativos",80000000,80000000,"No","N/A","Gerencia de Abastecimiento Estratégico\ncontratacion@positiva.gov.co\nPBX: (1)6502200 Ext: 10641","SI","SI","NO","SI","Pública clasificada","C81272022-Tipo de información Pública clasificada-PRESTACION DE SERVICIOS DE PROMOCION Y PREVENCION – SERVICIOS_ESPECIALIZADOS_CUENTA_FGN"]
["PyP","Gerencia de administración del riesgo","No","C81282022",93141808,"PRESTACION DE SERVICIOS DE PROMOCION Y PREVENCION – SERVICIOS_ESPECIALIZADOS_CUENTA_FGN","1/01/2022",1,"30/11/2022",11.1,"Invitación directa","GastosAdministrativos",200000000,200000000,"No","N/A","Gerencia de Abastecimiento Estratégico\ncontratacion@positiva.gov.co\nPBX: (1)6502200 Ext: 10641","SI","SI","NO","SI","Pública clasificada","C81282022-Tipo de información Pública clasificada-PRESTACION DE SERVICIOS DE PROMOCION Y PREVENCION – SERVICIOS_ESPECIALIZADOS_CUENTA_FGN"]
["PyP","Gerencia de administración del riesgo","No","C75222022",93141808,"PRESTACION DE SERVICIOS DE PROMOCION Y PREVENCION – SERVICIOS_ESPECIALIZADOS_ZONA_ANTIOQUIA","1/01/2022",1,"30/11/2022",11.1,"Invitación directa","GastosAdministrativos",30000000,30000000,"No","N/A","Gerencia de Abastecimiento Estratégico\ncontratacion@positiva.gov.co\nPBX: (1)6502200 Ext: 10641","SI","SI","NO","SI","Pública clasificada","C75222022-Tipo de información Pública clasificada-PRESTACION DE SERVICIOS DE PROMOCION Y PREVENCION – SERVICIOS_ESPECIALIZADOS_ZONA_ANTIOQUIA"]
["PyP","Gerencia de administración del riesgo","No","C75232022",93141808,"PRESTACION DE SERVICIOS DE PROMOCION Y PREVENCION – SERVICIOS_ESPECIALIZADOS_ZONA_ANTIOQUIA","1/01/2022",1,"30/11/2022",11.1,"Invitación directa","GastosAdministrativos",36000000,36000000,"No","N/A","Gerencia de Abastecimiento Estratégico\ncontratacion@positiva.gov.co\nPBX: (1)6502200 Ext: 10641","SI","SI","NO","SI","Pública clasificada","C75232022-Tipo de información Pública clasificada-PRESTACION DE SERVICIOS DE PROMOCION Y PREVENCION – SERVICIOS_ESPECIALIZADOS_ZONA_ANTIOQUIA"]
["PyP","Gerencia de administración del riesgo","No","C75242022",93141808,"PRESTACION DE SERVICIOS DE PROMOCION Y PREVENCION – SERVICIOS_ESPECIALIZADOS_ZONA_ANTIOQUIA","1/01/2022",1,"30/11/2022",11.1,"Invitación directa","GastosAdministrativos",160000000,160000000,"No","N/A","Gerencia de Abastecimiento Estratégico\ncontratacion@positiva.gov.co\nPBX: (1)6502200 Ext: 10641","SI","SI","NO","SI","Pública clasificada","C75242022-Tipo de información Pública clasificada-PRESTACION DE SERVICIOS DE PROMOCION Y PREVENCION – SERVICIOS_ESPECIALIZADOS_ZONA_ANTIOQUIA"]
["PyP","Gerencia de administración del riesgo","No","C75252022",93141808,"PRESTACION DE SERVICIOS DE PROMOCION Y PREVENCION – SERVICIOS_ESPECIALIZADOS_ZONA_ANTIOQUIA","1/01/2022",1,"30/11/2022",11.1,"Invitación directa","GastosAdministrativos",363392857,363392857,"No","N/A","Gerencia de Abastecimiento Estratégico\ncontratacion@positiva.gov.co\nPBX: (1)6502200 Ext: 10641","SI","SI","NO","SI","Pública clasificada","C75252022-Tipo de información Pública clasificada-PRESTACION DE SERVICIOS DE PROMOCION Y PREVENCION – SERVICIOS_ESPECIALIZADOS_ZONA_ANTIOQUIA"]
["PyP","Gerencia de administración del riesgo","No","C75272022",93141808,"PRESTACION DE SERVICIOS DE PROMOCION Y PREVENCION – SERVICIOS_ESPECIALIZADOS_ZONA_ANTIOQUIA","1/01/2022",1,"30/11/2022",11.1,"Invitación directa","GastosAdministrativos",80000000,80000000,"No","N/A","Gerencia de Abastecimiento Estratégico\ncontratacion@positiva.gov.co\nPBX: (1)6502200 Ext: 10641","SI","SI","NO","SI","Pública clasificada","C75272022-Tipo de información Pública clasificada-PRESTACION DE SERVICIOS DE PROMOCION Y PREVENCION – SERVICIOS_ESPECIALIZADOS_ZONA_ANTIOQUIA"]
["PyP","Gerencia de administración del riesgo","No","C75282022",93141808,"PRESTACION DE SERVICIOS DE PROMOCION Y PREVENCION – SERVICIOS_ESPECIALIZADOS_ZONA_ANTIOQUIA","1/01/2022",1,"30/11/2022",11.1,"Invitación directa","GastosAdministrativos",45000000,45000000,"No","N/A","Gerencia de Abastecimiento Estratégico\ncontratacion@positiva.gov.co\nPBX: (1)6502200 Ext: 10641","SI","SI","NO","SI","Pública clasificada","C75282022-Tipo de información Pública clasificada-PRESTACION DE SERVICIOS DE PROMOCION Y PREVENCION – SERVICIOS_ESPECIALIZADOS_ZONA_ANTIOQUIA"]
["PyP","Gerencia de administración del riesgo","No","C75292022",93141808,"PRESTACION DE SERVICIOS DE PROMOCION Y PREVENCION – SERVICIOS_ESPECIALIZADOS_ZONA_ANTIOQUIA","1/01/2022",1,"30/11/2022",11.1,"Invitación directa","GastosAdministrativos",60000000,60000000,"No","N/A","Gerencia de Abastecimiento Estratégico\ncontratacion@positiva.gov.co\nPBX: (1)6502200 Ext: 10641","SI","SI","NO","SI","Pública clasificada","C75292022-Tipo de información Pública clasificada-PRESTACION DE SERVICIOS DE PROMOCION Y PREVENCION – SERVICIOS_ESPECIALIZADOS_ZONA_ANTIOQUIA"]
["PyP","Gerencia de administración del riesgo","No","C76342022",93141808,"PRESTACION DE SERVICIOS DE PROMOCION Y PREVENCION – SERVICIOS_ESPECIALIZADOS_ZONA_ATLANTICO","1/01/2022",1,"30/11/2022",11.1,"Invitación directa","GastosAdministrativos",30645480,30645480,"No","N/A","Gerencia de Abastecimiento Estratégico\ncontratacion@positiva.gov.co\nPBX: (1)6502200 Ext: 10641","SI","SI","NO","SI","Pública clasificada","C76342022-Tipo de información Pública clasificada-PRESTACION DE SERVICIOS DE PROMOCION Y PREVENCION – SERVICIOS_ESPECIALIZADOS_ZONA_ATLANTICO"]
["PyP","Gerencia de administración del riesgo","No","C76352022",93141808,"PRESTACION DE SERVICIOS DE PROMOCION Y PREVENCION – SERVICIOS_ESPECIALIZADOS_ZONA_ATLANTICO","1/01/2022",1,"30/11/2022",11.1,"Invitación directa","GastosAdministrativos",40323000,40323000,"No","N/A","Gerencia de Abastecimiento Estratégico\ncontratacion@positiva.gov.co\nPBX: (1)6502200 Ext: 10641","SI","SI","NO","SI","Pública clasificada","C76352022-Tipo de información Pública clasificada-PRESTACION DE SERVICIOS DE PROMOCION Y PREVENCION – SERVICIOS_ESPECIALIZADOS_ZONA_ATLANTICO"]
["PyP","Gerencia de administración del riesgo","No","C76362022",93141808,"PRESTACION DE SERVICIOS DE PROMOCION Y PREVENCION – SERVICIOS_ESPECIALIZADOS_ZONA_ATLANTICO","1/01/2022",1,"30/11/2022",11.1,"Invitación directa","GastosAdministrativos",30750000,30750000,"No","N/A","Gerencia de Abastecimiento Estratégico\ncontratacion@positiva.gov.co\nPBX: (1)6502200 Ext: 10641","SI","SI","NO","SI","Pública clasificada","C76362022-Tipo de información Pública clasificada-PRESTACION DE SERVICIOS DE PROMOCION Y PREVENCION – SERVICIOS_ESPECIALIZADOS_ZONA_ATLANTICO"]
["PyP","Gerencia de administración del riesgo","No","C77542022",93141808,"PRESTACION DE SERVICIOS DE PROMOCION Y PREVENCION – SERVICIOS_ESPECIALIZADOS_ZONA_BOGOTA","1/01/2022",1,"30/11/2022",11.1,"Invitación directa","GastosAdministrativos",2100000000,2100000000,"No","N/A","Gerencia de Abastecimiento Estratégico\ncontratacion@positiva.gov.co\nPBX: (1)6502200 Ext: 10641","SI","SI","NO","SI","Pública clasificada","C77542022-Tipo de información Pública clasificada-PRESTACION DE SERVICIOS DE PROMOCION Y PREVENCION – SERVICIOS_ESPECIALIZADOS_ZONA_BOGOTA"]
["PyP","Gerencia de administración del riesgo","No","C77552022",93141808,"PRESTACION DE SERVICIOS DE PROMOCION Y PREVENCION – SERVICIOS_ESPECIALIZADOS_ZONA_BOGOTA","1/01/2022",1,"30/11/2022",11.1,"Invitación directa","GastosAdministrativos",500000000,500000000,"No","N/A","Gerencia de Abastecimiento Estratégico\ncontratacion@positiva.gov.co\nPBX: (1)6502200 Ext: 10641","SI","SI","NO","SI","Pública clasificada","C77552022-Tipo de información Pública clasificada-PRESTACION DE SERVICIOS DE PROMOCION Y PREVENCION – SERVICIOS_ESPECIALIZADOS_ZONA_BOGOTA"]
["PyP","Gerencia de administración del riesgo","No","C77582022",93141808,"PRESTACION DE SERVICIOS DE PROMOCION Y PREVENCION – SERVICIOS_ESPECIALIZADOS_ZONA_BOGOTA","1/01/2022",1,"30/11/2022",11.1,"Invitación directa","GastosAdministrativos",1500000000,1500000000,"No","N/A","Gerencia de Abastecimiento Estratégico\ncontratacion@positiva.gov.co\nPBX: (1)6502200 Ext: 10641","SI","SI","NO","SI","Pública clasificada","C77582022-Tipo de información Pública clasificada-PRESTACION DE SERVICIOS DE PROMOCION Y PREVENCION – SERVICIOS_ESPECIALIZADOS_ZONA_BOGOTA"]
["PyP","Gerencia de administración del riesgo","No","C77592022",93141808,"PRESTACION DE SERVICIOS DE PROMOCION Y PREVENCION – SERVICIOS_ESPECIALIZADOS_ZONA_BOGOTA","1/01/2022",1,"30/11/2022",11.1,"Invitación directa","GastosAdministrativos",700000000,700000000,"No","N/A","Gerencia de Abastecimiento Estratégico\ncontratacion@positiva.gov.co\nPBX: (1)6502200 Ext: 10641","SI","SI","NO","SI","Pública clasificada","C77592022-Tipo de información Pública clasificada-PRESTACION DE SERVICIOS DE PROMOCION Y PREVENCION – SERVICIOS_ESPECIALIZADOS_ZONA_BOGOTA"]
["PyP","Gerencia de administración del riesgo","No","C77602022",93141808,"PRESTACION DE SERVICIOS DE PROMOCION Y PREVENCION – SERVICIOS_ESPECIALIZADOS_ZONA_BOGOTA","1/01/2022",1,"30/11/2022",11.1,"Invitación directa","GastosAdministrativos",5200000000,5200000000,"No","N/A","Gerencia de Abastecimiento Estratégico\ncontratacion@positiva.gov.co\nPBX: (1)6502200 Ext: 10641","SI","SI","NO","SI","Pública clasificada","C77602022-Tipo de información Pública clasificada-PRESTACION DE SERVICIOS DE PROMOCION Y PREVENCION – SERVICIOS_ESPECIALIZADOS_ZONA_BOGOTA"]
["PyP","Gerencia de administración del riesgo","No","C77612022",93141808,"PRESTACION DE SERVICIOS DE PROMOCION Y PREVENCION – SERVICIOS_ESPECIALIZADOS_ZONA_BOGOTA","1/01/2022",1,"30/11/2022",11.1,"Invitación directa","GastosAdministrativos",37078653,37078653,"No","N/A","Gerencia de Abastecimiento Estratégico\ncontratacion@positiva.gov.co\nPBX: (1)6502200 Ext: 10641","SI","SI","NO","SI","Pública clasificada","C77612022-Tipo de información Pública clasificada-PRESTACION DE SERVICIOS DE PROMOCION Y PREVENCION – SERVICIOS_ESPECIALIZADOS_ZONA_BOGOTA"]
["PyP","Gerencia de administración del riesgo","No","C77622022",93141808,"PRESTACION DE SERVICIOS DE PROMOCION Y PREVENCION – SERVICIOS_ESPECIALIZADOS_ZONA_BOGOTA","1/01/2022",1,"30/11/2022",11.1,"Invitación directa","GastosAdministrativos",80000000,80000000,"No","N/A","Gerencia de Abastecimiento Estratégico\ncontratacion@positiva.gov.co\nPBX: (1)6502200 Ext: 10641","SI","SI","NO","SI","Pública clasificada","C77622022-Tipo de información Pública clasificada-PRESTACION DE SERVICIOS DE PROMOCION Y PREVENCION – SERVICIOS_ESPECIALIZADOS_ZONA_BOGOTA"]
["PyP","Gerencia de administración del riesgo","No","C77632022",93141808,"PRESTACION DE SERVICIOS DE PROMOCION Y PREVENCION – SERVICIOS_ESPECIALIZADOS_ZONA_BOGOTA","1/01/2022",1,"30/11/2022",11.1,"Invitación directa","GastosAdministrativos",60000000,60000000,"No","N/A","Gerencia de Abastecimiento Estratégico\ncontratacion@positiva.gov.co\nPBX: (1)6502200 Ext: 10641","SI","SI","NO","SI","Pública clasificada","C77632022-Tipo de información Pública clasificada-PRESTACION DE SERVICIOS DE PROMOCION Y PREVENCION – SERVICIOS_ESPECIALIZADOS_ZONA_BOGOTA"]
["PyP","Gerencia de administración del riesgo","No","C77642022",93141808,"PRESTACION DE SERVICIOS DE PROMOCION Y PREVENCION – SERVICIOS_ESPECIALIZADOS_ZONA_BOGOTA","1/01/2022",1,"30/11/2022",11.1,"Invitación directa","GastosAdministrativos",12000000,12000000,"No","N/A","Gerencia de Abastecimiento Estratégico\ncontratacion@positiva.gov.co\nPBX: (1)6502200 Ext: 10641","SI","SI","NO","SI","Pública clasificada","C77642022-Tipo de información Pública clasificada-PRESTACION DE SERVICIOS DE PROMOCION Y PREVENCION – SERVICIOS_ESPECIALIZADOS_ZONA_BOGOTA"]
["PyP","Gerencia de administración del riesgo","No","C77652022",93141808,"PRESTACION DE SERVICIOS DE PROMOCION Y PREVENCION – SERVICIOS_ESPECIALIZADOS_ZONA_BOGOTA","1/01/2022",1,"30/11/2022",11.1,"Invitación directa","GastosAdministrativos",236559140,236559140,"No","N/A","Gerencia de Abastecimiento Estratégico\ncontratacion@positiva.gov.co\nPBX: (1)6502200 Ext: 10641","SI","SI","NO","SI","Pública clasificada","C77652022-Tipo de información Pública clasificada-PRESTACION DE SERVICIOS DE PROMOCION Y PREVENCION – SERVICIOS_ESPECIALIZADOS_ZONA_BOGOTA"]
["PyP","Gerencia de administración del riesgo","No","C77662022",93141808,"PRESTACION DE SERVICIOS DE PROMOCION Y PREVENCION – SERVICIOS_ESPECIALIZADOS_ZONA_BOGOTA","1/01/2022",1,"30/11/2022",11.1,"Invitación directa","GastosAdministrativos",290000000,290000000,"No","N/A","Gerencia de Abastecimiento Estratégico\ncontratacion@positiva.gov.co\nPBX: (1)6502200 Ext: 10641","SI","SI","NO","SI","Pública clasificada","C77662022-Tipo de información Pública clasificada-PRESTACION DE SERVICIOS DE PROMOCION Y PREVENCION – SERVICIOS_ESPECIALIZADOS_ZONA_BOGOTA"]
["PyP","Gerencia de administración del riesgo","No","C77672022",93141808,"PRESTACION DE SERVICIOS DE PROMOCION Y PREVENCION – SERVICIOS_ESPECIALIZADOS_ZONA_BOGOTA","1/01/2022",1,"30/11/2022",11.1,"Invitación directa","GastosAdministrativos",35000000,35000000,"No","N/A","Gerencia de Abastecimiento Estratégico\ncontratacion@positiva.gov.co\nPBX: (1)6502200 Ext: 10641","SI","SI","NO","SI","Pública clasificada","C77672022-Tipo de información Pública clasificada-PRESTACION DE SERVICIOS DE PROMOCION Y PREVENCION – SERVICIOS_ESPECIALIZADOS_ZONA_BOGOTA"]
["PyP","Gerencia de administración del riesgo","No","C77682022",93141808,"PRESTACION DE SERVICIOS DE PROMOCION Y PREVENCION – SERVICIOS_ESPECIALIZADOS_ZONA_BOGOTA","1/01/2022",1,"30/11/2022",11.1,"Invitación directa","GastosAdministrativos",58000000,58000000,"No","N/A","Gerencia de Abastecimiento Estratégico\ncontratacion@positiva.gov.co\nPBX: (1)6502200 Ext: 10641","SI","SI","NO","SI","Pública clasificada","C77682022-Tipo de información Pública clasificada-PRESTACION DE SERVICIOS DE PROMOCION Y PREVENCION – SERVICIOS_ESPECIALIZADOS_ZONA_BOGOTA"]
["PyP","Gerencia de administración del riesgo","No","C77692022",93141808,"PRESTACION DE SERVICIOS DE PROMOCION Y PREVENCION – SERVICIOS_ESPECIALIZADOS_ZONA_BOGOTA","1/01/2022",1,"30/11/2022",11.1,"Invitación directa","GastosAdministrativos",100000000,100000000,"No","N/A","Gerencia de Abastecimiento Estratégico\ncontratacion@positiva.gov.co\nPBX: (1)6502200 Ext: 10641","SI","SI","NO","SI","Pública clasificada","C77692022-Tipo de información Pública clasificada-PRESTACION DE SERVICIOS DE PROMOCION Y PREVENCION – SERVICIOS_ESPECIALIZADOS_ZONA_BOGOTA"]
["PyP","Gerencia de administración del riesgo","No","C77702022",93141808,"PRESTACION DE SERVICIOS DE PROMOCION Y PREVENCION – SERVICIOS_ESPECIALIZADOS_ZONA_BOGOTA","1/01/2022",1,"30/11/2022",11.1,"Invitación directa","GastosAdministrativos",60000000,60000000,"No","N/A","Gerencia de Abastecimiento Estratégico\ncontratacion@positiva.gov.co\nPBX: (1)6502200 Ext: 10641","SI","SI","NO","SI","Pública clasificada","C77702022-Tipo de información Pública clasificada-PRESTACION DE SERVICIOS DE PROMOCION Y PREVENCION – SERVICIOS_ESPECIALIZADOS_ZONA_BOGOTA"]
["PyP","Gerencia de administración del riesgo","No","C77712022",93141808,"PRESTACION DE SERVICIOS DE PROMOCION Y PREVENCION – SERVICIOS_ESPECIALIZADOS_ZONA_BOGOTA","1/01/2022",1,"30/11/2022",11.1,"Invitación directa","GastosAdministrativos",100000000,100000000,"No","N/A","Gerencia de Abastecimiento Estratégico\ncontratacion@positiva.gov.co\nPBX: (1)6502200 Ext: 10641","SI","SI","NO","SI","Pública clasificada","C77712022-Tipo de información Pública clasificada-PRESTACION DE SERVICIOS DE PROMOCION Y PREVENCION – SERVICIOS_ESPECIALIZADOS_ZONA_BOGOTA"]
["PyP","Gerencia de administración del riesgo","No","C77722022",93141808,"PRESTACION DE SERVICIOS DE PROMOCION Y PREVENCION – SERVICIOS_ESPECIALIZADOS_ZONA_BOGOTA","1/01/2022",1,"30/11/2022",11.1,"Invitación directa","GastosAdministrativos",70000000,70000000,"No","N/A","Gerencia de Abastecimiento Estratégico\ncontratacion@positiva.gov.co\nPBX: (1)6502200 Ext: 10641","SI","SI","NO","SI","Pública clasificada","C77722022-Tipo de información Pública clasificada-PRESTACION DE SERVICIOS DE PROMOCION Y PREVENCION – SERVICIOS_ESPECIALIZADOS_ZONA_BOGOTA"]
["PyP","Gerencia de administración del riesgo","No","C77732022",93141808,"PRESTACION DE SERVICIOS DE PROMOCION Y PREVENCION – SERVICIOS_ESPECIALIZADOS_ZONA_BOGOTA","1/01/2022",1,"30/11/2022",11.1,"Invitación directa","GastosAdministrativos",100000000,100000000,"No","N/A","Gerencia de Abastecimiento Estratégico\ncontratacion@positiva.gov.co\nPBX: (1)6502200 Ext: 10641","SI","SI","NO","SI","Pública clasificada","C77732022-Tipo de información Pública clasificada-PRESTACION DE SERVICIOS DE PROMOCION Y PREVENCION – SERVICIOS_ESPECIALIZADOS_ZONA_BOGOTA"]
["PyP","Gerencia de administración del riesgo","No","C77742022",93141808,"PRESTACION DE SERVICIOS DE PROMOCION Y PREVENCION – SERVICIOS_ESPECIALIZADOS_ZONA_BOGOTA","1/01/2022",1,"30/11/2022",11.1,"Invitación directa","GastosAdministrativos",90000000,90000000,"No","N/A","Gerencia de Abastecimiento Estratégico\ncontratacion@positiva.gov.co\nPBX: (1)6502200 Ext: 10641","SI","SI","NO","SI","Pública clasificada","C77742022-Tipo de información Pública clasificada-PRESTACION DE SERVICIOS DE PROMOCION Y PREVENCION – SERVICIOS_ESPECIALIZADOS_ZONA_BOGOTA"]
["PyP","Gerencia de administración del riesgo","No","C77752022",93141808,"PRESTACION DE SERVICIOS DE PROMOCION Y PREVENCION – SERVICIOS_ESPECIALIZADOS_ZONA_BOGOTA","1/01/2022",1,"30/11/2022",11.1,"Invitación directa","GastosAdministrativos",450000000,450000000,"No","N/A","Gerencia de Abastecimiento Estratégico\ncontratacion@positiva.gov.co\nPBX: (1)6502200 Ext: 10641","SI","SI","NO","SI","Pública clasificada","C77752022-Tipo de información Pública clasificada-PRESTACION DE SERVICIOS DE PROMOCION Y PREVENCION – SERVICIOS_ESPECIALIZADOS_ZONA_BOGOTA"]
["PyP","Gerencia de administración del riesgo","No","C77762022",93141808,"PRESTACION DE SERVICIOS DE PROMOCION Y PREVENCION – SERVICIOS_ESPECIALIZADOS_ZONA_BOGOTA","1/01/2022",1,"30/11/2022",11.1,"Invitación directa","GastosAdministrativos",160000000,160000000,"No","N/A","Gerencia de Abastecimiento Estratégico\ncontratacion@positiva.gov.co\nPBX: (1)6502200 Ext: 10641","SI","SI","NO","SI","Pública clasificada","C77762022-Tipo de información Pública clasificada-PRESTACION DE SERVICIOS DE PROMOCION Y PREVENCION – SERVICIOS_ESPECIALIZADOS_ZONA_BOGOTA"]
["PyP","Gerencia de administración del riesgo","No","C77772022",93141808,"PRESTACION DE SERVICIOS DE PROMOCION Y PREVENCION – SERVICIOS_ESPECIALIZADOS_ZONA_BOGOTA","1/01/2022",1,"30/11/2022",11.1,"Invitación directa","GastosAdministrativos",300000000,300000000,"No","N/A","Gerencia de Abastecimiento Estratégico\ncontratacion@positiva.gov.co\nPBX: (1)6502200 Ext: 10641","SI","SI","NO","SI","Pública clasificada","C77772022-Tipo de información Pública clasificada-PRESTACION DE SERVICIOS DE PROMOCION Y PREVENCION – SERVICIOS_ESPECIALIZADOS_ZONA_BOGOTA"]
["PyP","Gerencia de administración del riesgo","No","C77782022",93141808,"PRESTACION DE SERVICIOS DE PROMOCION Y PREVENCION – SERVICIOS_ESPECIALIZADOS_ZONA_BOGOTA","1/01/2022",1,"30/11/2022",11.1,"Invitación directa","GastosAdministrativos",170000000,170000000,"No","N/A","Gerencia de Abastecimiento Estratégico\ncontratacion@positiva.gov.co\nPBX: (1)6502200 Ext: 10641","SI","SI","NO","SI","Pública clasificada","C77782022-Tipo de información Pública clasificada-PRESTACION DE SERVICIOS DE PROMOCION Y PREVENCION – SERVICIOS_ESPECIALIZADOS_ZONA_BOGOTA"]
["PyP","Gerencia de administración del riesgo","No","C77792022",93141808,"PRESTACION DE SERVICIOS DE PROMOCION Y PREVENCION – SERVICIOS_ESPECIALIZADOS_ZONA_BOGOTA","1/01/2022",1,"30/11/2022",11.1,"Invitación directa","GastosAdministrativos",100000000,100000000,"No","N/A","Gerencia de Abastecimiento Estratégico\ncontratacion@positiva.gov.co\nPBX: (1)6502200 Ext: 10641","SI","SI","NO","SI","Pública clasificada","C77792022-Tipo de información Pública clasificada-PRESTACION DE SERVICIOS DE PROMOCION Y PREVENCION – SERVICIOS_ESPECIALIZADOS_ZONA_BOGOTA"]
["PyP","Gerencia de administración del riesgo","No","C77802022",93141808,"PRESTACION DE SERVICIOS DE PROMOCION Y PREVENCION – SERVICIOS_ESPECIALIZADOS_ZONA_BOGOTA","1/01/2022",1,"30/11/2022",11.1,"Invitación directa","GastosAdministrativos",30000000,30000000,"No","N/A","Gerencia de Abastecimiento Estratégico\ncontratacion@positiva.gov.co\nPBX: (1)6502200 Ext: 10641","SI","SI","NO","SI","Pública clasificada","C77802022-Tipo de información Pública clasificada-PRESTACION DE SERVICIOS DE PROMOCION Y PREVENCION – SERVICIOS_ESPECIALIZADOS_ZONA_BOGOTA"]
["PyP","Gerencia de administración del riesgo","No","C77812022",93141808,"PRESTACION DE SERVICIOS DE PROMOCION Y PREVENCION – SERVICIOS_ESPECIALIZADOS_ZONA_BOGOTA","1/01/2022",1,"30/11/2022",11.1,"Invitación directa","GastosAdministrativos",107528000,107528000,"No","N/A","Gerencia de Abastecimiento Estratégico\ncontratacion@positiva.gov.co\nPBX: (1)6502200 Ext: 10641","SI","SI","NO","SI","Pública clasificada","C77812022-Tipo de información Pública clasificada-PRESTACION DE SERVICIOS DE PROMOCION Y PREVENCION – SERVICIOS_ESPECIALIZADOS_ZONA_BOGOTA"]
["PyP","Gerencia de administración del riesgo","No","C77822022",93141808,"PRESTACION DE SERVICIOS DE PROMOCION Y PREVENCION – SERVICIOS_ESPECIALIZADOS_ZONA_BOGOTA","1/01/2022",1,"30/11/2022",11.1,"Invitación directa","GastosAdministrativos",50000000,50000000,"No","N/A","Gerencia de Abastecimiento Estratégico\ncontratacion@positiva.gov.co\nPBX: (1)6502200 Ext: 10641","SI","SI","NO","SI","Pública clasificada","C77822022-Tipo de información Pública clasificada-PRESTACION DE SERVICIOS DE PROMOCION Y PREVENCION – SERVICIOS_ESPECIALIZADOS_ZONA_BOGOTA"]
["PyP","Gerencia de administración del riesgo","No","C81292022",93141808,"PRESTACION DE SERVICIOS DE PROMOCION Y PREVENCION – SERVICIOS_ESPECIALIZADOS_CUENTA_FGN","1/01/2022",1,"30/11/2022",11.1,"Invitación directa","GastosAdministrativos",3850000000,3850000000,"No","N/A","Gerencia de Abastecimiento Estratégico\ncontratacion@positiva.gov.co\nPBX: (1)6502200 Ext: 10641","SI","SI","NO","SI","Pública clasificada","C81292022-Tipo de información Pública clasificada-PRESTACION DE SERVICIOS DE PROMOCION Y PREVENCION – SERVICIOS_ESPECIALIZADOS_CUENTA_FGN"]
["PyP","Gerencia de administración del riesgo","No","C81302022",93141808,"PRESTACION DE SERVICIOS DE PROMOCION Y PREVENCION – SERVICIOS_ESPECIALIZADOS_CUENTA_FGN","1/01/2022",1,"30/11/2022",11.1,"Invitación directa","GastosAdministrativos",20000000,20000000,"No","N/A","Gerencia de Abastecimiento Estratégico\ncontratacion@positiva.gov.co\nPBX: (1)6502200 Ext: 10641","SI","SI","NO","SI","Pública clasificada","C81302022-Tipo de información Pública clasificada-PRESTACION DE SERVICIOS DE PROMOCION Y PREVENCION – SERVICIOS_ESPECIALIZADOS_CUENTA_FGN"]
["PyP","Gerencia de administración del riesgo","No","C81312022",93141808,"PRESTACION DE SERVICIOS DE PROMOCION Y PREVENCION – SERVICIOS_ESPECIALIZADOS_CUENTA_FGN","1/01/2022",1,"30/11/2022",11.1,"Invitación directa","GastosAdministrativos",36000000,36000000,"No","N/A","Gerencia de Abastecimiento Estratégico\ncontratacion@positiva.gov.co\nPBX: (1)6502200 Ext: 10641","SI","SI","NO","SI","Pública clasificada","C81312022-Tipo de información Pública clasificada-PRESTACION DE SERVICIOS DE PROMOCION Y PREVENCION – SERVICIOS_ESPECIALIZADOS_CUENTA_FGN"]
["PyP","Gerencia de administración del riesgo","No","C79372022",93141808,"PRESTACION DE SERVICIOS DE PROMOCION Y PREVENCION – SERVICIOS_ESPECIALIZADOS_ZONA_SANTANDER","1/01/2022",{"$f":"MONTH(G343)","v":1},"30/11/2022",11.1,"Invitación directa","GastosAdministrativos",44692300,44692300,"No","N/A","Gerencia de Abastecimiento Estratégico\ncontratacion@positiva.gov.co\nPBX: (1)6502200 Ext: 10641","SI","SI","NO","SI",{"$f":"IF(U343=\"SI\",\"Pública clasificada\",\"Pública\")","v":"Pública clasificada"},{"$f":"CONCATENATE(D343,\"-\",\"Tipo de información\",\" \",V343,\"-\",F343)","v":"C79372022-Tipo de información Pública clasificada-PRESTACION DE SERVICIOS DE PROMOCION Y PREVENCION – SERVICIOS_ESPECIALIZADOS_ZONA_SANTANDER"}]
["PyP","Gerencia de administración del riesgo","No","C79382022",93141808,"PRESTACION DE SERVICIOS DE PROMOCION Y PREVENCION – SERVICIOS_ESPECIALIZADOS_ZONA_SANTANDER","1/01/2022",1,"30/11/2022",11.1,"Invitación directa","GastosAdministrativos",46354412,46354412,"No","N/A","Gerencia de Abastecimiento Estratégico\ncontratacion@positiva.gov.co\nPBX: (1)6502200 Ext: 10641","SI","SI","NO","SI","Pública clasificada","C79382022-Tipo de información Pública clasificada-PRESTACION DE SERVICIOS DE PROMOCION Y PREVENCION – SERVICIOS_ESPECIALIZADOS_ZONA_SANTANDER"]
["PyP","Gerencia de administración del riesgo","No","C79392022",93141808,"PRESTACION DE SERVICIOS DE PROMOCION Y PREVENCION – SERVICIOS_ESPECIALIZADOS_ZONA_SANTANDER","1/01/2022",1,"30/11/2022",11.1,"Invitación directa","GastosAdministrativos",41000000,41000000,"No","N/A","Gerencia de Abastecimiento Estratégico\ncontratacion@positiva.gov.co\nPBX: (1)6502200 Ext: 10641","SI","SI","NO","SI","Pública clasificada","C79392022-Tipo de información Pública clasificada-PRESTACION DE SERVICIOS DE PROMOCION Y PREVENCION – SERVICIOS_ESPECIALIZADOS_ZONA_SANTANDER"]
["PyP","Gerencia de administración del riesgo","No","C80322022",93141808,"PRESTACION DE SERVICIOS DE PROMOCION Y PREVENCION – SERVICIOS_ESPECIALIZADOS_ZONA_VALLE","1/01/2022",1,"30/11/2022",11.1,"Invitación directa","GastosAdministrativos",94285714,94285714,"No","N/A","Gerencia de Abastecimiento Estratégico\ncontratacion@positiva.gov.co\nPBX: (1)6502200 Ext: 10641","SI","SI","NO","SI","Pública clasificada","C80322022-Tipo de información Pública clasificada-PRESTACION DE SERVICIOS DE PROMOCION Y PREVENCION – SERVICIOS_ESPECIALIZADOS_ZONA_VALLE"]
["PyP","Gerencia de administración del riesgo","No","C80332022",93141808,"PRESTACION DE SERVICIOS DE PROMOCION Y PREVENCION – SERVICIOS_ESPECIALIZADOS_ZONA_VALLE","1/01/2022",1,"30/11/2022",11.1,"Invitación directa","GastosAdministrativos",80208333,80208333,"No","N/A","Gerencia de Abastecimiento Estratégico\ncontratacion@positiva.gov.co\nPBX: (1)6502200 Ext: 10641","SI","SI","NO","SI","Pública clasificada","C80332022-Tipo de información Pública clasificada-PRESTACION DE SERVICIOS DE PROMOCION Y PREVENCION – SERVICIOS_ESPECIALIZADOS_ZONA_VALLE"]
["PyP","Gerencia de administración del riesgo","No","C80342022",93141808,"PRESTACION DE SERVICIOS DE PROMOCION Y PREVENCION – SERVICIOS_ESPECIALIZADOS_ZONA_VALLE","1/01/2022",1,"30/11/2022",11.1,"Invitación directa","GastosAdministrativos",23206423,23206423,"No","N/A","Gerencia de Abastecimiento Estratégico\ncontratacion@positiva.gov.co\nPBX: (1)6502200 Ext: 10641","SI","SI","NO","SI","Pública clasificada","C80342022-Tipo de información Pública clasificada-PRESTACION DE SERVICIOS DE PROMOCION Y PREVENCION – SERVICIOS_ESPECIALIZADOS_ZONA_VALLE"]
["PyP","Gerencia de administración del riesgo","No","C80352022",93141808,"PRESTACION DE SERVICIOS DE PROMOCION Y PREVENCION – SERVICIOS_ESPECIALIZADOS_ZONA_VALLE","1/01/2022",1,"30/11/2022",{"$f":"(I349-G349)/30","v":11.1},"Invitación directa","GastosAdministrativos",92438516,92438516,"No","N/A","Gerencia de Abastecimiento Estratégico\ncontratacion@positiva.gov.co\nPBX: (1)6502200 Ext: 10641","SI","SI","NO","SI","Pública clasificada","C80352022-Tipo de información Pública clasificada-PRESTACION DE SERVICIOS DE PROMOCION Y PREVENCION – SERVICIOS_ESPECIALIZADOS_ZONA_VALLE"]
["PyP","Gerencia de administración del riesgo","No","C80362022",93141808,"PRESTACION DE SERVICIOS DE PROMOCION Y PREVENCION – SERVICIOS_ESPECIALIZADOS_ZONA_VALLE","1/01/2022",1,"30/11/2022",11.1,"Invitación directa","GastosAdministrativos",65562914,65562914,"No","N/A","Gerencia de Abastecimiento Estratégico\ncontratacion@positiva.gov.co\nPBX: (1)6502200 Ext: 10641","SI","SI","NO","SI","Pública clasificada","C80362022-Tipo de información Pública clasificada-PRESTACION DE SERVICIOS DE PROMOCION Y PREVENCION – SERVICIOS_ESPECIALIZADOS_ZONA_VALLE"]
["PyP","Gerencia de administración del riesgo","No","C75262022",93141808,"PRESTACION DE SERVICIOS DE PROMOCION Y PREVENCION – SERVICIOS_ESPECIALIZADOS_ZONA_ANTIOQUIA","1/01/2022",1,"30/11/2022",11.1,"Invitación directa","GastosAdministrativos",136363636,136363636,"No","N/A","Gerencia de Abastecimiento Estratégico\ncontratacion@positiva.gov.co\nPBX: (1)6502200 Ext: 10641","SI","SI","NO","SI","Pública clasificada","C75262022-Tipo de información Pública clasificada-PRESTACION DE SERVICIOS DE PROMOCION Y PREVENCION – SERVICIOS_ESPECIALIZADOS_ZONA_ANTIOQUIA"]
["PyP","Gerencia de administración del riesgo","No","C75302022",93141808,"PRESTACION DE SERVICIOS DE PROMOCION Y PREVENCION – SERVICIOS_ESPECIALIZADOS_ZONA_ANTIOQUIA","1/01/2022",1,"30/11/2022",11.1,"Invitación directa","GastosAdministrativos",346663599,346663599,"No","N/A","Gerencia de Abastecimiento Estratégico\ncontratacion@positiva.gov.co\nPBX: (1)6502200 Ext: 10641","SI","SI","NO","SI","Pública clasificada","C75302022-Tipo de información Pública clasificada-PRESTACION DE SERVICIOS DE PROMOCION Y PREVENCION – SERVICIOS_ESPECIALIZADOS_ZONA_ANTIOQUIA"]
["PyP","Gerencia de administración del riesgo","No","C75312022",93141808,"PRESTACION DE SERVICIOS DE PROMOCION Y PREVENCION – SERVICIOS_ESPECIALIZADOS_ZONA_ANTIOQUIA","1/01/2022",1,"30/11/2022",11.1,"Invitación directa","GastosAdministrativos",47142857,47142857,"No","N/A","Gerencia de Abastecimiento Estratégico\ncontratacion@positiva.gov.co\nPBX: (1)6502200 Ext: 10641","SI","SI","NO","SI","Pública clasificada","C75312022-Tipo de información Pública clasificada-PRESTACION DE SERVICIOS DE PROMOCION Y PREVENCION – SERVICIOS_ESPECIALIZADOS_ZONA_ANTIOQUIA"]
["PyP","Gerencia de administración del riesgo","No","C75322022",93141808,"PRESTACION DE SERVICIOS DE PROMOCION Y PREVENCION – SERVICIOS_ESPECIALIZADOS_ZONA_ANTIOQUIA","1/01/2022",1,"30/11/2022",11.1,"Invitación directa","GastosAdministrativos",62857143,62857143,"No","N/A","Gerencia de Abastecimiento Estratégico\ncontratacion@positiva.gov.co\nPBX: (1)6502200 Ext: 10641","SI","SI","NO","SI","Pública clasificada","C75322022-Tipo de información Pública clasificada-PRESTACION DE SERVICIOS DE PROMOCION Y PREVENCION – SERVICIOS_ESPECIALIZADOS_ZONA_ANTIOQUIA"]
["PyP","Gerencia de administración del riesgo","No","C75332022",93141808,"PRESTACION DE SERVICIOS DE PROMOCION Y PREVENCION – SERVICIOS_ESPECIALIZADOS_ZONA_ANTIOQUIA","1/01/2022",1,"30/11/2022",11.1,"Invitación directa","GastosAdministrativos",47142857,47142857,"No","N/A","Gerencia de Abastecimiento Estratégico\ncontratacion@positiva.gov.co\nPBX: (1)6502200 Ext: 10641","SI","SI","NO","SI","Pública clasificada","C75332022-Tipo de información Pública clasificada-PRESTACION DE SERVICIOS DE PROMOCION Y PREVENCION – SERVICIOS_ESPECIALIZADOS_ZONA_ANTIOQUIA"]
["PyP","Gerencia de administración del riesgo","No","C75342022",93141808,"PRESTACION DE SERVICIOS DE PROMOCION Y PREVENCION – SERVICIOS_ESPECIALIZADOS_ZONA_ANTIOQUIA","1/01/2022",1,"30/11/2022",11.1,"Invitación directa","GastosAdministrativos",94285714,94285714,"No","N/A","Gerencia de Abastecimiento Estratégico\ncontratacion@positiva.gov.co\nPBX: (1)6502200 Ext: 10641","SI","SI","NO","SI","Pública clasificada","C75342022-Tipo de información Pública clasificada-PRESTACION DE SERVICIOS DE PROMOCION Y PREVENCION – SERVICIOS_ESPECIALIZADOS_ZONA_ANTIOQUIA"]
["PyP","Gerencia de administración del riesgo","No","C75352022",93141808,"PRESTACION DE SERVICIOS DE PROMOCION Y PREVENCION – SERVICIOS_ESPECIALIZADOS_ZONA_ANTIOQUIA","1/01/2022",1,"30/11/2022",11.1,"Invitación directa","GastosAdministrativos",125714286,125714286,"No","N/A","Gerencia de Abastecimiento Estratégico\ncontratacion@positiva.gov.co\nPBX: (1)6502200 Ext: 10641","SI","SI","NO","SI","Pública clasificada","C75352022-Tipo de información Pública clasificada-PRESTACION DE SERVICIOS DE PROMOCION Y PREVENCION – SERVICIOS_ESPECIALIZADOS_ZONA_ANTIOQUIA"]
["PyP","Gerencia de administración del riesgo","No","C75362022",93141808,"PRESTACION DE SERVICIOS DE PROMOCION Y PREVENCION – SERVICIOS_ESPECIALIZADOS_ZONA_ANTIOQUIA","1/01/2022",1,"30/11/2022",11.1,"Invitación directa","GastosAdministrativos",344505495,344505495,"No","N/A","Gerencia de Abastecimiento Estratégico\ncontratacion@positiva.gov.co\nPBX: (1)6502200 Ext: 10641","SI","SI","NO","SI","Pública clasificada","C75362022-Tipo de información Pública clasificada-PRESTACION DE SERVICIOS DE PROMOCION Y PREVENCION – SERVICIOS_ESPECIALIZADOS_ZONA_ANTIOQUIA"]
["PyP","Gerencia de administración del riesgo","No","C75372022",93141808,"PRESTACION DE SERVICIOS DE PROMOCION Y PREVENCION – SERVICIOS_ESPECIALIZADOS_ZONA_ANTIOQUIA","1/01/2022",1,"30/11/2022",11.1,"Invitación directa","GastosAdministrativos",254697987,254697987,"No","N/A","Gerencia de Abastecimiento Estratégico\ncontratacion@positiva.gov.co\nPBX: (1)6502200 Ext: 10641","SI","SI","NO","SI","Pública clasificada","C75372022-Tipo de información Pública clasificada-PRESTACION DE SERVICIOS DE PROMOCION Y PREVENCION – SERVICIOS_ESPECIALIZADOS_ZONA_ANTIOQUIA"]
["PyP","Gerencia de administración del riesgo","No","C76372022",93141808,"PRESTACION DE SERVICIOS DE PROMOCION Y PREVENCION – SERVICIOS_ESPECIALIZADOS_ZONA_ATLANTICO","1/01/2022",1,"30/11/2022",11.1,"Invitación directa","GastosAdministrativos",13978640,13978640,"No","N/A","Gerencia de Abastecimiento Estratégico\ncontratacion@positiva.gov.co\nPBX: (1)6502200 Ext: 10641","SI","SI","NO","SI","Pública clasificada","C76372022-Tipo de información Pública clasificada-PRESTACION DE SERVICIOS DE PROMOCION Y PREVENCION – SERVICIOS_ESPECIALIZADOS_ZONA_ATLANTICO"]
["PyP","Gerencia de administración del riesgo","No","C82012022",93141808,"PRESTACION DE SERVICIOS DE PROMOCION Y PREVENCION – SERVICIOS_ESPECIALIZADOS_NIVEL_NACIONAL","1/01/2022",1,"30/11/2022",11.1,"Invitación directa","GastosAdministrativos",875796329,875796329,"No","N/A","Gerencia de Abastecimiento Estratégico\ncontratacion@positiva.gov.co\nPBX: (1)6502200 Ext: 10641","SI","SI","NO","SI","Pública clasificada","C82012022-Tipo de información Pública clasificada-PRESTACION DE SERVICIOS DE PROMOCION Y PREVENCION – SERVICIOS_ESPECIALIZADOS_NIVEL_NACIONAL"]
["PyP","Gerencia de administración del riesgo","No","C82022022",93141808,"PRESTACION DE SERVICIOS DE PROMOCION Y PREVENCION – SERVICIOS_ESPECIALIZADOS_NIVEL_NACIONAL","1/01/2022",1,"30/11/2022",11.1,"Invitación directa","GastosAdministrativos",504386591,504386591,"No","N/A","Gerencia de Abastecimiento Estratégico\ncontratacion@positiva.gov.co\nPBX: (1)6502200 Ext: 10641","SI","SI","NO","SI","Pública clasificada","C82022022-Tipo de información Pública clasificada-PRESTACION DE SERVICIOS DE PROMOCION Y PREVENCION – SERVICIOS_ESPECIALIZADOS_NIVEL_NACIONAL"]
["PyP","Gerencia de administración del riesgo","No","C82032022",93141808,"PRESTACION DE SERVICIOS DE PROMOCION Y PREVENCION – SERVICIOS_ESPECIALIZADOS_NIVEL_NACIONAL","1/01/2022",1,"30/11/2022",11.1,"Invitación directa","GastosAdministrativos",335698925,335698925,"No","N/A","Gerencia de Abastecimiento Estratégico\ncontratacion@positiva.gov.co\nPBX: (1)6502200 Ext: 10641","SI","SI","NO","SI","Pública clasificada","C82032022-Tipo de información Pública clasificada-PRESTACION DE SERVICIOS DE PROMOCION Y PREVENCION – SERVICIOS_ESPECIALIZADOS_NIVEL_NACIONAL"]
["PyP","Gerencia de administración del riesgo","No","C77832022",93141808,"PRESTACION DE SERVICIOS DE PROMOCION Y PREVENCION – SERVICIOS_ESPECIALIZADOS_ZONA_BOGOTA","1/01/2022",1,"30/11/2022",11.1,"Invitación directa","GastosAdministrativos",250000000,250000000,"No","N/A","Gerencia de Abastecimiento Estratégico\ncontratacion@positiva.gov.co\nPBX: (1)6502200 Ext: 10641","SI","SI","NO","SI","Pública clasificada","C77832022-Tipo de información Pública clasificada-PRESTACION DE SERVICIOS DE PROMOCION Y PREVENCION – SERVICIOS_ESPECIALIZADOS_ZONA_BOGOTA"]
["PyP","Gerencia de administración del riesgo","No","C82522022",93141808,"PRESTACION DE SERVICIOS DE PROMOCION Y PREVENCION – SUMINISTRO_EPP","28/10/2021",10,"31/03/2022",5.1333333333333337,"Invitación directa","GastosAdministrativos",3951510826,3951510826,"No","N/A","Gerencia de Abastecimiento Estratégico\ncontratacion@positiva.gov.co\nPBX: (1)6502200 Ext: 10641","SI","SI","NO","SI","Pública clasificada","C82522022-Tipo de información Pública clasificada-PRESTACION DE SERVICIOS DE PROMOCION Y PREVENCION – SUMINISTRO_EPP"]
["PyP","Gerencia de administración del riesgo","No","C82532022",93141808,"PRESTACION DE SERVICIOS DE PROMOCION Y PREVENCION – SUMINISTRO_EPP","2/11/2021",11,"31/03/2022",4.9666666666666668,"Invitación directa","GastosAdministrativos",1219020540,1219020540,"No","N/A","Gerencia de Abastecimiento Estratégico\ncontratacion@positiva.gov.co\nPBX: (1)6502200 Ext: 10641","SI","SI","NO","SI","Pública clasificada","C82532022-Tipo de información Pública clasificada-PRESTACION DE SERVICIOS DE PROMOCION Y PREVENCION – SUMINISTRO_EPP"]
["PyP","Gerencia de administración del riesgo","No","C82542022",93141808,"PRESTACION DE SERVICIOS DE PROMOCION Y PREVENCION – SUMINISTRO_EPP","29/10/2021",10,"31/03/2022",5.0999999999999996,"Invitación directa","GastosAdministrativos",1109387700,1109387700,"No","N/A","Gerencia de Abastecimiento Estratégico\ncontratacion@positiva.gov.co\nPBX: (1)6502200 Ext: 10641","SI","SI","NO","SI","Pública clasificada","C82542022-Tipo de información Pública clasificada-PRESTACION DE SERVICIOS DE PROMOCION Y PREVENCION – SUMINISTRO_EPP"]
["PyP","Gerencia de administración del riesgo","No","C82552022",93141808,"PRESTACION DE SERVICIOS DE PROMOCION Y PREVENCION – SUMINISTRO_EPP","8/11/2021",11,"31/03/2022",4.7666666666666666,"Invitación directa","GastosAdministrativos",1143844625,1143844625,"No","N/A","Gerencia de Abastecimiento Estratégico\ncontratacion@positiva.gov.co\nPBX: (1)6502200 Ext: 10641","SI","SI","NO","SI","Pública clasificada","C82552022-Tipo de información Pública clasificada-PRESTACION DE SERVICIOS DE PROMOCION Y PREVENCION – SUMINISTRO_EPP"]
["PyP","Gerencia de administración del riesgo","No","C82562022",93141808,"PRESTACION DE SERVICIOS DE PROMOCION Y PREVENCION – SUMINISTRO_EPP","2021-10-29",10,"31/03/2022",5.0999999999999996,"Invitación directa","GastosAdministrativos",755689722,755689722,"No","N/A","Gerencia de Abastecimiento Estratégico\ncontratacion@positiva.gov.co\nPBX: (1)6502200 Ext: 10641","SI","SI","NO","SI","Pública clasificada","C82562022-Tipo de información Pública clasificada-PRESTACION DE SERVICIOS DE PROMOCION Y PREVENCION – SUMINISTRO_EPP"]
["PyP","Gerencia de administración del riesgo","No","C75382022",93141808,"PRESTACION DE SERVICIOS DE PROMOCION Y PREVENCION – SERVICIOS_ESPECIALIZADOS_ZONA_ANTIOQUIA","1/01/2022",1,"30/11/2022",11.1,"Invitación directa","GastosAdministrativos",52258608,52258608,"No","N/A","Gerencia de Abastecimiento Estratégico\ncontratacion@positiva.gov.co\nPBX: (1)6502200 Ext: 10641","SI","SI","NO","SI","Pública clasificada","C75382022-Tipo de información Pública clasificada-PRESTACION DE SERVICIOS DE PROMOCION Y PREVENCION – SERVICIOS_ESPECIALIZADOS_ZONA_ANTIOQUIA"]
["PyP","Gerencia de administración del riesgo","No","C75392022",93141808,"PRESTACION DE SERVICIOS DE PROMOCION Y PREVENCION – SERVICIOS_ESPECIALIZADOS_ZONA_ANTIOQUIA","1/01/2022",1,"30/11/2022",11.1,"Invitación directa","GastosAdministrativos",157142857,157142857,"No","N/A","Gerencia de Abastecimiento Estratégico\ncontratacion@positiva.gov.co\nPBX: (1)6502200 Ext: 10641","SI","SI","NO","SI","Pública clasificada","C75392022-Tipo de información Pública clasificada-PRESTACION DE SERVICIOS DE PROMOCION Y PREVENCION – SERVICIOS_ESPECIALIZADOS_ZONA_ANTIOQUIA"]
["PyP","Gerencia de administración del riesgo","No","C75402022",93141808,"PRESTACION DE SERVICIOS DE PROMOCION Y PREVENCION – SERVICIOS_ESPECIALIZADOS_ZONA_ANTIOQUIA","1/01/2022",1,"30/11/2022",11.1,"Invitación directa","GastosAdministrativos",36407543,36407543,"No","N/A","Gerencia de Abastecimiento Estratégico\ncontratacion@positiva.gov.co\nPBX: (1)6502200 Ext: 10641","SI","SI","NO","SI","Pública clasificada","C75402022-Tipo de información Pública clasificada-PRESTACION DE SERVICIOS DE PROMOCION Y PREVENCION – SERVICIOS_ESPECIALIZADOS_ZONA_ANTIOQUIA"]
["PyP","Gerencia de administración del riesgo","No","C77562022",93141808,"PRESTACION DE SERVICIOS DE PROMOCION Y PREVENCION – SERVICIOS_ESPECIALIZADOS_ZONA_BOGOTA","1/01/2022",1,"30/11/2022",11.1,"Invitación directa","GastosAdministrativos",230000000,230000000,"No","N/A","Gerencia de Abastecimiento Estratégico\ncontratacion@positiva.gov.co\nPBX: (1)6502200 Ext: 10641","SI","SI","NO","SI","Pública clasificada","C77562022-Tipo de información Pública clasificada-PRESTACION DE SERVICIOS DE PROMOCION Y PREVENCION – SERVICIOS_ESPECIALIZADOS_ZONA_BOGOTA"]
["PyP","Gerencia de administración del riesgo","No","C75412022",93141808,"PRESTACION DE SERVICIOS DE PROMOCION Y PREVENCION – SERVICIOS_ESPECIALIZADOS_ZONA_ANTIOQUIA","1/01/2022",1,"30/11/2022",11.1,"Invitación directa","GastosAdministrativos",56838906,56838906,"No","N/A","Gerencia de Abastecimiento Estratégico\ncontratacion@positiva.gov.co\nPBX: (1)6502200 Ext: 10641","SI","SI","NO","SI","Pública clasificada","C75412022-Tipo de información Pública clasificada-PRESTACION DE SERVICIOS DE PROMOCION Y PREVENCION – SERVICIOS_ESPECIALIZADOS_ZONA_ANTIOQUIA"]
["PyP","Gerencia de administración del riesgo","No","C82042022",93141808,"PRESTACION DE SERVICIOS DE PROMOCION Y PREVENCION – ASESORES_POR_PROYECTO","16/01/2022",1,"30/09/2022",8.5666666666666664,"Invitación cerrada","GastosAdministrativos",7873886855,7873886855,"No","N/A","Gerencia de Abastecimiento Estratégico\ncontratacion@positiva.gov.co\nPBX: (1)6502200 Ext: 10641","SI","SI","NO","SI","Pública clasificada","C82042022-Tipo de información Pública clasificada-PRESTACION DE SERVICIOS DE PROMOCION Y PREVENCION – ASESORES_POR_PROYECTO"]
["PyP","Gerencia de administración del riesgo","No","C82052022",93141808,"PRESTACION DE SERVICIOS DE PROMOCION Y PREVENCION – ASESORES_POR_PROYECTO","16/01/2022",1,"30/09/2022",8.5666666666666664,"Invitación cerrada","GastosAdministrativos",6496005600,6496005600,"No","N/A","Gerencia de Abastecimiento Estratégico\ncontratacion@positiva.gov.co\nPBX: (1)6502200 Ext: 10641","SI","SI","NO","SI","Pública clasificada","C82052022-Tipo de información Pública clasificada-PRESTACION DE SERVICIOS DE PROMOCION Y PREVENCION – ASESORES_POR_PROYECTO"]
["PyP","Gerencia de administración del riesgo","No","C82062022",93141808,"PRESTACION DE SERVICIOS DE PROMOCION Y PREVENCION – ASESORES_POR_PROYECTO","1/01/2022",1,"24/01/2022",0.76666666666666672,"Invitación cerrada","GastosAdministrativos",348464130,348464130,"No","N/A","Gerencia de Abastecimiento Estratégico\ncontratacion@positiva.gov.co\nPBX: (1)6502200 Ext: 10641","SI","SI","NO","SI","Pública clasificada","C82062022-Tipo de información Pública clasificada-PRESTACION DE SERVICIOS DE PROMOCION Y PREVENCION – ASESORES_POR_PROYECTO"]
["PyP","Gerencia de administración del riesgo","No","C82072022",93141808,"PRESTACION DE SERVICIOS DE PROMOCION Y PREVENCION – ASESORES_POR_PROYECTO","1/01/2022",1,"24/01/2022",0.76666666666666672,"Invitación cerrada","GastosAdministrativos",825367200,825367200,"No","N/A","Gerencia de Abastecimiento Estratégico\ncontratacion@positiva.gov.co\nPBX: (1)6502200 Ext: 10641","SI","SI","NO","SI","Pública clasificada","C82072022-Tipo de información Pública clasificada-PRESTACION DE SERVICIOS DE PROMOCION Y PREVENCION – ASESORES_POR_PROYECTO"]
["PyP","Gerencia de administración del riesgo","No","C82082022",93141808,"PRESTACION DE SERVICIOS DE PROMOCION Y PREVENCION – ASESORES_POR_PROYECTO","1/01/2022",1,"24/01/2022",0.76666666666666672,"Invitación cerrada","GastosAdministrativos",871496600,871496600,"No","N/A","Gerencia de Abastecimiento Estratégico\ncontratacion@positiva.gov.co\nPBX: (1)6502200 Ext: 10641","SI","SI","NO","SI","Pública clasificada","C82082022-Tipo de información Pública clasificada-PRESTACION DE SERVICIOS DE PROMOCION Y PREVENCION – ASESORES_POR_PROYECTO"]
["PyP","Gerencia de administración del riesgo","No","C82092022",93141808,"PRESTACION DE SERVICIOS DE PROMOCION Y PREVENCION – ASESORES_POR_PROYECTO","1/01/2022",1,"24/01/2022",0.76666666666666672,"Invitación cerrada","GastosAdministrativos",80896973,80896973,"No","N/A","Gerencia de Abastecimiento Estratégico\ncontratacion@positiva.gov.co\nPBX: (1)6502200 Ext: 10641","SI","SI","NO","SI","Pública clasificada","C82092022-Tipo de información Pública clasificada-PRESTACION DE SERVICIOS DE PROMOCION Y PREVENCION – ASESORES_POR_PROYECTO"]
["PyP","Gerencia de administración del riesgo","No","C82102022",93141808,"PRESTACION DE SERVICIOS DE PROMOCION Y PREVENCION – ASESORES_POR_PROYECTO","1/01/2022",1,"24/01/2022",0.76666666666666672,"Invitación cerrada","GastosAdministrativos",175680000,175680000,"No","N/A","Gerencia de Abastecimiento Estratégico\ncontratacion@positiva.gov.co\nPBX: (1)6502200 Ext: 10641","SI","SI","NO","SI","Pública clasificada","C82102022-Tipo de información Pública clasificada-PRESTACION DE SERVICIOS DE PROMOCION Y PREVENCION – ASESORES_POR_PROYECTO"]
["PyP","Gerencia de administración del riesgo","No","C82112022",93141808,"PRESTACION DE SERVICIOS DE PROMOCION Y PREVENCION – ASESORES_POR_PROYECTO","1/01/2022",1,"24/01/2022",0.76666666666666672,"Invitación cerrada","GastosAdministrativos",390578560,390578560,"No","N/A","Gerencia de Abastecimiento Estratégico\ncontratacion@positiva.gov.co\nPBX: (1)6502200 Ext: 10641","SI","SI","NO","SI","Pública clasificada","C82112022-Tipo de información Pública clasificada-PRESTACION DE SERVICIOS DE PROMOCION Y PREVENCION – ASESORES_POR_PROYECTO"]
["PyP","Gerencia de administración del riesgo","No","C82122022",93141808,"PRESTACION DE SERVICIOS DE PROMOCION Y PREVENCION – ASESORES_POR_PROYECTO","16/01/2022",1,"30/09/2022",8.5666666666666664,"Invitación cerrada","GastosAdministrativos",360960264,360960264,"No","N/A","Gerencia de Abastecimiento Estratégico\ncontratacion@positiva.gov.co\nPBX: (1)6502200 Ext: 10641","SI","SI","NO","SI","Pública clasificada","C82122022-Tipo de información Pública clasificada-PRESTACION DE SERVICIOS DE PROMOCION Y PREVENCION – ASESORES_POR_PROYECTO"]
["PyP","Gerencia de administración del riesgo","No","C82132022",93141808,"PRESTACION DE SERVICIOS DE PROMOCION Y PREVENCION – EIS_NIVEL_NACIONAL","16/01/2022",1,"30/09/2022",8.5666666666666664,"Invitación cerrada","GastosAdministrativos",906022016,906022016,"No","N/A","Gerencia de Abastecimiento Estratégico\ncontratacion@positiva.gov.co\nPBX: (1)6502200 Ext: 10641","SI","SI","NO","SI","Pública clasificada","C82132022-Tipo de información Pública clasificada-PRESTACION DE SERVICIOS DE PROMOCION Y PREVENCION – EIS_NIVEL_NACIONAL"]
["PyP","Gerencia de administración del riesgo","No","C82142022",93141808,"PRESTACION DE SERVICIOS DE PROMOCION Y PREVENCION – ASESORES_POR_PROYECTO","25/01/2022",1,"30/09/2022",8.2666666666666675,"Invitación cerrada","GastosAdministrativos",4027841400,4027841400,"No","N/A","Gerencia de Abastecimiento Estratégico\ncontratacion@positiva.gov.co\nPBX: (1)6502200 Ext: 10641","SI","SI","NO","SI","Pública clasificada","C82142022-Tipo de información Pública clasificada-PRESTACION DE SERVICIOS DE PROMOCION Y PREVENCION – ASESORES_POR_PROYECTO"]
["PyP","Gerencia de administración del riesgo","No","C82152022",93141808,"PRESTACION DE SERVICIOS DE PROMOCION Y PREVENCION – ASESORES_POR_PROYECTO","25/01/2022",1,"30/09/2022",8.2666666666666675,"Invitación cerrada","GastosAdministrativos",3200886400,3200886400,"No","N/A","Gerencia de Abastecimiento Estratégico\ncontratacion@positiva.gov.co\nPBX: (1)6502200 Ext: 10641","SI","SI","NO","SI","Pública clasificada","C82152022-Tipo de información Pública clasificada-PRESTACION DE SERVICIOS DE PROMOCION Y PREVENCION – ASESORES_POR_PROYECTO"]
["PyP","Gerencia de administración del riesgo","No","C82162022",93141808,"PRESTACION DE SERVICIOS DE PROMOCION Y PREVENCION – ASESORES_POR_PROYECTO","25/01/2022",1,"30/09/2022",8.2666666666666675,"Invitación cerrada","GastosAdministrativos",3179451000,3179451000,"No","N/A","Gerencia de Abastecimiento Estratégico\ncontratacion@positiva.gov.co\nPBX: (1)6502200 Ext: 10641","SI","SI","NO","SI","Pública clasificada","C82162022-Tipo de información Pública clasificada-PRESTACION DE SERVICIOS DE PROMOCION Y PREVENCION – ASESORES_POR_PROYECTO"]
["PyP","Gerencia de administración del riesgo","No","C82172022",93141808,"PRESTACION DE SERVICIOS DE PROMOCION Y PREVENCION – ASESORES_POR_PROYECTO","25/01/2022",1,"30/09/2022",8.2666666666666675,"Invitación cerrada","GastosAdministrativos",1811700000,1811700000,"No","N/A","Gerencia de Abastecimiento Estratégico\ncontratacion@positiva.gov.co\nPBX: (1)6502200 Ext: 10641","SI","SI","NO","SI","Pública clasificada","C82172022-Tipo de información Pública clasificada-PRESTACION DE SERVICIOS DE PROMOCION Y PREVENCION – ASESORES_POR_PROYECTO"]
["PyP","Gerencia de administración del riesgo","No","C82182022",93141808,"PRESTACION DE SERVICIOS DE PROMOCION Y PREVENCION – ASESORES_POR_PROYECTO","25/01/2022",1,"30/09/2022",8.2666666666666675,"Invitación cerrada","GastosAdministrativos",834250032,834250032,"No","N/A","Gerencia de Abastecimiento Estratégico\ncontratacion@positiva.gov.co\nPBX: (1)6502200 Ext: 10641","SI","SI","NO","SI","Pública clasificada","C82182022-Tipo de información Pública clasificada-PRESTACION DE SERVICIOS DE PROMOCION Y PREVENCION – ASESORES_POR_PROYECTO"]
["PyP","Gerencia de administración del riesgo","No","C80372022",93141808,"PRESTACION DE SERVICIOS DE PROMOCION Y PREVENCION – SERVICIOS_ESPECIALIZADOS_ZONA_VALLE","1/01/2022",1,"30/11/2022",11.1,"Invitación cerrada","GastosAdministrativos",230000000,230000000,"No","N/A","Gerencia de Abastecimiento Estratégico\ncontratacion@positiva.gov.co\nPBX: (1)6502200 Ext: 10641","SI","SI","NO","SI","Pública clasificada","C80372022-Tipo de información Pública clasificada-PRESTACION DE SERVICIOS DE PROMOCION Y PREVENCION – SERVICIOS_ESPECIALIZADOS_ZONA_VALLE"]
["PyP","Gerencia de administración del riesgo","No","C82192022",93141808,"PRESTACION DE SERVICIOS DE PROMOCION Y PREVENCION – ASESORES_POR_PROYECTO","25/01/2022",1,"30/09/2022",8.2666666666666675,"Invitación cerrada","GastosAdministrativos",7553568000,7553568000,"No","N/A","Gerencia de Abastecimiento Estratégico\ncontratacion@positiva.gov.co\nPBX: (1)6502200 Ext: 10641","SI","SI","NO","SI","Pública clasificada","C82192022-Tipo de información Pública clasificada-PRESTACION DE SERVICIOS DE PROMOCION Y PREVENCION – ASESORES_POR_PROYECTO"]
["PyP","Gerencia de administración del riesgo","No","C82202022",93141808,"PRESTACION DE SERVICIOS DE PROMOCION Y PREVENCION – EIS_NIVEL_NACIONAL","25/01/2022",1,"30/09/2022",8.2666666666666675,"Invitación cerrada","GastosAdministrativos",9343352040,9343352040,"No","N/A","Gerencia de Abastecimiento Estratégico\ncontratacion@positiva.gov.co\nPBX: (1)6502200 Ext: 10641","SI","SI","NO","SI","Pública clasificada","C82202022-Tipo de información Pública clasificada-PRESTACION DE SERVICIOS DE PROMOCION Y PREVENCION – EIS_NIVEL_NACIONAL"]
["PyP","Gerencia de administración del riesgo","No","C76382022",93141808,"PRESTACION DE SERVICIOS DE PROMOCION Y PREVENCION – SERVICIOS_ESPECIALIZADOS_ZONA_ATLANTICO","25/01/2022",1,"30/11/2022",10.3,"Invitación directa","GastosAdministrativos",104302160,104302160,"No","N/A","Gerencia de Abastecimiento Estratégico\ncontratacion@positiva.gov.co\nPBX: (1)6502200 Ext: 10641","SI","SI","NO","SI","Pública clasificada","C76382022-Tipo de información Pública clasificada-PRESTACION DE SERVICIOS DE PROMOCION Y PREVENCION – SERVICIOS_ESPECIALIZADOS_ZONA_ATLANTICO"]
["PyP","Gerencia de administración del riesgo","No","C77842022",93141808,"PRESTACION DE SERVICIOS DE PROMOCION Y PREVENCION – SERVICIOS_ESPECIALIZADOS_ZONA_BOGOTA","15/01/2022",1,"30/11/2022",10.633333333333333,"Invitación directa","GastosAdministrativos",100000000,100000000,"No","N/A","Gerencia de Abastecimiento Estratégico\ncontratacion@positiva.gov.co\nPBX: (1)6502200 Ext: 10641","SI","SI","NO","SI","Pública clasificada","C77842022-Tipo de información Pública clasificada-PRESTACION DE SERVICIOS DE PROMOCION Y PREVENCION – SERVICIOS_ESPECIALIZADOS_ZONA_BOGOTA"]
["PyP","Gerencia de administración del riesgo","No","C77852022",93141808,"PRESTACION DE SERVICIOS DE PROMOCION Y PREVENCION – SERVICIOS_ESPECIALIZADOS_ZONA_BOGOTA","15/01/2022",1,"30/11/2022",10.633333333333333,"Invitación directa","GastosAdministrativos",100000000,100000000,"No","N/A","Gerencia de Abastecimiento Estratégico\ncontratacion@positiva.gov.co\nPBX: (1)6502200 Ext: 10641","SI","SI","NO","SI","Pública clasificada","C77852022-Tipo de información Pública clasificada-PRESTACION DE SERVICIOS DE PROMOCION Y PREVENCION – SERVICIOS_ESPECIALIZADOS_ZONA_BOGOTA"]
["PyP","Gerencia de administración del riesgo","No","C77572022",93141808,"PRESTACION DE SERVICIOS DE PROMOCION Y PREVENCION – SERVICIOS_ESPECIALIZADOS_ZONA_BOGOTA","15/01/2022",1,"30/11/2022",10.633333333333333,"Invitación directa","GastosAdministrativos",230000000,230000000,"No","N/A","Gerencia de Abastecimiento Estratégico\ncontratacion@positiva.gov.co\nPBX: (1)6502200 Ext: 10641","SI","SI","NO","SI","Pública clasificada","C77572022-Tipo de información Pública clasificada-PRESTACION DE SERVICIOS DE PROMOCION Y PREVENCION – SERVICIOS_ESPECIALIZADOS_ZONA_BOGOTA"]
["PyP","Gerencia de administración del riesgo","No","C77862022",93141808,"PRESTACION DE SERVICIOS DE PROMOCION Y PREVENCION – SERVICIOS_ESPECIALIZADOS_ZONA_BOGOTA","1/02/2022",2,"31/12/2022",11.1,"Invitación directa","GastosAdministrativos",250000000,250000000,"No","N/A","Gerencia de Abastecimiento Estratégico\ncontratacion@positiva.gov.co\nPBX: (1)6502200 Ext: 10641","SI","SI","NO","SI","Pública clasificada","C77862022-Tipo de información Pública clasificada-PRESTACION DE SERVICIOS DE PROMOCION Y PREVENCION – SERVICIOS_ESPECIALIZADOS_ZONA_BOGOTA"]
["PyP","Gerencia de administración del riesgo","No","C77872022",93141808,"PRESTACION DE SERVICIOS DE PROMOCION Y PREVENCION – SERVICIOS_ESPECIALIZADOS_ZONA_BOGOTA","1/02/2022",2,"31/12/2022",11.1,"Invitación directa","GastosAdministrativos",250000000,250000000,"No","N/A","Gerencia de Abastecimiento Estratégico\ncontratacion@positiva.gov.co\nPBX: (1)6502200 Ext: 10641","SI","SI","NO","SI","Pública clasificada","C77872022-Tipo de información Pública clasificada-PRESTACION DE SERVICIOS DE PROMOCION Y PREVENCION – SERVICIOS_ESPECIALIZADOS_ZONA_BOGOTA"]
["PyP","Gerencia de administración del riesgo","No","C75422022",93141808,"PRESTACION DE SERVICIOS DE PROMOCION Y PREVENCION – SERVICIOS_ESPECIALIZADOS_ZONA_ANTIOQUIA","1/02/2022",2,"30/11/2022",10.066666666666666,"Invitación directa","GastosAdministrativos",120000000,120000000,"No","N/A","Gerencia de Abastecimiento Estratégico\ncontratacion@positiva.gov.co\nPBX: (1)6502200 Ext: 10641","SI","SI","NO","SI","Pública clasificada","C75422022-Tipo de información Pública clasificada-PRESTACION DE SERVICIOS DE PROMOCION Y PREVENCION – SERVICIOS_ESPECIALIZADOS_ZONA_ANTIOQUIA"]
["PyP","Gerencia de administración del riesgo","No","C80382022",93141808,"PRESTACION DE SERVICIOS DE PROMOCION Y PREVENCION – SERVICIOS_ESPECIALIZADOS_ZONA_VALLE","1/02/2022",2,"31/12/2022",11.1,"Invitación directa","GastosAdministrativos",31900000,31900000,"No","N/A","Gerencia de Abastecimiento Estratégico\ncontratacion@positiva.gov.co\nPBX: (1)6502200 Ext: 10641","SI","SI","NO","SI","Pública clasificada","C80382022-Tipo de información Pública clasificada-PRESTACION DE SERVICIOS DE PROMOCION Y PREVENCION – SERVICIOS_ESPECIALIZADOS_ZONA_VALLE"]
["PyP","Gerencia de administración del riesgo","No","C81322022",93141808,"PRESTACION DE SERVICIOS DE PROMOCION Y PREVENCION – SERVICIOS_ESPECIALIZADOS_CUENTA_FGN","25/01/2022",1,"30/11/2022",10.3,"Invitación directa","GastosAdministrativos",258000000,258000000,"No","N/A","Gerencia de Abastecimiento Estratégico\ncontratacion@positiva.gov.co\nPBX: (1)6502200 Ext: 10641","SI","SI","NO","SI","Pública clasificada","C81322022-Tipo de información Pública clasificada-PRESTACION DE SERVICIOS DE PROMOCION Y PREVENCION – SERVICIOS_ESPECIALIZADOS_CUENTA_FGN"]
["PyP","Gerencia de administración del riesgo","No","C82212022",93141808,"PRESTACION DE SERVICIOS DE PROMOCION Y PREVENCION – SERVICIOS_ESPECIALIZADOS_NIVEL_NACIONAL","1/02/2022",2,"31/12/2022",11.1,"Invitación directa","GastosAdministrativos",250000000,250000000,"No","N/A","Gerencia de Abastecimiento Estratégico\ncontratacion@positiva.gov.co\nPBX: (1)6502200 Ext: 10641","SI","SI","NO","SI","Pública clasificada","C82212022-Tipo de información Pública clasificada-PRESTACION DE SERVICIOS DE PROMOCION Y PREVENCION – SERVICIOS_ESPECIALIZADOS_NIVEL_NACIONAL"]
["PyP","Gerencia de administración del riesgo","No","C82222022",93141808,"PRESTACION DE SERVICIOS DE PROMOCION Y PREVENCION – SERVICIOS_ESPECIALIZADOS_NIVEL_NACIONAL","1/02/2022",2,"30/11/2022",10.066666666666666,"Invitación directa","GastosAdministrativos",3452348230,3452348230,"No","N/A","Gerencia de Abastecimiento Estratégico\ncontratacion@positiva.gov.co\nPBX: (1)6502200 Ext: 10641","SI","SI","NO","SI","Pública clasificada","C82222022-Tipo de información Pública clasificada-PRESTACION DE SERVICIOS DE PROMOCION Y PREVENCION – SERVICIOS_ESPECIALIZADOS_NIVEL_NACIONAL"]
["PyP","Gerencia de Investigación del riesgo","No","C83012022",93141808,"PRESTACION DE SERVICIOS DE PROMOCION Y PREVENCION – EDUCA","1/01/2022",1,"30/11/2022",11.1,"Invitación directa","GastosAdministrativos",90000000,90000000,"No","N/A","Gerencia de Abastecimiento Estratégico\ncontratacion@positiva.gov.co\nPBX: (1)6502200 Ext: 10641","SI","SI","NO","SI","Pública clasificada","C83012022-Tipo de información Pública clasificada-PRESTACION DE SERVICIOS DE PROMOCION Y PREVENCION – EDUCA"]
["PyP","Gerencia de Investigación del riesgo","No","C83022022",93141808,"PRESTACION DE SERVICIOS DE PROMOCION Y PREVENCION – EDUCA","1/01/2022",1,"30/11/2022",11.1,"Invitación directa","GastosAdministrativos",730000000,730000000,"No","N/A","Gerencia de Abastecimiento Estratégico\ncontratacion@positiva.gov.co\nPBX: (1)6502200 Ext: 10641","SI","SI","NO","SI","Pública clasificada","C83022022-Tipo de información Pública clasificada-PRESTACION DE SERVICIOS DE PROMOCION Y PREVENCION – EDUCA"]
["PyP","Gerencia de Investigación del riesgo","No","C83032022",93141808,"PRESTACION DE SERVICIOS DE PROMOCION Y PREVENCION – EDUCA","1/01/2022",1,"30/11/2022",11.1,"Invitación directa","GastosAdministrativos",40000000,40000000,"No","N/A","Gerencia de Abastecimiento Estratégico\ncontratacion@positiva.gov.co\nPBX: (1)6502200 Ext: 10641","SI","SI","NO","SI","Pública clasificada","C83032022-Tipo de información Pública clasificada-PRESTACION DE SERVICIOS DE PROMOCION Y PREVENCION – EDUCA"]
["PyP","Gerencia de Investigación del riesgo","No","C83042022",93141808,"PRESTACION DE SERVICIOS DE PROMOCION Y PREVENCION – EDUCA","1/01/2022",{"$f":"MONTH(G407)","v":1},"30/11/2022",11.1,"Invitación directa","GastosAdministrativos",120000000,120000000,"No","N/A","Gerencia de Abastecimiento Estratégico\ncontratacion@positiva.gov.co\nPBX: (1)6502200 Ext: 10641","SI","SI","NO","SI",{"$f":"IF(U407=\"SI\",\"Pública clasificada\",\"Pública\")","v":"Pública clasificada"},{"$f":"CONCATENATE(D407,\"-\",\"Tipo de información\",\" \",V407,\"-\",F407)","v":"C83042022-Tipo de información Pública clasificada-PRESTACION DE SERVICIOS DE PROMOCION Y PREVENCION – EDUCA"}]
["PyP","Gerencia de Investigación del riesgo","No","C83052022",93141808,"PRESTACION DE SERVICIOS DE PROMOCION Y PREVENCION – EDUCA","1/01/2022",1,"30/11/2022",11.1,"Invitación directa","GastosAdministrativos",200000000,200000000,"No","N/A","Gerencia de Abastecimiento Estratégico\ncontratacion@positiva.gov.co\nPBX: (1)6502200 Ext: 10641","SI","SI","NO","SI","Pública clasificada","C83052022-Tipo de información Pública clasificada-PRESTACION DE SERVICIOS DE PROMOCION Y PREVENCION – EDUCA"]
["PyP","Gerencia de Investigación del riesgo","No","C83062022",93141808,"PRESTACION DE SERVICIOS DE PROMOCION Y PREVENCION – EDUCA","1/01/2022",1,"30/11/2022",11.1,"Invitación directa","GastosAdministrativos",100000000,100000000,"No","N/A","Gerencia de Abastecimiento Estratégico\ncontratacion@positiva.gov.co\nPBX: (1)6502200 Ext: 10641","SI","SI","NO","SI","Pública clasificada","C83062022-Tipo de información Pública clasificada-PRESTACION DE SERVICIOS DE PROMOCION Y PREVENCION – EDUCA"]
["PyP","Gerencia de Investigación del riesgo","No","C83072022",93141808,"PRESTACION DE SERVICIOS DE PROMOCION Y PREVENCION – EDUCA","1/01/2022",1,"30/11/2022",11.1,"Invitación directa","GastosAdministrativos",220000000,220000000,"No","N/A","Gerencia de Abastecimiento Estratégico\ncontratacion@positiva.gov.co\nPBX: (1)6502200 Ext: 10641","SI","SI","NO","SI","Pública clasificada","C83072022-Tipo de información Pública clasificada-PRESTACION DE SERVICIOS DE PROMOCION Y PREVENCION – EDUCA"]
["PyP","Gerencia de Investigación del riesgo","No","C83082022",93141808,"PRESTACION DE SERVICIOS DE PROMOCION Y PREVENCION – EDUCA","1/01/2022",1,"30/11/2022",11.1,"Invitación directa","GastosAdministrativos",100000000,100000000,"No","N/A","Gerencia de Abastecimiento Estratégico\ncontratacion@positiva.gov.co\nPBX: (1)6502200 Ext: 10641","SI","SI","NO","SI","Pública clasificada","C83082022-Tipo de información Pública clasificada-PRESTACION DE SERVICIOS DE PROMOCION Y PREVENCION – EDUCA"]
["PyP","Gerencia de Investigación del riesgo","No","C83092022",93141808,"PRESTACION DE SERVICIOS DE PROMOCION Y PREVENCION – EDUCA","1/01/2022",1,"30/11/2022",11.1,"Invitación directa","GastosAdministrativos",258611472,258611472,"No","N/A","Gerencia de Abastecimiento Estratégico\ncontratacion@positiva.gov.co\nPBX: (1)6502200 Ext: 10641","SI","SI","NO","SI","Pública clasificada","C83092022-Tipo de información Pública clasificada-PRESTACION DE SERVICIOS DE PROMOCION Y PREVENCION – EDUCA"]
["PyP","Gerencia de Investigación del riesgo","No","C83102022",93141808,"PRESTACION DE SERVICIOS DE PROMOCION Y PREVENCION – EDUCA","1/01/2022",1,"30/11/2022",{"$f":"(I413-G413)/30","v":11.1},"Invitación directa","GastosAdministrativos",100000000,100000000,"No","N/A","Gerencia de Abastecimiento Estratégico\ncontratacion@positiva.gov.co\nPBX: (1)6502200 Ext: 10641","SI","SI","NO","SI","Pública clasificada","C83102022-Tipo de información Pública clasificada-PRESTACION DE SERVICIOS DE PROMOCION Y PREVENCION – EDUCA"]
["PyP","Gerencia de Investigación del riesgo","No","C83112022",93141808,"PRESTACION DE SERVICIOS DE PROMOCION Y PREVENCION – EDUCA","1/01/2022",1,"30/11/2022",11.1,"Invitación directa","GastosAdministrativos",150000000,150000000,"No","N/A","Gerencia de Abastecimiento Estratégico\ncontratacion@positiva.gov.co\nPBX: (1)6502200 Ext: 10641","SI","SI","NO","SI","Pública clasificada","C83112022-Tipo de información Pública clasificada-PRESTACION DE SERVICIOS DE PROMOCION Y PREVENCION – EDUCA"]
["PyP","Gerencia de Investigación del riesgo","No","C83122022",93141808,"PRESTACION DE SERVICIOS DE PROMOCION Y PREVENCION – EDUCA","1/01/2022",1,"30/11/2022",11.1,"Invitación directa","GastosAdministrativos",75489515,75489515,"No","N/A","Gerencia de Abastecimiento Estratégico\ncontratacion@positiva.gov.co\nPBX: (1)6502200 Ext: 10641","SI","SI","NO","SI","Pública clasificada","C83122022-Tipo de información Pública clasificada-PRESTACION DE SERVICIOS DE PROMOCION Y PREVENCION – EDUCA"]
["PyP","Gerencia de Investigación del riesgo","No","C83132022",93141808,"PRESTACION DE SERVICIOS DE PROMOCION Y PREVENCION – EDUCA","1/01/2022",1,"30/11/2022",11.1,"Invitación directa","GastosAdministrativos",180000000,180000000,"No","N/A","Gerencia de Abastecimiento Estratégico\ncontratacion@positiva.gov.co\nPBX: (1)6502200 Ext: 10641","SI","SI","NO","SI","Pública clasificada","C83132022-Tipo de información Pública clasificada-PRESTACION DE SERVICIOS DE PROMOCION Y PREVENCION – EDUCA"]
["PyP","Gerencia de Investigación del riesgo","No","C83142022",93141808,"PRESTACION DE SERVICIOS DE PROMOCION Y PREVENCION – EDUCA","1/02/2022",2,"31/12/2022",11.1,"Invitación directa","GastosAdministrativos",230000000,230000000,"No","N/A","Gerencia de Abastecimiento Estratégico\ncontratacion@positiva.gov.co\nPBX: (1)6502200 Ext: 10641","SI","SI","NO","SI","Pública clasificada","C83142022-Tipo de información Pública clasificada-PRESTACION DE SERVICIOS DE PROMOCION Y PREVENCION – EDUCA"]
["PyP","Gerencia de Investigación del riesgo","No","C83152022",93141808,"PRESTACION DE SERVICIOS DE PROMOCION Y PREVENCION – EDUCA","1/01/2022",1,"30/11/2022",11.1,"Invitación directa","GastosAdministrativos",400000000,400000000,"No","N/A","Gerencia de Abastecimiento Estratégico\ncontratacion@positiva.gov.co\nPBX: (1)6502200 Ext: 10641","SI","SI","NO","SI","Pública clasificada","C83152022-Tipo de información Pública clasificada-PRESTACION DE SERVICIOS DE PROMOCION Y PREVENCION – EDUCA"]
["PyP","Gerencia de Investigación del riesgo","No","C83162022",93141808,"PRESTACION DE SERVICIOS DE PROMOCION Y PREVENCION – EDUCA","1/01/2022",1,"30/11/2022",11.1,"Invitación directa","GastosAdministrativos",2100000000,2100000000,"No","N/A","Gerencia de Abastecimiento Estratégico\ncontratacion@positiva.gov.co\nPBX: (1)6502200 Ext: 10641","SI","SI","NO","SI","Pública clasificada","C83162022-Tipo de información Pública clasificada-PRESTACION DE SERVICIOS DE PROMOCION Y PREVENCION – EDUCA"]
["PyP","Gerencia de Investigación del riesgo","No","C83512022",93141808,"PRESTACION DE SERVICIOS DE PROMOCION Y PREVENCION – ALISSTA","1/01/2022",1,"30/11/2022",11.1,"Invitación directa","GastosAdministrativos",1699992615,1699992615,"No","N/A","Gerencia de Abastecimiento Estratégico\ncontratacion@positiva.gov.co\nPBX: (1)6502200 Ext: 10641","SI","SI","NO","SI","Pública clasificada","C83512022-Tipo de información Pública clasificada-PRESTACION DE SERVICIOS DE PROMOCION Y PREVENCION – ALISSTA"]
["PyP","Gerencia de Investigación del riesgo","No","C83522022",93141808,"PRESTACION DE SERVICIOS DE PROMOCION Y PREVENCION – GICR_COMUNICA","1/01/2022",1,"30/11/2022",11.1,"Invitación directa","GastosAdministrativos",350000000,350000000,"No","N/A","Gerencia de Abastecimiento Estratégico\ncontratacion@positiva.gov.co\nPBX: (1)6502200 Ext: 10641","SI","SI","NO","SI","Pública clasificada","C83522022-Tipo de información Pública clasificada-PRESTACION DE SERVICIOS DE PROMOCION Y PREVENCION – GICR_COMUNICA"]
["PyP","Gerencia de Investigación del riesgo","No","C83532022",93141808,"PRESTACION DE SERVICIOS DE PROMOCION Y PREVENCION – GICR","1/01/2022",1,"30/11/2022",11.1,"Invitación directa","GastosAdministrativos",300991815,300991815,"No","N/A","Gerencia de Abastecimiento Estratégico\ncontratacion@positiva.gov.co\nPBX: (1)6502200 Ext: 10641","SI","SI","NO","SI","Pública clasificada","C83532022-Tipo de información Pública clasificada-PRESTACION DE SERVICIOS DE PROMOCION Y PREVENCION – GICR"]
["PyP","Gerencia de Investigación del riesgo","No","C82512022",93141808,"PRESTACION DE SERVICIOS DE PROMOCION Y PREVENCION – CHEQUEOS_MEDICOS_PREVENTIVOS","5/11/2021",11,"31/03/2022",4.8666666666666663,"Invitación directa","GastosAdministrativos",2181187910,2181187910,"No","N/A","Gerencia de Abastecimiento Estratégico\ncontratacion@positiva.gov.co\nPBX: (1)6502200 Ext: 10641","SI","SI","NO","SI","Pública clasificada","C82512022-Tipo de información Pública clasificada-PRESTACION DE SERVICIOS DE PROMOCION Y PREVENCION – CHEQUEOS_MEDICOS_PREVENTIVOS"]
["PyP","Gerencia de Investigación del riesgo","No","C83542022",93141808,"PRESTACION DE SERVICIOS DE PROMOCION Y PREVENCION – GICR_COMUNICA","1/05/2022",5,"31/12/2022",8.1333333333333329,"Invitación pública","GastosAdministrativos",1150000000,1150000000,"No","N/A","Gerencia de Abastecimiento Estratégico\ncontratacion@positiva.gov.co\nPBX: (1)6502200 Ext: 10641","SI","SI","NO","SI","Pública clasificada","C83542022-Tipo de información Pública clasificada-PRESTACION DE SERVICIOS DE PROMOCION Y PREVENCION – GICR_COMUNICA"]
["PyP","Gerencia de Investigación del riesgo","No","C83552022",93141808,"PRESTACION DE SERVICIOS DE PROMOCION Y PREVENCION – GICR_LHTI","1/01/2022",1,"30/06/2022",6,"Invitación directa","GastosAdministrativos",470000000,470000000,"No","N/A","Gerencia de Abastecimiento Estratégico\ncontratacion@positiva.gov.co\nPBX: (1)6502200 Ext: 10641","SI","SI","NO","SI","Pública clasificada","C83552022-Tipo de información Pública clasificada-PRESTACION DE SERVICIOS DE PROMOCION Y PREVENCION – GICR_LHTI"]
["PyP","Vicepresidencia de PYP","No","C85502022",93141808,"PRESTACION DE SERVICIOS DE PROMOCION Y PREVENCION – VIATICOS_TIQUETES","1/01/2022",1,"30/11/2022",11.1,"Invitación cerrada","GastosAdministrativos",94585987,94585987,"No","N/A","Gerencia de Abastecimiento Estratégico\ncontratacion@positiva.gov.co\nPBX: (1)6502200 Ext: 10641","SI","SI","NO","SI","Pública clasificada","C85502022-Tipo de información Pública clasificada-PRESTACION DE SERVICIOS DE PROMOCION Y PREVENCION – VIATICOS_TIQUETES"]
["PyP","Vicepresidencia de PYP","No","C85512022",93141808,"PRESTACION DE SERVICIOS DE PROMOCION Y PREVENCION – VIATICOS_TIQUETES","1/01/2022",1,"30/11/2022",11.1,"Invitación cerrada","GastosAdministrativos",25414013,25414013,"No","N/A","Gerencia de Abastecimiento Estratégico\ncontratacion@positiva.gov.co\nPBX: (1)6502200 Ext: 10641","SI","SI","NO","SI","Pública clasificada","C85512022-Tipo de información Pública clasificada-PRESTACION DE SERVICIOS DE PROMOCION Y PREVENCION – VIATICOS_TIQUETES"]
["PyP","Vicepresidencia de PYP","No","C86012022",93141808,"PRESTACION DE SERVICIOS DE PROMOCION Y PREVENCION – UNIDAD_DE_NEGOCIO_VICE_PYP","24/01/2022",1,"31/12/2022",11.366666666666667,"Invitación directa","GastosAdministrativos",256000000,256000000,"No","N/A","Gerencia de Abastecimiento Estratégico\ncontratacion@positiva.gov.co\nPBX: (1)6502200 Ext: 10641","SI","SI","NO","SI","Pública clasificada","C86012022-Tipo de información Pública clasificada-PRESTACION DE SERVICIOS DE PROMOCION Y PREVENCION – UNIDAD_DE_NEGOCIO_VICE_PYP"]
["PyP","Vicepresidencia de PYP","No","C86022022",93141808,"PRESTACION DE SERVICIOS DE PROMOCION Y PREVENCION – UNIDAD_DE_NEGOCIO_VICE_PYP","24/01/2022",1,"2022-09-30",8.3000000000000007,"Invitación directa","GastosAdministrativos",5577600,5577600,"No","N/A","Gerencia de Abastecimiento Estratégico\ncontratacion@positiva.gov.co\nPBX: (1)6502200 Ext: 10641","SI","SI","NO","SI","Pública clasificada","C86022022-Tipo de información Pública clasificada-PRESTACION DE SERVICIOS DE PROMOCION Y PREVENCION – UNIDAD_DE_NEGOCIO_VICE_PYP"]
["PyP","Vicepresidencia de PYP","No","C86032022",93141808,"PRESTACION DE SERVICIOS DE PROMOCION Y PREVENCION – UNIDAD_DE_NEGOCIO_VICE_PYP","24/01/2022",1,"2022-09-30",8.3000000000000007,"Invitación directa","GastosAdministrativos",11844000,11844000,"No","N/A","Gerencia de Abastecimiento Estratégico\ncontratacion@positiva.gov.co\nPBX: (1)6502200 Ext: 10641","SI","SI","NO","SI","Pública clasificada","C86032022-Tipo de información Pública clasificada-PRESTACION DE SERVICIOS DE PROMOCION Y PREVENCION – UNIDAD_DE_NEGOCIO_VICE_PYP"]
["PyP","Vicepresidencia de PYP","No","C86042022",93141808,"PRESTACION DE SERVICIOS DE PROMOCION Y PREVENCION – UNIDAD_DE_NEGOCIO_VICE_PYP","24/01/2022",1,"2022-09-30",8.3000000000000007,"Invitación directa","GastosAdministrativos",6289920,6289920,"No","N/A","Gerencia de Abastecimiento Estratégico\ncontratacion@positiva.gov.co\nPBX: (1)6502200 Ext: 10641","SI","SI","NO","SI","Pública clasificada","C86042022-Tipo de información Pública clasificada-PRESTACION DE SERVICIOS DE PROMOCION Y PREVENCION – UNIDAD_DE_NEGOCIO_VICE_PYP"]
["Financiera y Administrativa","Gcia. Gestión Financiera","No",null,"84111802","Prestación de servicios profesionales de Revisoría Fiscal","2022-08-11",8,"2022-12-31",4.7333333333333334,"Invitación directa","GastosAdministrativos",224328424,224328424,"NO","N/A","Gerencia de Abastecimiento Estratégico\ncontratacion@positiva.gov.co\nPBX: (1)6502200 Ext: 10641","SI","NO","NO","SI","Pública clasificada","-Tipo de información Pública clasificada-Prestación de servicios profesionales de Revisoría Fiscal"]
["Financiera y Administrativa","Gcia. Gestión Financiera","No","C55762022",80101500,"Prestación de servicios profesionales especializados para el soporte, acompañamiento y socialización en la implementación de las Normas Internacionales de Información Financiera y sus interpretaciones sobre todas las áreas de impacto en POSITIVA","2022-01-11",1,"2022-12-31",11.8,"Invitación directa","GastosAdministrativos",80470284,80470284,"SI","Aprobadas","Gerencia de Abastecimiento Estratégico\ncontratacion@positiva.gov.co\nPBX: (1)6502200 Ext: 10641","SI","NO","NO","SI","Pública clasificada","C55762022-Tipo de información Pública clasificada-Prestación de servicios profesionales especializados para el soporte, acompañamiento y socialización en la implementación de las Normas Internacionales de Información Financiera y sus interpretaciones sobre todas las áreas de impacto en POSITIVA"]
["Financiera y Administrativa","Gcia. Gestión Financiera","No","C55772022",80101500,"Prestación del servicio de acompañamiento tributario integral y permanente (soporte tributario, cumplimiento e información exógena), de conformidad con la normatividad nacional, distrital y municipal para POSITIVA.","2022-01-11",1,"2022-12-31",11.8,"Invitación directa","GastosAdministrativos",257040000,257040000,"SI","Aprobadas","Gerencia de Abastecimiento Estratégico\ncontratacion@positiva.gov.co\nPBX: (1)6502200 Ext: 10641","SI","NO","NO","SI","Pública clasificada","C55772022-Tipo de información Pública clasificada-Prestación del servicio de acompañamiento tributario integral y permanente (soporte tributario, cumplimiento e información exógena), de conformidad con la normatividad nacional, distrital y municipal para POSITIVA."]
["Financiera y Administrativa","Gcia. Gestión Financiera","No","C55892022",80101500,"Prestación de servicios - para la calificación de la fortaleza financiera y capacidad de pago de siniestros derivados de la suscripción de pólizas y otras obligaciones contractuales de POSITIVA.","2022-04-10",4,"2023-04-09",12.133333333333333,"Invitación directa","GastosAdministrativos",36399176,36399176,"NO",null,"Gerencia de Abastecimiento Estratégico\ncontratacion@positiva.gov.co\nPBX: (1)6502200 Ext: 10641","SI","NO","NO","SI","Pública clasificada","C55892022-Tipo de información Pública clasificada-Prestación de servicios - para la calificación de la fortaleza financiera y capacidad de pago de siniestros derivados de la suscripción de pólizas y otras obligaciones contractuales de POSITIVA."]
["Financiera y Administrativa","Gcia. Gestión Financiera","No",null,81112501,"Prestación de servicios para la renovación de la garantía, soporte y actualizaciones de la licencia adicional del software GaussProfit Edición Advanced.","2022-10-01",10,"2023-09-30",12.133333333333333,"Invitación directa","GastosAdministrativos",15257922,15257922,"NO",null,"Gerencia de Abastecimiento Estratégico\ncontratacion@positiva.gov.co\nPBX: (1)6502200 Ext: 10641","SI","NO","NO","SI","Pública clasificada","-Tipo de información Pública clasificada-Prestación de servicios para la renovación de la garantía, soporte y actualizaciones de la licencia adicional del software GaussProfit Edición Advanced."]
["Financiera y Administrativa","Gcia. Gestión Financiera","No",null,80101500,"Prestación de servicios - para la estimación de la prueba de deterioro de la plusvalía (Crédito Mercantil) adquirida de la cesión de activos, pasivos y contratos del negocio de riesgos laborales del Instituto Seguro Social, de conformidad con los lineamientos establecidos en las Normas Internacionales de Información Financiera (NIIF) y la NIC36 - deterioro del valor de los activos ","2022-10-01",10,"2022-12-31",3.0333333333333332,"Invitación directa","GastosAdministrativos",35000000,35000000,"NO",null,"Gerencia de Abastecimiento Estratégico\ncontratacion@positiva.gov.co\nPBX: (1)6502200 Ext: 10641","SI","NO","NO","SI","Pública clasificada","-Tipo de información Pública clasificada-Prestación de servicios - para la estimación de la prueba de deterioro de la plusvalía (Crédito Mercantil) adquirida de la cesión de activos, pasivos y contratos del negocio de riesgos laborales del Instituto Seguro Social, de conformidad con los lineamientos establecidos en las Normas Internacionales de Información Financiera (NIIF) y la NIC36 - deterioro del valor de los activos "]
["SECRETARIA GENERAL Y JURÍDICA","GERENCIA DE TALENTO HUMANO","SI","C20252022 -C20642022",81112200,"PRESTACIÓN DE SERVICIOS  Plataforma indicadores de gestión","2021-12-01",12,"2022-12-31",13.166666666666666,"Invitación directa","GastosAdministrativos",30286076,{"$f":"M438","v":30286076},"SI","Aprobadas y en ejecución","Gerencia de Abastecimiento Estratégico\ncontratacion@positiva.gov.co\nPBX: (1)6502200 Ext: 10641","NO","NO","SI","NO",{"$f":"IF(U438=\"SI\",\"Pública clasificada\",\"Pública\")","v":"Pública"},{"$f":"CONCATENATE(D438,\"-\",\"Tipo de información\",\" \",V438,\"-\",F438)","v":"C20252022 -C20642022-Tipo de información Pública-PRESTACIÓN DE SERVICIOS  Plataforma indicadores de gestión"}]
["SECRETARIA GENERAL Y JURÍDICA","GERENCIA DE TALENTO HUMANO","SI","C20142022",93141808,"PRESTACIÓN DE SERVICIOS PROCESO DE SST - DME","2022-01-01",1,"2022-12-31",12.133333333333333,"Invitación directa","GastosAdministrativos",90100000,{"$f":"M439","v":90100000},"NO",null,"Gerencia de Abastecimiento Estratégico\ncontratacion@positiva.gov.co\nPBX: (1)6502200 Ext: 10641","NO","NO","NO","NO","Pública","C20142022-Tipo de información Pública-PRESTACIÓN DE SERVICIOS PROCESO DE SST - DME"]
["SECRETARIA GENERAL Y JURÍDICA","GERENCIA DE TALENTO HUMANO","SI","C20092022",86101808,"PRESTACIÓN DE SERVICIOS PROCESO DE CAPACITACIÓN DE PERSONAL - COMPETENCIAS TECNICAS","2022-01-01",1,"2022-12-31",12.133333333333333,"Invitación directa","GastosAdministrativos",41844000,{"$f":"M440","v":41844000},"NO",null,"Gerencia de Abastecimiento Estratégico\ncontratacion@positiva.gov.co\nPBX: (1)6502200 Ext: 10641","NO","NO","NO","NO","Pública","C20092022-Tipo de información Pública-PRESTACIÓN DE SERVICIOS PROCESO DE CAPACITACIÓN DE PERSONAL - COMPETENCIAS TECNICAS"]
["SECRETARIA GENERAL Y JURÍDICA","GERENCIA DE TALENTO HUMANO","SI","C20672022",80111502,"PRESTACIÓN DE SERVICIOS  Gastos administrativos dotación","2022-01-01",1,"2022-12-31",12.133333333333333,"Invitación directa","GastosAdministrativos",4500000,4500000,"NO",null,"Gerencia de Abastecimiento Estratégico\ncontratacion@positiva.gov.co\nPBX: (1)6502200 Ext: 10641","NO","NO","NO","NO","Pública","C20672022-Tipo de información Pública-PRESTACIÓN DE SERVICIOS  Gastos administrativos dotación"]
["SECRETARIA GENERAL Y JURÍDICA","GERENCIA DE TALENTO HUMANO","SI","C20032022 - C20082022 - C20152022","94121505-80141607-93141808-60105610 -80111500 - 80101511","PRESTACIÓN DE SERVICIOS  POSITIVA COMPAÑÍA DE SEGUROS S.A. aliado estratégico ","2022-01-01",1,"2022-12-31",12.133333333333333,"Invitación directa","GastosAdministrativos",420000000,{"$f":"M442","v":420000000},"NO",null,"Gerencia de Abastecimiento Estratégico\ncontratacion@positiva.gov.co\nPBX: (1)6502200 Ext: 10641","NO","NO","NO","NO","Pública","C20032022 - C20082022 - C20152022-Tipo de información Pública-PRESTACIÓN DE SERVICIOS  POSITIVA COMPAÑÍA DE SEGUROS S.A. aliado estratégico "]
["SECRETARIA GENERAL Y JURÍDICA","GERENCIA DE TALENTO HUMANO","SI","C20112022",86101808,"PRESTACIÓN DE SERVICIOS PROCESO DE CAPACITACIÓN DE PERSONAL - COMPETENCIAS TECNICAS","2022-01-01",1,"2022-12-31",12.133333333333333,"Invitación directa","GastosAdministrativos",10461000,10461000,"NO",null,"Gerencia de Abastecimiento Estratégico\ncontratacion@positiva.gov.co\nPBX: (1)6502200 Ext: 10641","NO","NO","NO","NO","Pública","C20112022-Tipo de información Pública-PRESTACIÓN DE SERVICIOS PROCESO DE CAPACITACIÓN DE PERSONAL - COMPETENCIAS TECNICAS"]
["SECRETARIA GENERAL Y JURÍDICA","GERENCIA DE TALENTO HUMANO","SI","C20052022","93141506-86101808","PRESTACIÓN DE SERVICIOS - Riesgo Psicosocial","2022-01-01",1,"2022-12-31",12.133333333333333,"Invitación directa","GastosAdministrativos",16000000,16000000,"NO",null,"Gerencia de Abastecimiento Estratégico\ncontratacion@positiva.gov.co\nPBX: (1)6502200 Ext: 10641","NO","NO","NO","NO","Pública","C20052022-Tipo de información Pública-PRESTACIÓN DE SERVICIOS - Riesgo Psicosocial"]
["SECRETARIA GENERAL Y JURÍDICA","GERENCIA DE TALENTO HUMANO","SI","C20652022",86101808,"PRESTACIÓN DE SERVICIOS PROCESO DE CAPACITACIÓN DE PERSONAL - COMPETENCIAS TECNICAS","2022-01-01",1,"2022-12-31",12.133333333333333,"Invitación directa","GastosAdministrativos",10461000,10461000,"NO",null,"Gerencia de Abastecimiento Estratégico\ncontratacion@positiva.gov.co\nPBX: (1)6502200 Ext: 10641","NO","NO","NO","NO","Pública","C20652022-Tipo de información Pública-PRESTACIÓN DE SERVICIOS PROCESO DE CAPACITACIÓN DE PERSONAL - COMPETENCIAS TECNICAS"]
["SECRETARIA GENERAL Y JURÍDICA","GERENCIA DE TALENTO HUMANO","SI","C20012022 - C20062022 - C20122022",93141514,"PRESTACIÓN DE SERVICIOS  Planeación e Implementación de estrategias de mercadeo y comunicaciones, ","2021-12-01",12,"2022-03-31",4,"Invitación cerrada","GastosAdministrativos",60786785.766000003,60786785.766000003,"SI","Aprobadas y en ejecución","Gerencia de Abastecimiento Estratégico\ncontratacion@positiva.gov.co\nPBX: (1)6502200 Ext: 10641","NO","NO","NO","NO","Pública","C20012022 - C20062022 - C20122022-Tipo de información Pública-PRESTACIÓN DE SERVICIOS  Planeación e Implementación de estrategias de mercadeo y comunicaciones, "]
["SECRETARIA GENERAL Y JURÍDICA","GERENCIA DE TALENTO HUMANO","SI","C20022022 - C20072022 - C20132022","80111500 - 80101511","PRESTACIÓN DE SERVICIOS  Planeación e Implementación de estrategias de mercadeo y comunicaciones, ","2022-01-01",1,"2022-12-31",12.133333333333333,"Invitación cerrada","GastosAdministrativos",206000000,206000000,"NO",null,"Gerencia de Abastecimiento Estratégico\ncontratacion@positiva.gov.co\nPBX: (1)6502200 Ext: 10641","NO","NO","NO","NO","Pública","C20022022 - C20072022 - C20132022-Tipo de información Pública-PRESTACIÓN DE SERVICIOS  Planeación e Implementación de estrategias de mercadeo y comunicaciones, "]
["SECRETARIA GENERAL Y JURÍDICA","GERENCIA DE TALENTO HUMANO","SI","C20272022",80111502,"PRESTACIÓN DE SERVICIOS  plataforma de incentivos","2022-01-01",1,"2022-12-31",12.133333333333333,"Invitación directa","GastosAdministrativos",112045526,112045526,"NO",null,"Gerencia de Abastecimiento Estratégico\ncontratacion@positiva.gov.co\nPBX: (1)6502200 Ext: 10641","NO","NO","NO","NO","Pública","C20272022-Tipo de información Pública-PRESTACIÓN DE SERVICIOS  plataforma de incentivos"]
["SECRETARIA GENERAL Y JURÍDICA","GERENCIA DE TALENTO HUMANO","SI","C20042022-C20282022","80111500 - 80101511","PRESTACIÓN DE SERVICIOS - Great place to work","2022-01-01",1,"2022-12-31",12.133333333333333,"Invitación directa","GastosAdministrativos",160000000,160000000,"NO",null,"Gerencia de Abastecimiento Estratégico\ncontratacion@positiva.gov.co\nPBX: (1)6502200 Ext: 10641","NO","NO","NO","NO","Pública","C20042022-C20282022-Tipo de información Pública-PRESTACIÓN DE SERVICIOS - Great place to work"]
["SECRETARIA GENERAL Y JURÍDICA","GERENCIA DE TALENTO HUMANO","SI","C20292022",80111606,"PRESTACIÓN DE SERVICIOS  Selección de personal","2021-12-01",12,"2022-12-31",13.166666666666666,"Invitación directa","GastosAdministrativos",127264764,{"$f":"M450","v":127264764},"SI","Aprobadas y en ejecución","Gerencia de Abastecimiento Estratégico\ncontratacion@positiva.gov.co\nPBX: (1)6502200 Ext: 10641","NO","NO","NO","NO","Pública","C20292022-Tipo de información Pública-PRESTACIÓN DE SERVICIOS  Selección de personal"]
["SECRETARIA GENERAL Y JURÍDICA","GERENCIA DE TALENTO HUMANO","SI","C20312022",84111505,"PRESTACIÓN DE SERVICIOS  Administración nómina","2021-12-01",12,"2022-12-31",13.166666666666666,"Invitación directa","GastosAdministrativos",356508739,356508739,"SI","Aprobadas y en ejecución","Gerencia de Abastecimiento Estratégico\ncontratacion@positiva.gov.co\nPBX: (1)6502200 Ext: 10641","NO","NO","SI","NO","Pública","C20312022-Tipo de información Pública-PRESTACIÓN DE SERVICIOS  Administración nómina"]
["SECRETARIA GENERAL Y JURÍDICA","GERENCIA DE TALENTO HUMANO","SI","C20362022",80111509,"PRESTACIÓN DE SERVICIOS - Soporte y mantenimiento plataforma cargas laborales","2022-01-01",1,"2022-12-31",12.133333333333333,"Invitación directa","GastosAdministrativos",137085063,137085063,"NO",null,"Gerencia de Abastecimiento Estratégico\ncontratacion@positiva.gov.co\nPBX: (1)6502200 Ext: 10641","NO","NO","NO","NO","Pública","C20362022-Tipo de información Pública-PRESTACIÓN DE SERVICIOS - Soporte y mantenimiento plataforma cargas laborales"]
["SECRETARIA GENERAL Y JURÍDICA","GERENCIA DE TALENTO HUMANO","SI","C20162022","46182200-93141808","PRESTACIÓN DE SERVICIOS PROCESO DE SST - DEA NIVEL SUCUSAL","2022-01-01",1,"2022-12-31",12.133333333333333,"Invitación directa","GastosAdministrativos",41044400,41044400,"NO",null,"Gerencia de Abastecimiento Estratégico\ncontratacion@positiva.gov.co\nPBX: (1)6502200 Ext: 10641","NO","NO","NO","NO","Pública","C20162022-Tipo de información Pública-PRESTACIÓN DE SERVICIOS PROCESO DE SST - DEA NIVEL SUCUSAL"]
["SECRETARIA GENERAL Y JURÍDICA","GERENCIA DE TALENTO HUMANO","SI","C20172022",93141808,"PRESTACIÓN DE SERVICIOS PROCESO DE SISTEMA DE SEGURIDAD Y SALUD EN EL TRABAJO - Examenes de salud ocupacional","2021-12-01",12,"2022-12-31",13.166666666666666,"Invitación directa","GastosAdministrativos",55000000,55000000,"SI","Aprobadas y en ejecución","Gerencia de Abastecimiento Estratégico\ncontratacion@positiva.gov.co\nPBX: (1)6502200 Ext: 10641","NO","NO","NO","NO","Pública","C20172022-Tipo de información Pública-PRESTACIÓN DE SERVICIOS PROCESO DE SISTEMA DE SEGURIDAD Y SALUD EN EL TRABAJO - Examenes de salud ocupacional"]
["SECRETARIA GENERAL Y JURÍDICA","GERENCIA DE TALENTO HUMANO","SI","C20182022",93141808,"PRESTACIÓN DE SERVICIOS PROCESO DE SST -SISTEMA DE GESTIÓN Y ATENCIÓN DE EMERGENCIAS","2022-01-01",1,"2022-12-31",12.133333333333333,"Invitación directa","GastosAdministrativos",50000000,50000000,"NO",null,"Gerencia de Abastecimiento Estratégico\ncontratacion@positiva.gov.co\nPBX: (1)6502200 Ext: 10641","NO","NO","NO","NO","Pública","C20182022-Tipo de información Pública-PRESTACIÓN DE SERVICIOS PROCESO DE SST -SISTEMA DE GESTIÓN Y ATENCIÓN DE EMERGENCIAS"]
["SECRETARIA GENERAL Y JURÍDICA","GERENCIA DE TALENTO HUMANO","SI","C20202022","46182200-93141808","PRESTACIÓN DE SERVICIOS PROCESO DE SST - BOTIQUINES","2022-01-01",1,"2022-12-31",12.133333333333333,"Invitación directa","GastosAdministrativos",20966400,20966400,"NO",null,"Gerencia de Abastecimiento Estratégico\ncontratacion@positiva.gov.co\nPBX: (1)6502200 Ext: 10641","NO","NO","NO","NO","Pública","C20202022-Tipo de información Pública-PRESTACIÓN DE SERVICIOS PROCESO DE SST - BOTIQUINES"]
["SECRETARIA GENERAL Y JURÍDICA","GERENCIA DE TALENTO HUMANO","SI","C20212022","46182200-93141808","PRESTACIÓN DE SERVICIOS PROCESO DE SST - EPP","2022-01-01",1,"2022-12-31",12.133333333333333,"Invitación directa","GastosAdministrativos",17935680,17935680,"NO",null,"Gerencia de Abastecimiento Estratégico\ncontratacion@positiva.gov.co\nPBX: (1)6502200 Ext: 10641","NO","NO","NO","NO","Pública","C20212022-Tipo de información Pública-PRESTACIÓN DE SERVICIOS PROCESO DE SST - EPP"]
["SECRETARIA GENERAL Y JURÍDICA","GERENCIA DE TALENTO HUMANO","SI","C20222022",93141808,"PRESTACIÓN DE SERVICIOS PROCESO DE SST PARA LA ATENCIÓN DE LA EMERGENCIA SANITARIA","2022-01-01",1,"2022-12-31",12.133333333333333,"Invitación directa","GastosAdministrativos",12453520,12453520,"NO",null,"Gerencia de Abastecimiento Estratégico\ncontratacion@positiva.gov.co\nPBX: (1)6502200 Ext: 10641","NO","NO","NO","NO","Pública","C20222022-Tipo de información Pública-PRESTACIÓN DE SERVICIOS PROCESO DE SST PARA LA ATENCIÓN DE LA EMERGENCIA SANITARIA"]
["SECRETARIA GENERAL Y JURÍDICA","GERENCIA DE TALENTO HUMANO","SI","C20232022",93141808,"PRESTACIÓN DE SERVICIOS PROCESO DE SST - PROGRAMA DE HABITOS SALUDABLES","2022-01-01",1,"2022-12-31",12.133333333333333,"Invitación directa","GastosAdministrativos",140000000,140000000,"NO",null,"Gerencia de Abastecimiento Estratégico\ncontratacion@positiva.gov.co\nPBX: (1)6502200 Ext: 10641","NO","NO","NO","NO","Pública","C20232022-Tipo de información Pública-PRESTACIÓN DE SERVICIOS PROCESO DE SST - PROGRAMA DE HABITOS SALUDABLES"]
["SECRETARIA GENERAL Y JURÍDICA","GERENCIA DE TALENTO HUMANO","SI","C20262022",44103100,"PRESTACIÓN DE SERVICIOS  proceso de carnetización. ","2022-01-01",1,"2022-03-31",2.9666666666666668,"Invitación directa","GastosAdministrativos",7692528.7790999999,7692528.7790999999,"NO",null,"Gerencia de Abastecimiento Estratégico\ncontratacion@positiva.gov.co\nPBX: (1)6502200 Ext: 10641","NO","NO","NO","NO","Pública","C20262022-Tipo de información Pública-PRESTACIÓN DE SERVICIOS  proceso de carnetización. "]
["SECRETARIA GENERAL Y JURÍDICA","GERENCIA DE TALENTO HUMANO","NO","C20662022",86101808,"PRESTACIÓN DE SERVICIOS PROCESO DE CAPACITACIÓN DE PERSONAL TRANSFORMACION DIGITAL","2022-07-01",7,"2022-12-31",6.1,"Invitación directa","GastosAdministrativos",57673290,57673290,"NO",null,"Gerencia de Abastecimiento Estratégico\ncontratacion@positiva.gov.co\nPBX: (1)6502200 Ext: 10641","NO","NO","NO","NO","Pública","C20662022-Tipo de información Pública-PRESTACIÓN DE SERVICIOS PROCESO DE CAPACITACIÓN DE PERSONAL TRANSFORMACION DIGITAL"]
["SECRETARIA GENERAL Y JURÍDICA","GERENCIA DE TALENTO HUMANO","NO","C20692022",86101808,"PRESTACIÓN DE SERVICIOS PLAN DE CAPACITACIÓN DE PERSONAL","2022-07-01",7,"2022-12-31",6.1,"Invitación directa","GastosAdministrativos",23740000,23740000,"NO",null,"Gerencia de Abastecimiento Estratégico\ncontratacion@positiva.gov.co\nPBX: (1)6502200 Ext: 10641","NO","NO","NO","NO","Pública","C20692022-Tipo de información Pública-PRESTACIÓN DE SERVICIOS PLAN DE CAPACITACIÓN DE PERSONAL"]
["SECRETARIA GENERAL Y JURÍDICA","GERENCIA DE TALENTO HUMANO","SI","C20102022",86101808,"PRESTACIÓN DE SERVICIOS PROCESO DE CAPACITACIÓN DE PERSONAL Y GESTIÓN DE CONOCIMIENTO","2022-01-01",1,"2022-12-31",12.133333333333333,"Invitación directa","GastosAdministrativos",394700000,394700000,"NO",null,"Gerencia de Abastecimiento Estratégico\ncontratacion@positiva.gov.co\nPBX: (1)6502200 Ext: 10641","NO","NO","NO","NO","Pública","C20102022-Tipo de información Pública-PRESTACIÓN DE SERVICIOS PROCESO DE CAPACITACIÓN DE PERSONAL Y GESTIÓN DE CONOCIMIENTO"]
["SECRETARIA GENERAL Y JURÍDICA","GERENCIA DE TALENTO HUMANO","SI","C20322022",80111607,"PRESTACIÓN DE SERVICIOS- Servicios jurídicos especializados, conceptualizando (verbal y/o escrito) en temas de derecho y relaciones laborales colectivas e individuales.","2022-01-01",1,"2022-12-31",12.133333333333333,"Invitación directa","GastosAdministrativos",84510400,84510400,"NO",null,"Gerencia de Abastecimiento Estratégico\ncontratacion@positiva.gov.co\nPBX: (1)6502200 Ext: 10641","NO","NO","NO","NO","Pública","C20322022-Tipo de información Pública-PRESTACIÓN DE SERVICIOS- Servicios jurídicos especializados, conceptualizando (verbal y/o escrito) en temas de derecho y relaciones laborales colectivas e individuales."]
["VICEPRESIDENCIA TÉCNICA","Gerencia de Actuaría","NO","C65012022",80101504,"Prestación de servicios: Prestación de servicios profesionales especializados con una persona jurídica para dar cumplimiento con lo ordenado en la Circular Externa 022 de 2015 de la Superintendencia Financiera de Colombia relacionado con el rol del actuario responsable respecto a la certificación de suficiencia de las reservas técnicas de Positiva Compañía de Seguros S.A., frente a los requisitos exigidos en la Circular Externa 045 de 2016 y demás normas que la modifiquen, así como la atención de las instrucciones y requerimientos que sean impartidos por la Superintendencia Financiera de Colombia.","2022-02-01",2,"2023-01-31",12.133333333333333,"Invitación directa","GastosAdministrativos",303414540,278129995,"SI","Aprobada","Gerencia de Abastecimiento Estratégico\ncontratacion@positiva.gov.co\nPBX: (1)6502200 Ext: 10641","SI","SI","NO","SI","Pública clasificada","C65012022-Tipo de información Pública clasificada-Prestación de servicios: Prestación de servicios profesionales especializados con una persona jurídica para dar cumplimiento con lo ordenado en la Circular Externa 022 de 2015 de la Superintendencia Financiera de Colombia relacionado con el rol del actuario responsable respecto a la certificación de suficiencia de las reservas técnicas de Positiva Compañía de Seguros S.A., frente a los requisitos exigidos en la Circular Externa 045 de 2016 y demás normas que la modifiquen, así como la atención de las instrucciones y requerimientos que sean impartidos por la Superintendencia Financiera de Colombia."]
["VICEPRESIDENCIA TÉCNICA","Gerencia Médica","NO","C65052022",43231500,"Prestación de servicios: Prestar servicios de  asesoría, apoyo y acompañamiento en los  tramites precontractuales, contractuales y postcontractuales de los procesos a realizar por la Compañía al grupo de servicios definidos por la Vicepresidencia Técnica y la \nGerencia Medica referentes a la atención integral del siniestro de Positiva  Compañía de Seguros","2022-01-01",1,"2022-06-30",6,"Invitación directa","GastosAdministrativos",188345838,188345838,"SI","Aprobada","Gerencia de Abastecimiento Estratégico\ncontratacion@positiva.gov.co\nPBX: (1)6502200 Ext: 10641","SI","SI","NO","SI","Pública clasificada","C65052022-Tipo de información Pública clasificada-Prestación de servicios: Prestar servicios de  asesoría, apoyo y acompañamiento en los  tramites precontractuales, contractuales y postcontractuales de los procesos a realizar por la Compañía al grupo de servicios definidos por la Vicepresidencia Técnica y la \nGerencia Medica referentes a la atención integral del siniestro de Positiva  Compañía de Seguros"]
["VICEPRESIDENCIA TÉCNICA","Gerencia Médica","NO","C65062022",43231500,"Prestación de servicios: Prestar los servicios profesionales para gestionar los trámites precontractuales y contractuales de los procesos a realizar por la Vicepresidencia Técnica y la Gerencia Medica referentes a la red de prestadores de servicios de salud en el subproceso de Planeación del Modelo de atención integral del siniestro de POSITIVA","2022-01-01",1,"2022-12-31",12.133333333333333,"Invitación directa","GastosAdministrativos",104318400,104318400,"SI","Aprobada","Gerencia de Abastecimiento Estratégico\ncontratacion@positiva.gov.co\nPBX: (1)6502200 Ext: 10641","SI","SI","NO","SI","Pública clasificada","C65062022-Tipo de información Pública clasificada-Prestación de servicios: Prestar los servicios profesionales para gestionar los trámites precontractuales y contractuales de los procesos a realizar por la Vicepresidencia Técnica y la Gerencia Medica referentes a la red de prestadores de servicios de salud en el subproceso de Planeación del Modelo de atención integral del siniestro de POSITIVA"]
["VICEPRESIDENCIA TÉCNICA","Gerencia Médica","NO","C65072022",43231500,"Prestación de servicios: El CONTRATISTA se obliga con POSITIVA a prestar los servicios Técnicos, realizando el acompañamiento y apoyo en las actividades administrativas relacionados con los trámites precontractuales, contractuales y pos contractuales de los procesos referentes a la red de prestadores de servicios de salud en el sub proceso de planeación del modelo de atención integral del siniestro de Positiva Compañía de Seguros","2022-01-01",1,"2022-08-31",8.0666666666666664,"Invitación directa","GastosAdministrativos",26839200,26839200,"SI","Aprobada","Gerencia de Abastecimiento Estratégico\ncontratacion@positiva.gov.co\nPBX: (1)6502200 Ext: 10641","SI","SI","NO","SI","Pública clasificada","C65072022-Tipo de información Pública clasificada-Prestación de servicios: El CONTRATISTA se obliga con POSITIVA a prestar los servicios Técnicos, realizando el acompañamiento y apoyo en las actividades administrativas relacionados con los trámites precontractuales, contractuales y pos contractuales de los procesos referentes a la red de prestadores de servicios de salud en el sub proceso de planeación del modelo de atención integral del siniestro de Positiva Compañía de Seguros"]
["VICEPRESIDENCIA TÉCNICA","Gerencia Médica","NO","C65082022",43231500,"Prestación de servicios: El CONTRATISTA se obliga con POSITIVA a prestar los servicios Técnicos, realizando el acompañamiento y apoyo en las actividades administrativas relacionados con los trámites precontractuales, contractuales y pos contractuales de los procesos referentes a la red de prestadores de servicios de salud en el sub proceso de planeación del modelo de atención integral del siniestro de Positiva Compañía de Seguros S.A.","2022-01-01",1,"2022-08-31",8.0666666666666664,"Invitación directa","GastosAdministrativos",26839200,26839200,"NO",null,"Gerencia de Abastecimiento Estratégico\ncontratacion@positiva.gov.co\nPBX: (1)6502200 Ext: 10641","SI","SI","NO","SI","Pública clasificada","C65082022-Tipo de información Pública clasificada-Prestación de servicios: El CONTRATISTA se obliga con POSITIVA a prestar los servicios Técnicos, realizando el acompañamiento y apoyo en las actividades administrativas relacionados con los trámites precontractuales, contractuales y pos contractuales de los procesos referentes a la red de prestadores de servicios de salud en el sub proceso de planeación del modelo de atención integral del siniestro de Positiva Compañía de Seguros S.A."]
["VICEPRESIDENCIA TÉCNICA","Gerencia de Indemnizaciones","NO","C65092022",92121604,"Prestación de servicios: Prestación de los servicio de estudio de confiabilidad para conocimiento del cliente de todas entidades, Cooperativas, financieras  y demás que deseen aplicar libranzas o descuentos a la nómina de pensionados, donde se garantice la validación de la información corporativa, se verifique la documentación aportada, se compruebe el entorno de cada operador; generando informe con concepto final; para que Positiva pueda definir la asignación  o renovación de código de descuento al operador solicitante.","2022-09-01",9,"2022-12-31",4.0333333333333332,"Invitación directa","GastosAdministrativos",40000000,40000000,"NO",null,"Gerencia de Abastecimiento Estratégico\ncontratacion@positiva.gov.co\nPBX: (1)6502200 Ext: 10641","SI","SI","NO","SI","Pública clasificada","C65092022-Tipo de información Pública clasificada-Prestación de servicios: Prestación de los servicio de estudio de confiabilidad para conocimiento del cliente de todas entidades, Cooperativas, financieras  y demás que deseen aplicar libranzas o descuentos a la nómina de pensionados, donde se garantice la validación de la información corporativa, se verifique la documentación aportada, se compruebe el entorno de cada operador; generando informe con concepto final; para que Positiva pueda definir la asignación  o renovación de código de descuento al operador solicitante."]
["VICEPRESIDENCIA TÉCNICA","Gerencia de Indemnizaciones","NO","C65102022",43231500,"Prestación de servicios: EL CONTRATISTA, se compromete con POSITIVA, prestación de servicio administración, soporte y mantenimiento, de portal administrador de libranzas Sygnus, el cual incluye, Servicio de Soporte Funcional y Tecnológico de software, Servicio de mantenimiento de software y todos los desarrollos necesarios para la adaptación del portal a los Sistemas de Información utilizados por POSITIVA. El portal administrador de libranzas Sygnus deberá administrar todas las operaciones de libranzas de la nómina de pensionados de POSITIVA.\nPARÁGRAFO PRIMERO: Para mayor ilustración y definición de los términos de la presente Aceptación de Oferta, se entiende que la justificación, los estudios previos y la oferta presentada por EL CONTRATISTA, junto con los documentos aportados, hacen parte integral de la presente Aceptación de Oferta.\nPARÁGRAFO SEGUNDO: EL CONTRATISTA deberá obrar con absoluta lealtad y honradez en su relación con POSITIVA y atender con celosa diligencia los encargos que por esta Aceptación de Oferta se le confieran. De igual manera, deberá mantener permanentemente informada a POSITIVA., del desarrollo de la presente Aceptación de Oferta.","2022-07-08",{"$f":"MONTH(G471)","v":7},"2023-07-07",12.133333333333333,"Invitación directa",null,0,0,"NO",null,"Gerencia de Abastecimiento Estratégico\ncontratacion@positiva.gov.co\nPBX: (1)6502200 Ext: 10641","SI","SI","NO","SI","Pública clasificada","C65102022-Tipo de información Pública clasificada-Prestación de servicios: EL CONTRATISTA, se compromete con POSITIVA, prestación de servicio administración, soporte y mantenimiento, de portal administrador de libranzas Sygnus, el cual incluye, Servicio de Soporte Funcional y Tecnológico de software, Servicio de mantenimiento de software y todos los desarrollos necesarios para la adaptación del portal a los Sistemas de Información utilizados por POSITIVA. El portal administrador de libranzas Sygnus deberá administrar todas las operaciones de libranzas de la nómina de pensionados de POSITIVA.\nPARÁGRAFO PRIMERO: Para mayor ilustración y definición de los términos de la presente Aceptación de Oferta, se entiende que la justificación, los estudios previos y la oferta presentada por EL CONTRATISTA, junto con los documentos aportados, hacen parte integral de la presente Aceptación de Oferta.\nPARÁGRAFO SEGUNDO: EL CONTRATISTA deberá obrar con absoluta lealtad y honradez en su relación con POSITIVA y atender con celosa diligencia los encargos que por esta Aceptación de Oferta se le confieran. De igual manera, deberá mantener permanentemente informada a POSITIVA., del desarrollo de la presente Aceptación de Oferta."]
["VICEPRESIDENCIA TÉCNICA","Gerencia Técnica de Vida","NO","C65112022",83111505,"Prestación de servicios: Prestar los servicios profesionales jurídicos encaminados a soportar el ofrecimiento del producto Renta Vitalicia Inmobiliaria y asesorar al cliente en los trámites precontractuales, contractuales y postcontractuales de los procesos a realizar por la Vicepresidencia Técnica y la Gerencia Técnica de Vida referentes a la cotización y contratación de pólizas del seguro citado, enmarcados en el proceso de Gestión del Cliente/Gestión de Producción/Emisión de Positiva Compañía de Seguros S.A.","2022-02-01",2,"2022-12-31",11.1,"Invitación directa","GastosAdministrativos",88000000,88000000,"NO",null,"Gerencia de Abastecimiento Estratégico\ncontratacion@positiva.gov.co\nPBX: (1)6502200 Ext: 10641","SI","SI","NO","SI","Pública clasificada","C65112022-Tipo de información Pública clasificada-Prestación de servicios: Prestar los servicios profesionales jurídicos encaminados a soportar el ofrecimiento del producto Renta Vitalicia Inmobiliaria y asesorar al cliente en los trámites precontractuales, contractuales y postcontractuales de los procesos a realizar por la Vicepresidencia Técnica y la Gerencia Técnica de Vida referentes a la cotización y contratación de pólizas del seguro citado, enmarcados en el proceso de Gestión del Cliente/Gestión de Producción/Emisión de Positiva Compañía de Seguros S.A."]
["VICEPRESIDENCIA TÉCNICA","Vicepresidencia Técnica","NO","C65122022",80111701,"Prestación de servicios: EL CONTRATISTA, se compromete con POSITIVA, a prestar los servicios requeridos por la Vicepresidencia Técnica de POSITIVA, para dar respuesta a las peticiones, quejas, reclamos, solicitudes y derechos de petición que se interpongan para los diferentes ramos de la Compañía; Riesgos Laborales, Salud, y Vida entre otros, así como el apoyo técnico en la respuesta y cumplimiento de tutelas, soporte para respuesta a requerimientos jurídicos, servicios de peritaje, revisión y argumentación frente a dictámenes de calificación emitidos por otras entidades, acompañado lo anterior del seguimiento periódico permanente a los casos que lo ameriten de acuerdo a los criterios que establezca la Compañía","2022-02-01",2,"2023-02-01",12.166666666666666,"Invitación directa","CargoAReserva",0,0,"NO",null,"Gerencia de Abastecimiento Estratégico\ncontratacion@positiva.gov.co\nPBX: (1)6502200 Ext: 10641","SI","SI","NO","SI","Pública clasificada","C65122022-Tipo de información Pública clasificada-Prestación de servicios: EL CONTRATISTA, se compromete con POSITIVA, a prestar los servicios requeridos por la Vicepresidencia Técnica de POSITIVA, para dar respuesta a las peticiones, quejas, reclamos, solicitudes y derechos de petición que se interpongan para los diferentes ramos de la Compañía; Riesgos Laborales, Salud, y Vida entre otros, así como el apoyo técnico en la respuesta y cumplimiento de tutelas, soporte para respuesta a requerimientos jurídicos, servicios de peritaje, revisión y argumentación frente a dictámenes de calificación emitidos por otras entidades, acompañado lo anterior del seguimiento periódico permanente a los casos que lo ameriten de acuerdo a los criterios que establezca la Compañía"]
["VICEPRESIDENCIA TÉCNICA","Gerencia Médica","NO","C65132022",86101806,"Prestación de servicios: Prestar los servicios de diseño, desarrollo y virtualización de contenidos educativos, capacitación y acompañamiento a las personas inscritas que atienden la población asegurada para la atención integral de siniestros. ","2022-07-01",7,"2022-12-31",6.1,"Invitación directa","GastosAdministrativos",140000000,140000000,"NO",null,"Gerencia de Abastecimiento Estratégico\ncontratacion@positiva.gov.co\nPBX: (1)6502200 Ext: 10641","SI","SI","NO","SI","Pública clasificada","C65132022-Tipo de información Pública clasificada-Prestación de servicios: Prestar los servicios de diseño, desarrollo y virtualización de contenidos educativos, capacitación y acompañamiento a las personas inscritas que atienden la población asegurada para la atención integral de siniestros. "]
["VICEPRESIDENCIA TÉCNICA","Gerencia Médica","NO","C65142022",85100000,"Prestación de servicios: PRESTACIÓN DE SERVICIOS: El CONTRATISTA se obliga con POSITIVA a la prestación de los servicios de salud para los asegurados y/o afiliados a POSITIVA, que accedan a los servicios del CONTRATISTA en calidad de asegurados, a los ramos: Administración de Riesgos Laborales (ARL -por causa exclusiva de un accidente de trabajo, una enfermedad profesional), Accidentes Personales (AP Educativo Generación Positiva, AP Colectivos, AP Corto Plazo, AP Individual), Vida Individual, Vida Grupo, Planes de Salud y demás Ramos de Seguros autorizados a Positiva, encontrándose excluidos del presente contrato los servicios y todas aquellas actividades, procedimientos e intervenciones que no tengan por objeto contribuir al diagnóstico, tratamiento o rehabilitación de la patología derivada del evento calificado como profesional o los servicios considerados como experimentales, cosméticos y suntuarios. Para tal efecto, POSITIVA se compromete a pagarle al CONTRATISTA el valor de los servicios de salud","2022-01-12",1,"2024-01-12",24.333333333333332,"Invitación directa","CargoAReserva",0,0,"NO",null,"Gerencia de Abastecimiento Estratégico\ncontratacion@positiva.gov.co\nPBX: (1)6502200 Ext: 10641","SI","SI","NO","SI","Pública clasificada","C65142022-Tipo de información Pública clasificada-Prestación de servicios: PRESTACIÓN DE SERVICIOS: El CONTRATISTA se obliga con POSITIVA a la prestación de los servicios de salud para los asegurados y/o afiliados a POSITIVA, que accedan a los servicios del CONTRATISTA en calidad de asegurados, a los ramos: Administración de Riesgos Laborales (ARL -por causa exclusiva de un accidente de trabajo, una enfermedad profesional), Accidentes Personales (AP Educativo Generación Positiva, AP Colectivos, AP Corto Plazo, AP Individual), Vida Individual, Vida Grupo, Planes de Salud y demás Ramos de Seguros autorizados a Positiva, encontrándose excluidos del presente contrato los servicios y todas aquellas actividades, procedimientos e intervenciones que no tengan por objeto contribuir al diagnóstico, tratamiento o rehabilitación de la patología derivada del evento calificado como profesional o los servicios considerados como experimentales, cosméticos y suntuarios. Para tal efecto, POSITIVA se compromete a pagarle al CONTRATISTA el valor de los servicios de salud"]
["VICEPRESIDENCIA TÉCNICA","Gerencia Médica","NO","C65152022",85100000,"Prestación de servicios: El CONTRATISTA se obliga con POSITIVA a la prestación de los servicios de salud para los asegurados y/o afiliados a POSITIVA, que accedan a los servicios del CONTRATISTA en calidad de asegurados, a los ramos: Administración de Riesgos Laborales (ARL -por causa exclusiva de un accidente de trabajo, una enfermedad profesional), Accidentes Personales (AP Educativo Generación Positiva, AP Colectivos, AP Corto Plazo, AP Individual), Vida Individual, Vida Grupo, Planes de Salud y demás Ramos de Seguros autorizados a Positiva, encontrándose excluidos del presente contrato los servicios y todas aquellas actividades, procedimientos e intervenciones que no tengan por objeto contribuir al diagnóstico, tratamiento o rehabilitación de la patología derivada del evento calificado como profesional o los servicios considerados como experimentales, cosméticos y suntuarios. Para tal efecto, POSITIVA se compromete a pagarle al CONTRATISTA el valor de los servicios de salud","2022-01-15",1,"2024-01-15",24.333333333333332,"Invitación directa","CargoAReserva",0,0,"NO",null,"Gerencia de Abastecimiento Estratégico\ncontratacion@positiva.gov.co\nPBX: (1)6502200 Ext: 10641","SI","SI","NO","SI","Pública clasificada","C65152022-Tipo de información Pública clasificada-Prestación de servicios: El CONTRATISTA se obliga con POSITIVA a la prestación de los servicios de salud para los asegurados y/o afiliados a POSITIVA, que accedan a los servicios del CONTRATISTA en calidad de asegurados, a los ramos: Administración de Riesgos Laborales (ARL -por causa exclusiva de un accidente de trabajo, una enfermedad profesional), Accidentes Personales (AP Educativo Generación Positiva, AP Colectivos, AP Corto Plazo, AP Individual), Vida Individual, Vida Grupo, Planes de Salud y demás Ramos de Seguros autorizados a Positiva, encontrándose excluidos del presente contrato los servicios y todas aquellas actividades, procedimientos e intervenciones que no tengan por objeto contribuir al diagnóstico, tratamiento o rehabilitación de la patología derivada del evento calificado como profesional o los servicios considerados como experimentales, cosméticos y suntuarios. Para tal efecto, POSITIVA se compromete a pagarle al CONTRATISTA el valor de los servicios de salud"]
["VICEPRESIDENCIA TÉCNICA","Gerencia Médica","NO","C65162022",81111800,"Prestación de servicios: EL CONTRATISTA SE OBLIGA A: La   Prestación de servicios de soluciones web en la modalidad de software como servicio (SaaS), que permita la gestión integral del  siniestro y que contemple la integración de los canales de comunicación dispuestos para los clientes, la red de prestadores, la gestión de las solicitudes de autorizaciones de servicios de salud, la captura de avisos de siniestros, la radicación y auditoría de cuentas médicas, la auditoria de Microgestion de los siniestros, la validación y consulta de los movimientos realizados durante la vida del siniestro","2022-01-15",1,"2024-01-15",{"$f":"(I477-G477)/30","v":24.333333333333332},"Invitación directa","CargoAReserva",11820600000,5910300000,"NO",null,"Gerencia de Abastecimiento Estratégico\ncontratacion@positiva.gov.co\nPBX: (1)6502200 Ext: 10641","SI","SI","NO","SI","Pública clasificada","C65162022-Tipo de información Pública clasificada-Prestación de servicios: EL CONTRATISTA SE OBLIGA A: La   Prestación de servicios de soluciones web en la modalidad de software como servicio (SaaS), que permita la gestión integral del  siniestro y que contemple la integración de los canales de comunicación dispuestos para los clientes, la red de prestadores, la gestión de las solicitudes de autorizaciones de servicios de salud, la captura de avisos de siniestros, la radicación y auditoría de cuentas médicas, la auditoria de Microgestion de los siniestros, la validación y consulta de los movimientos realizados durante la vida del siniestro"]
["VICEPRESIDENCIA TÉCNICA","Gerencia Médica","NO","C65172022",83111507,"Prestación de servicios: PRESTACION DE LOS SERVICIOS DE GESTION LOGÍSTICA ESPECIALIZADA PARA LA PRESTACIÓN DE SERVICIOS ASISTENCIALES EN SALUD con el objetivo de administrar de manera  eficiente los recursos económicos dispuestos para garantizar las prestaciones asistenciales de los afiliados y asegurados de todos los ramos habilitados de POSITIVA COMPAÑÍA DE SEGUROS S.A.","2022-09-01",9,"2024-09-30",25.333333333333332,"Invitación pública","CargoAReserva",0,0,"NO",null,"Gerencia de Abastecimiento Estratégico\ncontratacion@positiva.gov.co\nPBX: (1)6502200 Ext: 10641","SI","SI","NO","SI","Pública clasificada","C65172022-Tipo de información Pública clasificada-Prestación de servicios: PRESTACION DE LOS SERVICIOS DE GESTION LOGÍSTICA ESPECIALIZADA PARA LA PRESTACIÓN DE SERVICIOS ASISTENCIALES EN SALUD con el objetivo de administrar de manera  eficiente los recursos económicos dispuestos para garantizar las prestaciones asistenciales de los afiliados y asegurados de todos los ramos habilitados de POSITIVA COMPAÑÍA DE SEGUROS S.A."]
["VICEPRESIDENCIA TÉCNICA","Gerencia Médica","NO","C65182022",51100000,"Prestación de servicios: PRESTAR LOS SERVICIOS A NIVEL NACIONAL DE DISPENSACIÓN, SUMINISTRO, DISTRIBUCIÓN Y CONTROL DE MEDICAMENTOS, DISPOSITIVOS, INSUMOS MÉDICOS Y PRODUCTOS COMPLEMENTARIOS EN SALUD A LOS ASEGURADOS EN LOS DIFERENTES RAMOS HABILITADOS DE POSITIVA COMPAÑIA DE SEGUROS S.A","2022-06-01",6,"2024-06-01",24.366666666666667,"Invitación pública","CargoAReserva",0,0,"NO",null,"Gerencia de Abastecimiento Estratégico\ncontratacion@positiva.gov.co\nPBX: (1)6502200 Ext: 10641","SI","SI","NO","SI","Pública clasificada","C65182022-Tipo de información Pública clasificada-Prestación de servicios: PRESTAR LOS SERVICIOS A NIVEL NACIONAL DE DISPENSACIÓN, SUMINISTRO, DISTRIBUCIÓN Y CONTROL DE MEDICAMENTOS, DISPOSITIVOS, INSUMOS MÉDICOS Y PRODUCTOS COMPLEMENTARIOS EN SALUD A LOS ASEGURADOS EN LOS DIFERENTES RAMOS HABILITADOS DE POSITIVA COMPAÑIA DE SEGUROS S.A"]
["VICEPRESIDENCIA TÉCNICA","Gerencia Médica","NO","C65192022",80000000,"Prestación de servicios: PRESTAR LOS SERVICIOS ESPECIALIZADOS DE INTERVENTORÍA TÉCNICA, JURÍDICA, FINANCIERA Y ADMINISTRATIVA A LOS CONTRATOS ESPECIALIZADOS DE LA COMPAÑÍA  RELACIONADOS CON LOS SERVICIOS DE MEDICINA LABORAL","2022-09-01",9,"2024-09-30",25.333333333333332,"Invitación de Méritos","CargoAReserva",0,0,"NO",null,"Gerencia de Abastecimiento Estratégico\ncontratacion@positiva.gov.co\nPBX: (1)6502200 Ext: 10641","SI","SI","NO","SI","Pública clasificada","C65192022-Tipo de información Pública clasificada-Prestación de servicios: PRESTAR LOS SERVICIOS ESPECIALIZADOS DE INTERVENTORÍA TÉCNICA, JURÍDICA, FINANCIERA Y ADMINISTRATIVA A LOS CONTRATOS ESPECIALIZADOS DE LA COMPAÑÍA  RELACIONADOS CON LOS SERVICIOS DE MEDICINA LABORAL"]
["VICEPRESIDENCIA TÉCNICA","Gerencia Médica","NO","C65202022",80000000,"Prestación de servicios: PRESTAR LOS SERVICIOS ESPECIALIZADOS DE INTERVENTORÍA TÉCNICA, JURÍDICA, FINANCIERA Y ADMINISTRATIVA A LOS CONTRATOS DE  SERVICIOS DE GESTION LOGÍSTICA ESPECIALIZADA PARA LA PRESTACIÓN DE SERVICIOS ASISTENCIALES EN SALUD","2022-09-01",9,"2024-09-30",25.333333333333332,"Invitación de Méritos","CargoAReserva",0,0,"NO",null,"Gerencia de Abastecimiento Estratégico\ncontratacion@positiva.gov.co\nPBX: (1)6502200 Ext: 10641","SI","SI","NO","SI","Pública clasificada","C65202022-Tipo de información Pública clasificada-Prestación de servicios: PRESTAR LOS SERVICIOS ESPECIALIZADOS DE INTERVENTORÍA TÉCNICA, JURÍDICA, FINANCIERA Y ADMINISTRATIVA A LOS CONTRATOS DE  SERVICIOS DE GESTION LOGÍSTICA ESPECIALIZADA PARA LA PRESTACIÓN DE SERVICIOS ASISTENCIALES EN SALUD"]
["VICEPRESIDENCIA TÉCNICA","Gerencia Médica","NO","C65212022",80101600,"Prestación de servicios: PRESTAR LOS SERVICIOS DE ATENCIÓN, SEGUIMIENTO Y CONTROL DE LAS PRESTACIONES ASISTENCIALES Y ECONÓMICAS DE LOS SINIESTROS PARA LOS DIFERENTES RAMOS Y PRODUCTOS COMERCIALIZADOS POR POSITIVA","2022-04-15",4,"2023-04-15",12.166666666666666,"Invitación pública","CargoAReserva",0,0,"NO",null,"Gerencia de Abastecimiento Estratégico\ncontratacion@positiva.gov.co\nPBX: (1)6502200 Ext: 10641","SI","SI","NO","SI","Pública clasificada","C65212022-Tipo de información Pública clasificada-Prestación de servicios: PRESTAR LOS SERVICIOS DE ATENCIÓN, SEGUIMIENTO Y CONTROL DE LAS PRESTACIONES ASISTENCIALES Y ECONÓMICAS DE LOS SINIESTROS PARA LOS DIFERENTES RAMOS Y PRODUCTOS COMERCIALIZADOS POR POSITIVA"]
["VICEPRESIDENCIA TÉCNICA","Gerencia Médica","NO","C65222022",85100000,"Prestación de servicios: El CONTRATISTA se obliga con POSITIVA a la prestación de los servicios de salud para los asegurados y o afiliados a POSITIVA que accedan a los servicios habilitados del CONTRATISTA en calidad de asegurados a los ramos Administración de Riesgos Laborales ARL por causa exclusiva de un accidente de trabajo una enfermedad profesional) Accidentes Personales AP Educativo Generación Positiva AP Colectivos APCorto Plazo AP Individual y demás Ramos de Seguros autorizados a Positiva encontrándose excluidos del presente contrato los servicios y todas aquellas actividades procedimientos e intervenciones que no tengan por objeto contribuir al diagnóstico tratamiento o rehabilitación de la patología derivada del siniestro o los servicios considerados como experimentales cosméticos y suntuarios.","2022-02-09",2,"2024-02-09",24.333333333333332,"Invitación directa","CargoAReserva",0,0,"NO",null,"Gerencia de Abastecimiento Estratégico\ncontratacion@positiva.gov.co\nPBX: (1)6502200 Ext: 10641","SI","SI","NO","SI","Pública clasificada","C65222022-Tipo de información Pública clasificada-Prestación de servicios: El CONTRATISTA se obliga con POSITIVA a la prestación de los servicios de salud para los asegurados y o afiliados a POSITIVA que accedan a los servicios habilitados del CONTRATISTA en calidad de asegurados a los ramos Administración de Riesgos Laborales ARL por causa exclusiva de un accidente de trabajo una enfermedad profesional) Accidentes Personales AP Educativo Generación Positiva AP Colectivos APCorto Plazo AP Individual y demás Ramos de Seguros autorizados a Positiva encontrándose excluidos del presente contrato los servicios y todas aquellas actividades procedimientos e intervenciones que no tengan por objeto contribuir al diagnóstico tratamiento o rehabilitación de la patología derivada del siniestro o los servicios considerados como experimentales cosméticos y suntuarios."]
["VICEPRESIDENCIA TÉCNICA","Gerencia Médica","NO","C65232022",85100000,"Prestación de servicios: El CONTRATISTA se obliga con POSITIVA a la prestación de los servicios de salud para los asegurados y o afiliados a POSITIVA que accedan a los servicios habilitados del CONTRATISTA en calidad de asegurados a los ramos Administración de Riesgos Laborales ARL por causa exclusiva de un accidente de trabajo una enfermedad profesional) Accidentes Personales AP Educativo Generación Positiva AP Colectivos APCorto Plazo AP Individual y demás Ramos de Seguros autorizados a Positiva encontrándose excluidos del presente contrato los servicios y todas aquellas actividades procedimientos e intervenciones que no tengan por objeto contribuir al diagnóstico tratamiento o rehabilitación de la patología derivada del siniestro o los servicios considerados como experimentales cosméticos y suntuarios.","2022-08-25",8,"2027-08-25",60.866666666666667,"Invitación directa","CargoAReserva",0,0,"NO",null,"Gerencia de Abastecimiento Estratégico\ncontratacion@positiva.gov.co\nPBX: (1)6502200 Ext: 10641","SI","SI","NO","SI","Pública clasificada","C65232022-Tipo de información Pública clasificada-Prestación de servicios: El CONTRATISTA se obliga con POSITIVA a la prestación de los servicios de salud para los asegurados y o afiliados a POSITIVA que accedan a los servicios habilitados del CONTRATISTA en calidad de asegurados a los ramos Administración de Riesgos Laborales ARL por causa exclusiva de un accidente de trabajo una enfermedad profesional) Accidentes Personales AP Educativo Generación Positiva AP Colectivos APCorto Plazo AP Individual y demás Ramos de Seguros autorizados a Positiva encontrándose excluidos del presente contrato los servicios y todas aquellas actividades procedimientos e intervenciones que no tengan por objeto contribuir al diagnóstico tratamiento o rehabilitación de la patología derivada del siniestro o los servicios considerados como experimentales cosméticos y suntuarios."]
["VICEPRESIDENCIA TÉCNICA","Gerencia Médica","NO","C65242022",85100000,"Prestación de servicios: El CONTRATISTA se obliga con POSITIVA a la prestación de los servicios de salud para los asegurados y o afiliados a POSITIVA que accedan a los servicios habilitados del CONTRATISTA en calidad de asegurados a los ramos Administración de Riesgos Laborales ARL por causa exclusiva de un accidente de trabajo una enfermedad profesional) Accidentes Personales AP Educativo Generación Positiva AP Colectivos APCorto Plazo AP Individual y demás Ramos de Seguros autorizados a Positiva encontrándose excluidos del presente contrato los servicios y todas aquellas actividades procedimientos e intervenciones que no tengan por objeto contribuir al diagnóstico tratamiento o rehabilitación de la patología derivada del siniestro o los servicios considerados como experimentales cosméticos y suntuarios.","2022-12-29",12,"2027-12-29",60.866666666666667,"Invitación directa","CargoAReserva",0,0,"NO",null,"Gerencia de Abastecimiento Estratégico\ncontratacion@positiva.gov.co\nPBX: (1)6502200 Ext: 10641","SI","SI","NO","SI","Pública clasificada","C65242022-Tipo de información Pública clasificada-Prestación de servicios: El CONTRATISTA se obliga con POSITIVA a la prestación de los servicios de salud para los asegurados y o afiliados a POSITIVA que accedan a los servicios habilitados del CONTRATISTA en calidad de asegurados a los ramos Administración de Riesgos Laborales ARL por causa exclusiva de un accidente de trabajo una enfermedad profesional) Accidentes Personales AP Educativo Generación Positiva AP Colectivos APCorto Plazo AP Individual y demás Ramos de Seguros autorizados a Positiva encontrándose excluidos del presente contrato los servicios y todas aquellas actividades procedimientos e intervenciones que no tengan por objeto contribuir al diagnóstico tratamiento o rehabilitación de la patología derivada del siniestro o los servicios considerados como experimentales cosméticos y suntuarios."]
["VICEPRESIDENCIA TÉCNICA","Gerencia Médica","NO","C65252022",85100000,"Prestación de servicios: El CONTRATISTA se obliga con POSITIVA a la prestación de los servicios de salud para los asegurados y o afiliados a POSITIVA que accedan a los servicios habilitados del CONTRATISTA en calidad de asegurados a los ramos Administración de Riesgos Laborales ARL por causa exclusiva de un accidente de trabajo una enfermedad profesional) Accidentes Personales AP Educativo Generación Positiva AP Colectivos APCorto Plazo AP Individual y demás Ramos de Seguros autorizados a Positiva encontrándose excluidos del presente contrato los servicios y todas aquellas actividades procedimientos e intervenciones que no tengan por objeto contribuir al diagnóstico tratamiento o rehabilitación de la patología derivada del siniestro o los servicios considerados como experimentales cosméticos y suntuarios.","2022-04-30",4,"2024-04-30",24.366666666666667,"Invitación directa","CargoAReserva",0,0,"NO",null,"Gerencia de Abastecimiento Estratégico\ncontratacion@positiva.gov.co\nPBX: (1)6502200 Ext: 10641","SI","SI","NO","SI","Pública clasificada","C65252022-Tipo de información Pública clasificada-Prestación de servicios: El CONTRATISTA se obliga con POSITIVA a la prestación de los servicios de salud para los asegurados y o afiliados a POSITIVA que accedan a los servicios habilitados del CONTRATISTA en calidad de asegurados a los ramos Administración de Riesgos Laborales ARL por causa exclusiva de un accidente de trabajo una enfermedad profesional) Accidentes Personales AP Educativo Generación Positiva AP Colectivos APCorto Plazo AP Individual y demás Ramos de Seguros autorizados a Positiva encontrándose excluidos del presente contrato los servicios y todas aquellas actividades procedimientos e intervenciones que no tengan por objeto contribuir al diagnóstico tratamiento o rehabilitación de la patología derivada del siniestro o los servicios considerados como experimentales cosméticos y suntuarios."]
["VICEPRESIDENCIA TÉCNICA","Gerencia Médica","NO","C65262022",85100000,"Prestación de servicios: El CONTRATISTA se obliga con POSITIVA a la prestación de los servicios de salud para los asegurados y o afiliados a POSITIVA que accedan a los servicios habilitados del CONTRATISTA en calidad de asegurados a los ramos Administración de Riesgos Laborales ARL por causa exclusiva de un accidente de trabajo una enfermedad profesional) Accidentes Personales AP Educativo Generación Positiva AP Colectivos APCorto Plazo AP Individual y demás Ramos de Seguros autorizados a Positiva encontrándose excluidos del presente contrato los servicios y todas aquellas actividades procedimientos e intervenciones que no tengan por objeto contribuir al diagnóstico tratamiento o rehabilitación de la patología derivada del siniestro o los servicios considerados como experimentales cosméticos y suntuarios.","2022-02-28",2,"2024-02-28",24.333333333333332,"Invitación directa","CargoAReserva",0,0,"NO",null,"Gerencia de Abastecimiento Estratégico\ncontratacion@positiva.gov.co\nPBX: (1)6502200 Ext: 10641","SI","SI","NO","SI","Pública clasificada","C65262022-Tipo de información Pública clasificada-Prestación de servicios: El CONTRATISTA se obliga con POSITIVA a la prestación de los servicios de salud para los asegurados y o afiliados a POSITIVA que accedan a los servicios habilitados del CONTRATISTA en calidad de asegurados a los ramos Administración de Riesgos Laborales ARL por causa exclusiva de un accidente de trabajo una enfermedad profesional) Accidentes Personales AP Educativo Generación Positiva AP Colectivos APCorto Plazo AP Individual y demás Ramos de Seguros autorizados a Positiva encontrándose excluidos del presente contrato los servicios y todas aquellas actividades procedimientos e intervenciones que no tengan por objeto contribuir al diagnóstico tratamiento o rehabilitación de la patología derivada del siniestro o los servicios considerados como experimentales cosméticos y suntuarios."]
["VICEPRESIDENCIA TÉCNICA","Gerencia Médica","NO","C65272022",85100000,"Prestación de servicios: El CONTRATISTA se obliga con POSITIVA a la prestación de los servicios de salud para los asegurados y o afiliados a POSITIVA que accedan a los servicios habilitados del CONTRATISTA en calidad de asegurados a los ramos Administración de Riesgos Laborales ARL por causa exclusiva de un accidente de trabajo una enfermedad profesional) Accidentes Personales AP Educativo Generación Positiva AP Colectivos APCorto Plazo AP Individual y demás Ramos de Seguros autorizados a Positiva encontrándose excluidos del presente contrato los servicios y todas aquellas actividades procedimientos e intervenciones que no tengan por objeto contribuir al diagnóstico tratamiento o rehabilitación de la patología derivada del siniestro o los servicios considerados como experimentales cosméticos y suntuarios.","2022-09-01",9,"2024-09-30",25.333333333333332,"Invitación directa","CargoAReserva",0,0,"NO",null,"Gerencia de Abastecimiento Estratégico\ncontratacion@positiva.gov.co\nPBX: (1)6502200 Ext: 10641","SI","SI","NO","SI","Pública clasificada","C65272022-Tipo de información Pública clasificada-Prestación de servicios: El CONTRATISTA se obliga con POSITIVA a la prestación de los servicios de salud para los asegurados y o afiliados a POSITIVA que accedan a los servicios habilitados del CONTRATISTA en calidad de asegurados a los ramos Administración de Riesgos Laborales ARL por causa exclusiva de un accidente de trabajo una enfermedad profesional) Accidentes Personales AP Educativo Generación Positiva AP Colectivos APCorto Plazo AP Individual y demás Ramos de Seguros autorizados a Positiva encontrándose excluidos del presente contrato los servicios y todas aquellas actividades procedimientos e intervenciones que no tengan por objeto contribuir al diagnóstico tratamiento o rehabilitación de la patología derivada del siniestro o los servicios considerados como experimentales cosméticos y suntuarios."]
["VICEPRESIDENCIA TÉCNICA","Gerencia Médica","NO","C65282022",85100000,"Prestación de servicios: El CONTRATISTA se obliga con POSITIVA a la prestación de los servicios de salud para los asegurados y o afiliados a POSITIVA que accedan a los servicios habilitados del CONTRATISTA en calidad de asegurados a los ramos Administración de Riesgos Laborales ARL por causa exclusiva de un accidente de trabajo una enfermedad profesional) Accidentes Personales AP Educativo Generación Positiva AP Colectivos APCorto Plazo AP Individual y demás Ramos de Seguros autorizados a Positiva encontrándose excluidos del presente contrato los servicios y todas aquellas actividades procedimientos e intervenciones que no tengan por objeto contribuir al diagnóstico tratamiento o rehabilitación de la patología derivada del siniestro o los servicios considerados como experimentales cosméticos y suntuarios.","2022-07-06",7,"2024-07-06",24.366666666666667,"Invitación directa","CargoAReserva",0,0,"NO",null,"Gerencia de Abastecimiento Estratégico\ncontratacion@positiva.gov.co\nPBX: (1)6502200 Ext: 10641","SI","SI","NO","SI","Pública clasificada","C65282022-Tipo de información Pública clasificada-Prestación de servicios: El CONTRATISTA se obliga con POSITIVA a la prestación de los servicios de salud para los asegurados y o afiliados a POSITIVA que accedan a los servicios habilitados del CONTRATISTA en calidad de asegurados a los ramos Administración de Riesgos Laborales ARL por causa exclusiva de un accidente de trabajo una enfermedad profesional) Accidentes Personales AP Educativo Generación Positiva AP Colectivos APCorto Plazo AP Individual y demás Ramos de Seguros autorizados a Positiva encontrándose excluidos del presente contrato los servicios y todas aquellas actividades procedimientos e intervenciones que no tengan por objeto contribuir al diagnóstico tratamiento o rehabilitación de la patología derivada del siniestro o los servicios considerados como experimentales cosméticos y suntuarios."]
["VICEPRESIDENCIA TÉCNICA","Gerencia Médica","NO","C65292022",85100000,"Prestación de servicios: El CONTRATISTA se obliga con POSITIVA a la prestación de los servicios de salud para los asegurados y o afiliados a POSITIVA que accedan a los servicios habilitados del CONTRATISTA en calidad de asegurados a los ramos Administración de Riesgos Laborales ARL por causa exclusiva de un accidente de trabajo una enfermedad profesional) Accidentes Personales AP Educativo Generación Positiva AP Colectivos APCorto Plazo AP Individual y demás Ramos de Seguros autorizados a Positiva encontrándose excluidos del presente contrato los servicios y todas aquellas actividades procedimientos e intervenciones que no tengan por objeto contribuir al diagnóstico tratamiento o rehabilitación de la patología derivada del siniestro o los servicios considerados como experimentales cosméticos y suntuarios.","2022-09-01",9,"2024-09-30",25.333333333333332,"Invitación directa","CargoAReserva",0,0,"NO",null,"Gerencia de Abastecimiento Estratégico\ncontratacion@positiva.gov.co\nPBX: (1)6502200 Ext: 10641","SI","SI","NO","SI","Pública clasificada","C65292022-Tipo de información Pública clasificada-Prestación de servicios: El CONTRATISTA se obliga con POSITIVA a la prestación de los servicios de salud para los asegurados y o afiliados a POSITIVA que accedan a los servicios habilitados del CONTRATISTA en calidad de asegurados a los ramos Administración de Riesgos Laborales ARL por causa exclusiva de un accidente de trabajo una enfermedad profesional) Accidentes Personales AP Educativo Generación Positiva AP Colectivos APCorto Plazo AP Individual y demás Ramos de Seguros autorizados a Positiva encontrándose excluidos del presente contrato los servicios y todas aquellas actividades procedimientos e intervenciones que no tengan por objeto contribuir al diagnóstico tratamiento o rehabilitación de la patología derivada del siniestro o los servicios considerados como experimentales cosméticos y suntuarios."]
["VICEPRESIDENCIA TÉCNICA","Gerencia Médica","NO","C65302022",85100000,"Prestación de servicios: El CONTRATISTA se obliga con POSITIVA a la prestación de los servicios de salud para los asegurados y o afiliados a POSITIVA que accedan a los servicios habilitados del CONTRATISTA en calidad de asegurados a los ramos Administración de Riesgos Laborales ARL por causa exclusiva de un accidente de trabajo una enfermedad profesional) Accidentes Personales AP Educativo Generación Positiva AP Colectivos APCorto Plazo AP Individual y demás Ramos de Seguros autorizados a Positiva encontrándose excluidos del presente contrato los servicios y todas aquellas actividades procedimientos e intervenciones que no tengan por objeto contribuir al diagnóstico tratamiento o rehabilitación de la patología derivada del siniestro o los servicios considerados como experimentales cosméticos y suntuarios.","2022-07-01",7,"2027-07-01",60.866666666666667,"Invitación directa","CargoAReserva",0,0,"NO",null,"Gerencia de Abastecimiento Estratégico\ncontratacion@positiva.gov.co\nPBX: (1)6502200 Ext: 10641","SI","SI","NO","SI","Pública clasificada","C65302022-Tipo de información Pública clasificada-Prestación de servicios: El CONTRATISTA se obliga con POSITIVA a la prestación de los servicios de salud para los asegurados y o afiliados a POSITIVA que accedan a los servicios habilitados del CONTRATISTA en calidad de asegurados a los ramos Administración de Riesgos Laborales ARL por causa exclusiva de un accidente de trabajo una enfermedad profesional) Accidentes Personales AP Educativo Generación Positiva AP Colectivos APCorto Plazo AP Individual y demás Ramos de Seguros autorizados a Positiva encontrándose excluidos del presente contrato los servicios y todas aquellas actividades procedimientos e intervenciones que no tengan por objeto contribuir al diagnóstico tratamiento o rehabilitación de la patología derivada del siniestro o los servicios considerados como experimentales cosméticos y suntuarios."]
["VICEPRESIDENCIA TÉCNICA","Gerencia Médica","NO","C65312022",85100000,"Prestación de servicios: El CONTRATISTA se obliga con POSITIVA a la prestación de los servicios de salud para los asegurados y o afiliados a POSITIVA que accedan a los servicios habilitados del CONTRATISTA en calidad de asegurados a los ramos Administración de Riesgos Laborales ARL por causa exclusiva de un accidente de trabajo una enfermedad profesional) Accidentes Personales AP Educativo Generación Positiva AP Colectivos APCorto Plazo AP Individual y demás Ramos de Seguros autorizados a Positiva encontrándose excluidos del presente contrato los servicios y todas aquellas actividades procedimientos e intervenciones que no tengan por objeto contribuir al diagnóstico tratamiento o rehabilitación de la patología derivada del siniestro o los servicios considerados como experimentales cosméticos y suntuarios.","2022-08-01",8,"2027-08-01",60.866666666666667,"Invitación directa","CargoAReserva",0,0,"NO",null,"Gerencia de Abastecimiento Estratégico\ncontratacion@positiva.gov.co\nPBX: (1)6502200 Ext: 10641","SI","SI","NO","SI","Pública clasificada","C65312022-Tipo de información Pública clasificada-Prestación de servicios: El CONTRATISTA se obliga con POSITIVA a la prestación de los servicios de salud para los asegurados y o afiliados a POSITIVA que accedan a los servicios habilitados del CONTRATISTA en calidad de asegurados a los ramos Administración de Riesgos Laborales ARL por causa exclusiva de un accidente de trabajo una enfermedad profesional) Accidentes Personales AP Educativo Generación Positiva AP Colectivos APCorto Plazo AP Individual y demás Ramos de Seguros autorizados a Positiva encontrándose excluidos del presente contrato los servicios y todas aquellas actividades procedimientos e intervenciones que no tengan por objeto contribuir al diagnóstico tratamiento o rehabilitación de la patología derivada del siniestro o los servicios considerados como experimentales cosméticos y suntuarios."]
["VICEPRESIDENCIA TÉCNICA","Gerencia Médica","NO","C65322022",85100000,"Prestación de servicios: El CONTRATISTA se obliga con POSITIVA a la prestación de los servicios de salud para los asegurados y o afiliados a POSITIVA que accedan a los servicios habilitados del CONTRATISTA en calidad de asegurados a los ramos Administración de Riesgos Laborales ARL por causa exclusiva de un accidente de trabajo una enfermedad profesional) Accidentes Personales AP Educativo Generación Positiva AP Colectivos APCorto Plazo AP Individual y demás Ramos de Seguros autorizados a Positiva encontrándose excluidos del presente contrato los servicios y todas aquellas actividades procedimientos e intervenciones que no tengan por objeto contribuir al diagnóstico tratamiento o rehabilitación de la patología derivada del siniestro o los servicios considerados como experimentales cosméticos y suntuarios.","2022-09-01",9,"2027-09-01",60.866666666666667,"Invitación directa","CargoAReserva",0,0,"NO",null,"Gerencia de Abastecimiento Estratégico\ncontratacion@positiva.gov.co\nPBX: (1)6502200 Ext: 10641","SI","SI","NO","SI","Pública clasificada","C65322022-Tipo de información Pública clasificada-Prestación de servicios: El CONTRATISTA se obliga con POSITIVA a la prestación de los servicios de salud para los asegurados y o afiliados a POSITIVA que accedan a los servicios habilitados del CONTRATISTA en calidad de asegurados a los ramos Administración de Riesgos Laborales ARL por causa exclusiva de un accidente de trabajo una enfermedad profesional) Accidentes Personales AP Educativo Generación Positiva AP Colectivos APCorto Plazo AP Individual y demás Ramos de Seguros autorizados a Positiva encontrándose excluidos del presente contrato los servicios y todas aquellas actividades procedimientos e intervenciones que no tengan por objeto contribuir al diagnóstico tratamiento o rehabilitación de la patología derivada del siniestro o los servicios considerados como experimentales cosméticos y suntuarios."]
["VICEPRESIDENCIA TÉCNICA","Gerencia Médica","NO","C65332022",85100000,"Prestación de servicios: El CONTRATISTA se obliga con POSITIVA a la prestación de los servicios de salud para los asegurados y o afiliados a POSITIVA que accedan a los servicios habilitados del CONTRATISTA en calidad de asegurados a los ramos Administración de Riesgos Laborales ARL por causa exclusiva de un accidente de trabajo una enfermedad profesional) Accidentes Personales AP Educativo Generación Positiva AP Colectivos APCorto Plazo AP Individual y demás Ramos de Seguros autorizados a Positiva encontrándose excluidos del presente contrato los servicios y todas aquellas actividades procedimientos e intervenciones que no tengan por objeto contribuir al diagnóstico tratamiento o rehabilitación de la patología derivada del siniestro o los servicios considerados como experimentales cosméticos y suntuarios.","2022-08-01",8,"2024-08-07",24.566666666666666,"Invitación directa","CargoAReserva",0,0,"NO",null,"Gerencia de Abastecimiento Estratégico\ncontratacion@positiva.gov.co\nPBX: (1)6502200 Ext: 10641","SI","SI","NO","SI","Pública clasificada","C65332022-Tipo de información Pública clasificada-Prestación de servicios: El CONTRATISTA se obliga con POSITIVA a la prestación de los servicios de salud para los asegurados y o afiliados a POSITIVA que accedan a los servicios habilitados del CONTRATISTA en calidad de asegurados a los ramos Administración de Riesgos Laborales ARL por causa exclusiva de un accidente de trabajo una enfermedad profesional) Accidentes Personales AP Educativo Generación Positiva AP Colectivos APCorto Plazo AP Individual y demás Ramos de Seguros autorizados a Positiva encontrándose excluidos del presente contrato los servicios y todas aquellas actividades procedimientos e intervenciones que no tengan por objeto contribuir al diagnóstico tratamiento o rehabilitación de la patología derivada del siniestro o los servicios considerados como experimentales cosméticos y suntuarios."]
["VICEPRESIDENCIA TÉCNICA","Gerencia Médica","NO","C65342022",85100000,"Prestación de servicios: El CONTRATISTA se obliga con POSITIVA a la prestación de los servicios de salud para los asegurados y o afiliados a POSITIVA que accedan a los servicios habilitados del CONTRATISTA en calidad de asegurados a los ramos Administración de Riesgos Laborales ARL por causa exclusiva de un accidente de trabajo una enfermedad profesional) Accidentes Personales AP Educativo Generación Positiva AP Colectivos APCorto Plazo AP Individual y demás Ramos de Seguros autorizados a Positiva encontrándose excluidos del presente contrato los servicios y todas aquellas actividades procedimientos e intervenciones que no tengan por objeto contribuir al diagnóstico tratamiento o rehabilitación de la patología derivada del siniestro o los servicios considerados como experimentales cosméticos y suntuarios.","2022-10-01",10,"2027-10-01",60.866666666666667,"Invitación directa","CargoAReserva",0,0,"NO",null,"Gerencia de Abastecimiento Estratégico\ncontratacion@positiva.gov.co\nPBX: (1)6502200 Ext: 10641","SI","SI","NO","SI","Pública clasificada","C65342022-Tipo de información Pública clasificada-Prestación de servicios: El CONTRATISTA se obliga con POSITIVA a la prestación de los servicios de salud para los asegurados y o afiliados a POSITIVA que accedan a los servicios habilitados del CONTRATISTA en calidad de asegurados a los ramos Administración de Riesgos Laborales ARL por causa exclusiva de un accidente de trabajo una enfermedad profesional) Accidentes Personales AP Educativo Generación Positiva AP Colectivos APCorto Plazo AP Individual y demás Ramos de Seguros autorizados a Positiva encontrándose excluidos del presente contrato los servicios y todas aquellas actividades procedimientos e intervenciones que no tengan por objeto contribuir al diagnóstico tratamiento o rehabilitación de la patología derivada del siniestro o los servicios considerados como experimentales cosméticos y suntuarios."]
["VICEPRESIDENCIA TÉCNICA","Gerencia Médica","NO","C65352022",85100000,"Prestación de servicios: El CONTRATISTA se obliga con POSITIVA a la prestación de los servicios de salud para los asegurados y o afiliados a POSITIVA que accedan a los servicios habilitados del CONTRATISTA en calidad de asegurados a los ramos Administración de Riesgos Laborales ARL por causa exclusiva de un accidente de trabajo una enfermedad profesional) Accidentes Personales AP Educativo Generación Positiva AP Colectivos APCorto Plazo AP Individual y demás Ramos de Seguros autorizados a Positiva encontrándose excluidos del presente contrato los servicios y todas aquellas actividades procedimientos e intervenciones que no tengan por objeto contribuir al diagnóstico tratamiento o rehabilitación de la patología derivada del siniestro o los servicios considerados como experimentales cosméticos y suntuarios.","2022-11-01",11,"2027-11-01",60.866666666666667,"Invitación directa","CargoAReserva",0,0,"NO",null,"Gerencia de Abastecimiento Estratégico\ncontratacion@positiva.gov.co\nPBX: (1)6502200 Ext: 10641","SI","SI","NO","SI","Pública clasificada","C65352022-Tipo de información Pública clasificada-Prestación de servicios: El CONTRATISTA se obliga con POSITIVA a la prestación de los servicios de salud para los asegurados y o afiliados a POSITIVA que accedan a los servicios habilitados del CONTRATISTA en calidad de asegurados a los ramos Administración de Riesgos Laborales ARL por causa exclusiva de un accidente de trabajo una enfermedad profesional) Accidentes Personales AP Educativo Generación Positiva AP Colectivos APCorto Plazo AP Individual y demás Ramos de Seguros autorizados a Positiva encontrándose excluidos del presente contrato los servicios y todas aquellas actividades procedimientos e intervenciones que no tengan por objeto contribuir al diagnóstico tratamiento o rehabilitación de la patología derivada del siniestro o los servicios considerados como experimentales cosméticos y suntuarios."]
["VICEPRESIDENCIA TÉCNICA","Gerencia Médica","NO","C65362022",85100000,"Prestación de servicios: El CONTRATISTA se obliga con POSITIVA a la prestación de los servicios de salud para los asegurados y o afiliados a POSITIVA que accedan a los servicios habilitados del CONTRATISTA en calidad de asegurados a los ramos Administración de Riesgos Laborales ARL por causa exclusiva de un accidente de trabajo una enfermedad profesional) Accidentes Personales AP Educativo Generación Positiva AP Colectivos APCorto Plazo AP Individual y demás Ramos de Seguros autorizados a Positiva encontrándose excluidos del presente contrato los servicios y todas aquellas actividades procedimientos e intervenciones que no tengan por objeto contribuir al diagnóstico tratamiento o rehabilitación de la patología derivada del siniestro o los servicios considerados como experimentales cosméticos y suntuarios.","2022-02-01",2,"2027-02-01",60.866666666666667,"Invitación directa","CargoAReserva",0,0,"NO",null,"Gerencia de Abastecimiento Estratégico\ncontratacion@positiva.gov.co\nPBX: (1)6502200 Ext: 10641","SI","SI","NO","SI","Pública clasificada","C65362022-Tipo de información Pública clasificada-Prestación de servicios: El CONTRATISTA se obliga con POSITIVA a la prestación de los servicios de salud para los asegurados y o afiliados a POSITIVA que accedan a los servicios habilitados del CONTRATISTA en calidad de asegurados a los ramos Administración de Riesgos Laborales ARL por causa exclusiva de un accidente de trabajo una enfermedad profesional) Accidentes Personales AP Educativo Generación Positiva AP Colectivos APCorto Plazo AP Individual y demás Ramos de Seguros autorizados a Positiva encontrándose excluidos del presente contrato los servicios y todas aquellas actividades procedimientos e intervenciones que no tengan por objeto contribuir al diagnóstico tratamiento o rehabilitación de la patología derivada del siniestro o los servicios considerados como experimentales cosméticos y suntuarios."]
["VICEPRESIDENCIA TÉCNICA","Gerencia Médica","NO","C65372022",85100000,"Prestación de servicios: El CONTRATISTA se obliga con POSITIVA a la prestación de los servicios de salud para los asegurados y o afiliados a POSITIVA que accedan a los servicios habilitados del CONTRATISTA en calidad de asegurados a los ramos Administración de Riesgos Laborales ARL por causa exclusiva de un accidente de trabajo una enfermedad profesional) Accidentes Personales AP Educativo Generación Positiva AP Colectivos APCorto Plazo AP Individual y demás Ramos de Seguros autorizados a Positiva encontrándose excluidos del presente contrato los servicios y todas aquellas actividades procedimientos e intervenciones que no tengan por objeto contribuir al diagnóstico tratamiento o rehabilitación de la patología derivada del siniestro o los servicios considerados como experimentales cosméticos y suntuarios.","2022-03-01",3,"2027-03-01",60.866666666666667,"Invitación directa","CargoAReserva",0,0,"NO",null,"Gerencia de Abastecimiento Estratégico\ncontratacion@positiva.gov.co\nPBX: (1)6502200 Ext: 10641","SI","SI","NO","SI","Pública clasificada","C65372022-Tipo de información Pública clasificada-Prestación de servicios: El CONTRATISTA se obliga con POSITIVA a la prestación de los servicios de salud para los asegurados y o afiliados a POSITIVA que accedan a los servicios habilitados del CONTRATISTA en calidad de asegurados a los ramos Administración de Riesgos Laborales ARL por causa exclusiva de un accidente de trabajo una enfermedad profesional) Accidentes Personales AP Educativo Generación Positiva AP Colectivos APCorto Plazo AP Individual y demás Ramos de Seguros autorizados a Positiva encontrándose excluidos del presente contrato los servicios y todas aquellas actividades procedimientos e intervenciones que no tengan por objeto contribuir al diagnóstico tratamiento o rehabilitación de la patología derivada del siniestro o los servicios considerados como experimentales cosméticos y suntuarios."]
["VICEPRESIDENCIA TÉCNICA","Gerencia Médica","NO","C65382022",85100000,"Prestación de servicios: El CONTRATISTA se obliga con POSITIVA a la prestación de los servicios de salud para los asegurados y o afiliados a POSITIVA que accedan a los servicios habilitados del CONTRATISTA en calidad de asegurados a los ramos Administración de Riesgos Laborales ARL por causa exclusiva de un accidente de trabajo una enfermedad profesional) Accidentes Personales AP Educativo Generación Positiva AP Colectivos APCorto Plazo AP Individual y demás Ramos de Seguros autorizados a Positiva encontrándose excluidos del presente contrato los servicios y todas aquellas actividades procedimientos e intervenciones que no tengan por objeto contribuir al diagnóstico tratamiento o rehabilitación de la patología derivada del siniestro o los servicios considerados como experimentales cosméticos y suntuarios.","2022-04-01",4,"2027-04-01",60.866666666666667,"Invitación directa","CargoAReserva",0,0,"NO",null,"Gerencia de Abastecimiento Estratégico\ncontratacion@positiva.gov.co\nPBX: (1)6502200 Ext: 10641","SI","SI","NO","SI","Pública clasificada","C65382022-Tipo de información Pública clasificada-Prestación de servicios: El CONTRATISTA se obliga con POSITIVA a la prestación de los servicios de salud para los asegurados y o afiliados a POSITIVA que accedan a los servicios habilitados del CONTRATISTA en calidad de asegurados a los ramos Administración de Riesgos Laborales ARL por causa exclusiva de un accidente de trabajo una enfermedad profesional) Accidentes Personales AP Educativo Generación Positiva AP Colectivos APCorto Plazo AP Individual y demás Ramos de Seguros autorizados a Positiva encontrándose excluidos del presente contrato los servicios y todas aquellas actividades procedimientos e intervenciones que no tengan por objeto contribuir al diagnóstico tratamiento o rehabilitación de la patología derivada del siniestro o los servicios considerados como experimentales cosméticos y suntuarios."]
["VICEPRESIDENCIA TÉCNICA","Gerencia Médica","NO","C65392022",85100000,"Prestación de servicios: El CONTRATISTA se obliga con POSITIVA a la prestación de los servicios de salud para los asegurados y o afiliados a POSITIVA que accedan a los servicios habilitados del CONTRATISTA en calidad de asegurados a los ramos Administración de Riesgos Laborales ARL por causa exclusiva de un accidente de trabajo una enfermedad profesional) Accidentes Personales AP Educativo Generación Positiva AP Colectivos APCorto Plazo AP Individual y demás Ramos de Seguros autorizados a Positiva encontrándose excluidos del presente contrato los servicios y todas aquellas actividades procedimientos e intervenciones que no tengan por objeto contribuir al diagnóstico tratamiento o rehabilitación de la patología derivada del siniestro o los servicios considerados como experimentales cosméticos y suntuarios.","2022-09-01",9,"2024-09-30",25.333333333333332,"Invitación directa","CargoAReserva",0,0,"NO",null,"Gerencia de Abastecimiento Estratégico\ncontratacion@positiva.gov.co\nPBX: (1)6502200 Ext: 10641","SI","SI","NO","SI","Pública clasificada","C65392022-Tipo de información Pública clasificada-Prestación de servicios: El CONTRATISTA se obliga con POSITIVA a la prestación de los servicios de salud para los asegurados y o afiliados a POSITIVA que accedan a los servicios habilitados del CONTRATISTA en calidad de asegurados a los ramos Administración de Riesgos Laborales ARL por causa exclusiva de un accidente de trabajo una enfermedad profesional) Accidentes Personales AP Educativo Generación Positiva AP Colectivos APCorto Plazo AP Individual y demás Ramos de Seguros autorizados a Positiva encontrándose excluidos del presente contrato los servicios y todas aquellas actividades procedimientos e intervenciones que no tengan por objeto contribuir al diagnóstico tratamiento o rehabilitación de la patología derivada del siniestro o los servicios considerados como experimentales cosméticos y suntuarios."]
["VICEPRESIDENCIA TÉCNICA","Gerencia Médica","NO","C65402022",85100000,"Prestación de servicios: El CONTRATISTA se obliga con POSITIVA a la prestación de los servicios de salud para los asegurados y o afiliados a POSITIVA que accedan a los servicios habilitados del CONTRATISTA en calidad de asegurados a los ramos Administración de Riesgos Laborales ARL por causa exclusiva de un accidente de trabajo una enfermedad profesional) Accidentes Personales AP Educativo Generación Positiva AP Colectivos APCorto Plazo AP Individual y demás Ramos de Seguros autorizados a Positiva encontrándose excluidos del presente contrato los servicios y todas aquellas actividades procedimientos e intervenciones que no tengan por objeto contribuir al diagnóstico tratamiento o rehabilitación de la patología derivada del siniestro o los servicios considerados como experimentales cosméticos y suntuarios.","2022-09-01",9,"2024-09-30",25.333333333333332,"Invitación directa","CargoAReserva",0,0,"NO",null,"Gerencia de Abastecimiento Estratégico\ncontratacion@positiva.gov.co\nPBX: (1)6502200 Ext: 10641","SI","SI","NO","SI","Pública clasificada","C65402022-Tipo de información Pública clasificada-Prestación de servicios: El CONTRATISTA se obliga con POSITIVA a la prestación de los servicios de salud para los asegurados y o afiliados a POSITIVA que accedan a los servicios habilitados del CONTRATISTA en calidad de asegurados a los ramos Administración de Riesgos Laborales ARL por causa exclusiva de un accidente de trabajo una enfermedad profesional) Accidentes Personales AP Educativo Generación Positiva AP Colectivos APCorto Plazo AP Individual y demás Ramos de Seguros autorizados a Positiva encontrándose excluidos del presente contrato los servicios y todas aquellas actividades procedimientos e intervenciones que no tengan por objeto contribuir al diagnóstico tratamiento o rehabilitación de la patología derivada del siniestro o los servicios considerados como experimentales cosméticos y suntuarios."]
["VICEPRESIDENCIA TÉCNICA","Gerencia Médica","NO","C65412022",85100000,"Prestación de servicios: El CONTRATISTA se obliga con POSITIVA a la prestación de los servicios de salud para los asegurados y o afiliados a POSITIVA que accedan a los servicios habilitados del CONTRATISTA en calidad de asegurados a los ramos Administración de Riesgos Laborales ARL por causa exclusiva de un accidente de trabajo una enfermedad profesional) Accidentes Personales AP Educativo Generación Positiva AP Colectivos APCorto Plazo AP Individual y demás Ramos de Seguros autorizados a Positiva encontrándose excluidos del presente contrato los servicios y todas aquellas actividades procedimientos e intervenciones que no tengan por objeto contribuir al diagnóstico tratamiento o rehabilitación de la patología derivada del siniestro o los servicios considerados como experimentales cosméticos y suntuarios.","2022-09-02",9,"2024-09-02",24.366666666666667,"Invitación directa","CargoAReserva",0,0,"NO",null,"Gerencia de Abastecimiento Estratégico\ncontratacion@positiva.gov.co\nPBX: (1)6502200 Ext: 10641","SI","SI","NO","SI",{"$f":"IF(U502=\"SI\",\"Pública clasificada\",\"Pública\")","v":"Pública clasificada"},{"$f":"CONCATENATE(D502,\"-\",\"Tipo de información\",\" \",V502,\"-\",F502)","v":"C65412022-Tipo de información Pública clasificada-Prestación de servicios: El CONTRATISTA se obliga con POSITIVA a la prestación de los servicios de salud para los asegurados y o afiliados a POSITIVA que accedan a los servicios habilitados del CONTRATISTA en calidad de asegurados a los ramos Administración de Riesgos Laborales ARL por causa exclusiva de un accidente de trabajo una enfermedad profesional) Accidentes Personales AP Educativo Generación Positiva AP Colectivos APCorto Plazo AP Individual y demás Ramos de Seguros autorizados a Positiva encontrándose excluidos del presente contrato los servicios y todas aquellas actividades procedimientos e intervenciones que no tengan por objeto contribuir al diagnóstico tratamiento o rehabilitación de la patología derivada del siniestro o los servicios considerados como experimentales cosméticos y suntuarios."}]
["VICEPRESIDENCIA TÉCNICA","Gerencia Médica","NO","C65422022",85100000,"Prestación de servicios: El CONTRATISTA se obliga con POSITIVA a la prestación de los servicios de salud para los asegurados y o afiliados a POSITIVA que accedan a los servicios habilitados del CONTRATISTA en calidad de asegurados a los ramos Administración de Riesgos Laborales ARL por causa exclusiva de un accidente de trabajo una enfermedad profesional) Accidentes Personales AP Educativo Generación Positiva AP Colectivos APCorto Plazo AP Individual y demás Ramos de Seguros autorizados a Positiva encontrándose excluidos del presente contrato los servicios y todas aquellas actividades procedimientos e intervenciones que no tengan por objeto contribuir al diagnóstico tratamiento o rehabilitación de la patología derivada del siniestro o los servicios considerados como experimentales cosméticos y suntuarios.","2022-10-01",10,"2024-10-01",24.366666666666667,"Invitación directa","CargoAReserva",0,0,"NO",null,"Gerencia de Abastecimiento Estratégico\ncontratacion@positiva.gov.co\nPBX: (1)6502200 Ext: 10641","SI","SI","NO","SI","Pública clasificada","C65422022-Tipo de información Pública clasificada-Prestación de servicios: El CONTRATISTA se obliga con POSITIVA a la prestación de los servicios de salud para los asegurados y o afiliados a POSITIVA que accedan a los servicios habilitados del CONTRATISTA en calidad de asegurados a los ramos Administración de Riesgos Laborales ARL por causa exclusiva de un accidente de trabajo una enfermedad profesional) Accidentes Personales AP Educativo Generación Positiva AP Colectivos APCorto Plazo AP Individual y demás Ramos de Seguros autorizados a Positiva encontrándose excluidos del presente contrato los servicios y todas aquellas actividades procedimientos e intervenciones que no tengan por objeto contribuir al diagnóstico tratamiento o rehabilitación de la patología derivada del siniestro o los servicios considerados como experimentales cosméticos y suntuarios."]
["VICEPRESIDENCIA TÉCNICA","Gerencia Médica","NO","C65432022",85100000,"Prestación de servicios: El CONTRATISTA se obliga con POSITIVA a la prestación de los servicios de salud para los asegurados y o afiliados a POSITIVA que accedan a los servicios habilitados del CONTRATISTA en calidad de asegurados a los ramos Administración de Riesgos Laborales ARL por causa exclusiva de un accidente de trabajo una enfermedad profesional) Accidentes Personales AP Educativo Generación Positiva AP Colectivos APCorto Plazo AP Individual y demás Ramos de Seguros autorizados a Positiva encontrándose excluidos del presente contrato los servicios y todas aquellas actividades procedimientos e intervenciones que no tengan por objeto contribuir al diagnóstico tratamiento o rehabilitación de la patología derivada del siniestro o los servicios considerados como experimentales cosméticos y suntuarios.","2022-11-01",11,"2024-11-01",24.366666666666667,"Invitación directa","CargoAReserva",0,0,"NO",null,"Gerencia de Abastecimiento Estratégico\ncontratacion@positiva.gov.co\nPBX: (1)6502200 Ext: 10641","SI","SI","NO","SI","Pública clasificada","C65432022-Tipo de información Pública clasificada-Prestación de servicios: El CONTRATISTA se obliga con POSITIVA a la prestación de los servicios de salud para los asegurados y o afiliados a POSITIVA que accedan a los servicios habilitados del CONTRATISTA en calidad de asegurados a los ramos Administración de Riesgos Laborales ARL por causa exclusiva de un accidente de trabajo una enfermedad profesional) Accidentes Personales AP Educativo Generación Positiva AP Colectivos APCorto Plazo AP Individual y demás Ramos de Seguros autorizados a Positiva encontrándose excluidos del presente contrato los servicios y todas aquellas actividades procedimientos e intervenciones que no tengan por objeto contribuir al diagnóstico tratamiento o rehabilitación de la patología derivada del siniestro o los servicios considerados como experimentales cosméticos y suntuarios."]
["VICEPRESIDENCIA TÉCNICA","Gerencia Médica","NO","C65442022",85100000,"Prestación de servicios: El CONTRATISTA se obliga con POSITIVA a la prestación de los servicios de salud para los asegurados y o afiliados a POSITIVA que accedan a los servicios habilitados del CONTRATISTA en calidad de asegurados a los ramos Administración de Riesgos Laborales ARL por causa exclusiva de un accidente de trabajo una enfermedad profesional) Accidentes Personales AP Educativo Generación Positiva AP Colectivos APCorto Plazo AP Individual y demás Ramos de Seguros autorizados a Positiva encontrándose excluidos del presente contrato los servicios y todas aquellas actividades procedimientos e intervenciones que no tengan por objeto contribuir al diagnóstico tratamiento o rehabilitación de la patología derivada del siniestro o los servicios considerados como experimentales cosméticos y suntuarios.","2022-07-01",7,"2027-07-01",60.866666666666667,"Invitación directa","CargoAReserva",0,0,"NO",null,"Gerencia de Abastecimiento Estratégico\ncontratacion@positiva.gov.co\nPBX: (1)6502200 Ext: 10641","SI","SI","NO","SI","Pública clasificada","C65442022-Tipo de información Pública clasificada-Prestación de servicios: El CONTRATISTA se obliga con POSITIVA a la prestación de los servicios de salud para los asegurados y o afiliados a POSITIVA que accedan a los servicios habilitados del CONTRATISTA en calidad de asegurados a los ramos Administración de Riesgos Laborales ARL por causa exclusiva de un accidente de trabajo una enfermedad profesional) Accidentes Personales AP Educativo Generación Positiva AP Colectivos APCorto Plazo AP Individual y demás Ramos de Seguros autorizados a Positiva encontrándose excluidos del presente contrato los servicios y todas aquellas actividades procedimientos e intervenciones que no tengan por objeto contribuir al diagnóstico tratamiento o rehabilitación de la patología derivada del siniestro o los servicios considerados como experimentales cosméticos y suntuarios."]
["VICEPRESIDENCIA TÉCNICA","Gerencia Médica","NO","C65452022",85100000,"Prestación de servicios: El CONTRATISTA se obliga con POSITIVA a la prestación de los servicios de salud para los asegurados y o afiliados a POSITIVA que accedan a los servicios habilitados del CONTRATISTA en calidad de asegurados a los ramos Administración de Riesgos Laborales ARL por causa exclusiva de un accidente de trabajo una enfermedad profesional) Accidentes Personales AP Educativo Generación Positiva AP Colectivos APCorto Plazo AP Individual y demás Ramos de Seguros autorizados a Positiva encontrándose excluidos del presente contrato los servicios y todas aquellas actividades procedimientos e intervenciones que no tengan por objeto contribuir al diagnóstico tratamiento o rehabilitación de la patología derivada del siniestro o los servicios considerados como experimentales cosméticos y suntuarios.","2022-03-01",3,"2024-03-01",24.366666666666667,"Invitación directa","CargoAReserva",0,0,"NO",null,"Gerencia de Abastecimiento Estratégico\ncontratacion@positiva.gov.co\nPBX: (1)6502200 Ext: 10641","SI","SI","NO","SI","Pública clasificada","C65452022-Tipo de información Pública clasificada-Prestación de servicios: El CONTRATISTA se obliga con POSITIVA a la prestación de los servicios de salud para los asegurados y o afiliados a POSITIVA que accedan a los servicios habilitados del CONTRATISTA en calidad de asegurados a los ramos Administración de Riesgos Laborales ARL por causa exclusiva de un accidente de trabajo una enfermedad profesional) Accidentes Personales AP Educativo Generación Positiva AP Colectivos APCorto Plazo AP Individual y demás Ramos de Seguros autorizados a Positiva encontrándose excluidos del presente contrato los servicios y todas aquellas actividades procedimientos e intervenciones que no tengan por objeto contribuir al diagnóstico tratamiento o rehabilitación de la patología derivada del siniestro o los servicios considerados como experimentales cosméticos y suntuarios."]
["VICEPRESIDENCIA TÉCNICA","Gerencia Médica","NO","C65462022",85100000,"Prestación de servicios: El CONTRATISTA se obliga con POSITIVA a la prestación de los servicios de salud para los asegurados y o afiliados a POSITIVA que accedan a los servicios habilitados del CONTRATISTA en calidad de asegurados a los ramos Administración de Riesgos Laborales ARL por causa exclusiva de un accidente de trabajo una enfermedad profesional) Accidentes Personales AP Educativo Generación Positiva AP Colectivos APCorto Plazo AP Individual y demás Ramos de Seguros autorizados a Positiva encontrándose excluidos del presente contrato los servicios y todas aquellas actividades procedimientos e intervenciones que no tengan por objeto contribuir al diagnóstico tratamiento o rehabilitación de la patología derivada del siniestro o los servicios considerados como experimentales cosméticos y suntuarios.","2022-04-01",4,"2024-04-01",24.366666666666667,"Invitación directa","CargoAReserva",0,0,"NO",null,"Gerencia de Abastecimiento Estratégico\ncontratacion@positiva.gov.co\nPBX: (1)6502200 Ext: 10641","SI","SI","NO","SI","Pública clasificada","C65462022-Tipo de información Pública clasificada-Prestación de servicios: El CONTRATISTA se obliga con POSITIVA a la prestación de los servicios de salud para los asegurados y o afiliados a POSITIVA que accedan a los servicios habilitados del CONTRATISTA en calidad de asegurados a los ramos Administración de Riesgos Laborales ARL por causa exclusiva de un accidente de trabajo una enfermedad profesional) Accidentes Personales AP Educativo Generación Positiva AP Colectivos APCorto Plazo AP Individual y demás Ramos de Seguros autorizados a Positiva encontrándose excluidos del presente contrato los servicios y todas aquellas actividades procedimientos e intervenciones que no tengan por objeto contribuir al diagnóstico tratamiento o rehabilitación de la patología derivada del siniestro o los servicios considerados como experimentales cosméticos y suntuarios."]
["VICEPRESIDENCIA TÉCNICA","Gerencia Médica","NO","C65472022",85100000,"Prestación de servicios: El CONTRATISTA se obliga con POSITIVA a la prestación de los servicios de salud para los asegurados y o afiliados a POSITIVA que accedan a los servicios habilitados del CONTRATISTA en calidad de asegurados a los ramos Administración de Riesgos Laborales ARL por causa exclusiva de un accidente de trabajo una enfermedad profesional) Accidentes Personales AP Educativo Generación Positiva AP Colectivos APCorto Plazo AP Individual y demás Ramos de Seguros autorizados a Positiva encontrándose excluidos del presente contrato los servicios y todas aquellas actividades procedimientos e intervenciones que no tengan por objeto contribuir al diagnóstico tratamiento o rehabilitación de la patología derivada del siniestro o los servicios considerados como experimentales cosméticos y suntuarios.","2022-09-01",9,"2024-09-30",25.333333333333332,"Invitación directa","CargoAReserva",0,0,"NO",null,"Gerencia de Abastecimiento Estratégico\ncontratacion@positiva.gov.co\nPBX: (1)6502200 Ext: 10641","SI","SI","NO","SI","Pública clasificada","C65472022-Tipo de información Pública clasificada-Prestación de servicios: El CONTRATISTA se obliga con POSITIVA a la prestación de los servicios de salud para los asegurados y o afiliados a POSITIVA que accedan a los servicios habilitados del CONTRATISTA en calidad de asegurados a los ramos Administración de Riesgos Laborales ARL por causa exclusiva de un accidente de trabajo una enfermedad profesional) Accidentes Personales AP Educativo Generación Positiva AP Colectivos APCorto Plazo AP Individual y demás Ramos de Seguros autorizados a Positiva encontrándose excluidos del presente contrato los servicios y todas aquellas actividades procedimientos e intervenciones que no tengan por objeto contribuir al diagnóstico tratamiento o rehabilitación de la patología derivada del siniestro o los servicios considerados como experimentales cosméticos y suntuarios."]
["VICEPRESIDENCIA TÉCNICA","Gerencia Médica","NO","C65482022",85100000,"Prestación de servicios: El CONTRATISTA se obliga con POSITIVA a la prestación de los servicios de salud para los asegurados y o afiliados a POSITIVA que accedan a los servicios habilitados del CONTRATISTA en calidad de asegurados a los ramos Administración de Riesgos Laborales ARL por causa exclusiva de un accidente de trabajo una enfermedad profesional) Accidentes Personales AP Educativo Generación Positiva AP Colectivos APCorto Plazo AP Individual y demás Ramos de Seguros autorizados a Positiva encontrándose excluidos del presente contrato los servicios y todas aquellas actividades procedimientos e intervenciones que no tengan por objeto contribuir al diagnóstico tratamiento o rehabilitación de la patología derivada del siniestro o los servicios considerados como experimentales cosméticos y suntuarios.","2022-09-01",9,"2024-09-30",25.333333333333332,"Invitación directa","CargoAReserva",0,0,"NO",null,"Gerencia de Abastecimiento Estratégico\ncontratacion@positiva.gov.co\nPBX: (1)6502200 Ext: 10641","SI","SI","NO","SI","Pública clasificada","C65482022-Tipo de información Pública clasificada-Prestación de servicios: El CONTRATISTA se obliga con POSITIVA a la prestación de los servicios de salud para los asegurados y o afiliados a POSITIVA que accedan a los servicios habilitados del CONTRATISTA en calidad de asegurados a los ramos Administración de Riesgos Laborales ARL por causa exclusiva de un accidente de trabajo una enfermedad profesional) Accidentes Personales AP Educativo Generación Positiva AP Colectivos APCorto Plazo AP Individual y demás Ramos de Seguros autorizados a Positiva encontrándose excluidos del presente contrato los servicios y todas aquellas actividades procedimientos e intervenciones que no tengan por objeto contribuir al diagnóstico tratamiento o rehabilitación de la patología derivada del siniestro o los servicios considerados como experimentales cosméticos y suntuarios."]
["VICEPRESIDENCIA TÉCNICA","Gerencia Médica","NO","C65492022",85100000,"Prestación de servicios: El CONTRATISTA se obliga con POSITIVA a la prestación de los servicios de salud para los asegurados y o afiliados a POSITIVA que accedan a los servicios habilitados del CONTRATISTA en calidad de asegurados a los ramos Administración de Riesgos Laborales ARL por causa exclusiva de un accidente de trabajo una enfermedad profesional) Accidentes Personales AP Educativo Generación Positiva AP Colectivos APCorto Plazo AP Individual y demás Ramos de Seguros autorizados a Positiva encontrándose excluidos del presente contrato los servicios y todas aquellas actividades procedimientos e intervenciones que no tengan por objeto contribuir al diagnóstico tratamiento o rehabilitación de la patología derivada del siniestro o los servicios considerados como experimentales cosméticos y suntuarios.","2022-09-01",9,"2024-09-30",25.333333333333332,"Invitación directa","CargoAReserva",0,0,"NO",null,"Gerencia de Abastecimiento Estratégico\ncontratacion@positiva.gov.co\nPBX: (1)6502200 Ext: 10641","SI","SI","NO","SI","Pública clasificada","C65492022-Tipo de información Pública clasificada-Prestación de servicios: El CONTRATISTA se obliga con POSITIVA a la prestación de los servicios de salud para los asegurados y o afiliados a POSITIVA que accedan a los servicios habilitados del CONTRATISTA en calidad de asegurados a los ramos Administración de Riesgos Laborales ARL por causa exclusiva de un accidente de trabajo una enfermedad profesional) Accidentes Personales AP Educativo Generación Positiva AP Colectivos APCorto Plazo AP Individual y demás Ramos de Seguros autorizados a Positiva encontrándose excluidos del presente contrato los servicios y todas aquellas actividades procedimientos e intervenciones que no tengan por objeto contribuir al diagnóstico tratamiento o rehabilitación de la patología derivada del siniestro o los servicios considerados como experimentales cosméticos y suntuarios."]
["VICEPRESIDENCIA TÉCNICA","Gerencia Médica","NO","C65502022",85100000,"Prestación de servicios: El CONTRATISTA se obliga con POSITIVA a la prestación de los servicios de salud para los asegurados y o afiliados a POSITIVA que accedan a los servicios habilitados del CONTRATISTA en calidad de asegurados a los ramos Administración de Riesgos Laborales ARL por causa exclusiva de un accidente de trabajo una enfermedad profesional) Accidentes Personales AP Educativo Generación Positiva AP Colectivos APCorto Plazo AP Individual y demás Ramos de Seguros autorizados a Positiva encontrándose excluidos del presente contrato los servicios y todas aquellas actividades procedimientos e intervenciones que no tengan por objeto contribuir al diagnóstico tratamiento o rehabilitación de la patología derivada del siniestro o los servicios considerados como experimentales cosméticos y suntuarios.","2022-06-30",6,"2024-06-30",24.366666666666667,"Invitación directa","CargoAReserva",0,0,"NO",null,"Gerencia de Abastecimiento Estratégico\ncontratacion@positiva.gov.co\nPBX: (1)6502200 Ext: 10641","SI","SI","NO","SI","Pública clasificada","C65502022-Tipo de información Pública clasificada-Prestación de servicios: El CONTRATISTA se obliga con POSITIVA a la prestación de los servicios de salud para los asegurados y o afiliados a POSITIVA que accedan a los servicios habilitados del CONTRATISTA en calidad de asegurados a los ramos Administración de Riesgos Laborales ARL por causa exclusiva de un accidente de trabajo una enfermedad profesional) Accidentes Personales AP Educativo Generación Positiva AP Colectivos APCorto Plazo AP Individual y demás Ramos de Seguros autorizados a Positiva encontrándose excluidos del presente contrato los servicios y todas aquellas actividades procedimientos e intervenciones que no tengan por objeto contribuir al diagnóstico tratamiento o rehabilitación de la patología derivada del siniestro o los servicios considerados como experimentales cosméticos y suntuarios."]
["VICEPRESIDENCIA TÉCNICA","Gerencia Médica","NO","C65512022",85100000,"Prestación de servicios: El CONTRATISTA se obliga con POSITIVA a la prestación de los servicios de salud para los asegurados y o afiliados a POSITIVA que accedan a los servicios habilitados del CONTRATISTA en calidad de asegurados a los ramos Administración de Riesgos Laborales ARL por causa exclusiva de un accidente de trabajo una enfermedad profesional) Accidentes Personales AP Educativo Generación Positiva AP Colectivos APCorto Plazo AP Individual y demás Ramos de Seguros autorizados a Positiva encontrándose excluidos del presente contrato los servicios y todas aquellas actividades procedimientos e intervenciones que no tengan por objeto contribuir al diagnóstico tratamiento o rehabilitación de la patología derivada del siniestro o los servicios considerados como experimentales cosméticos y suntuarios.","2022-04-20",4,"2024-04-20",24.366666666666667,"Invitación directa","CargoAReserva",0,0,"NO",null,"Gerencia de Abastecimiento Estratégico\ncontratacion@positiva.gov.co\nPBX: (1)6502200 Ext: 10641","SI","SI","NO","SI","Pública clasificada","C65512022-Tipo de información Pública clasificada-Prestación de servicios: El CONTRATISTA se obliga con POSITIVA a la prestación de los servicios de salud para los asegurados y o afiliados a POSITIVA que accedan a los servicios habilitados del CONTRATISTA en calidad de asegurados a los ramos Administración de Riesgos Laborales ARL por causa exclusiva de un accidente de trabajo una enfermedad profesional) Accidentes Personales AP Educativo Generación Positiva AP Colectivos APCorto Plazo AP Individual y demás Ramos de Seguros autorizados a Positiva encontrándose excluidos del presente contrato los servicios y todas aquellas actividades procedimientos e intervenciones que no tengan por objeto contribuir al diagnóstico tratamiento o rehabilitación de la patología derivada del siniestro o los servicios considerados como experimentales cosméticos y suntuarios."]
["VICEPRESIDENCIA TÉCNICA","Gerencia Médica","NO","C65522022",85100000,"Prestación de servicios: El CONTRATISTA se obliga con POSITIVA a la prestación de los servicios de salud para los asegurados y o afiliados a POSITIVA que accedan a los servicios habilitados del CONTRATISTA en calidad de asegurados a los ramos Administración de Riesgos Laborales ARL por causa exclusiva de un accidente de trabajo una enfermedad profesional) Accidentes Personales AP Educativo Generación Positiva AP Colectivos APCorto Plazo AP Individual y demás Ramos de Seguros autorizados a Positiva encontrándose excluidos del presente contrato los servicios y todas aquellas actividades procedimientos e intervenciones que no tengan por objeto contribuir al diagnóstico tratamiento o rehabilitación de la patología derivada del siniestro o los servicios considerados como experimentales cosméticos y suntuarios.","2022-10-25",10,"2024-10-25",24.366666666666667,"Invitación directa","CargoAReserva",0,0,"NO",null,"Gerencia de Abastecimiento Estratégico\ncontratacion@positiva.gov.co\nPBX: (1)6502200 Ext: 10641","SI","SI","NO","SI","Pública clasificada","C65522022-Tipo de información Pública clasificada-Prestación de servicios: El CONTRATISTA se obliga con POSITIVA a la prestación de los servicios de salud para los asegurados y o afiliados a POSITIVA que accedan a los servicios habilitados del CONTRATISTA en calidad de asegurados a los ramos Administración de Riesgos Laborales ARL por causa exclusiva de un accidente de trabajo una enfermedad profesional) Accidentes Personales AP Educativo Generación Positiva AP Colectivos APCorto Plazo AP Individual y demás Ramos de Seguros autorizados a Positiva encontrándose excluidos del presente contrato los servicios y todas aquellas actividades procedimientos e intervenciones que no tengan por objeto contribuir al diagnóstico tratamiento o rehabilitación de la patología derivada del siniestro o los servicios considerados como experimentales cosméticos y suntuarios."]
["VICEPRESIDENCIA TÉCNICA","Gerencia Médica","NO","C65532022",85100000,"Prestación de servicios: El CONTRATISTA se obliga con POSITIVA a la prestación de los servicios de salud para los asegurados y o afiliados a POSITIVA que accedan a los servicios habilitados del CONTRATISTA en calidad de asegurados a los ramos Administración de Riesgos Laborales ARL por causa exclusiva de un accidente de trabajo una enfermedad profesional) Accidentes Personales AP Educativo Generación Positiva AP Colectivos APCorto Plazo AP Individual y demás Ramos de Seguros autorizados a Positiva encontrándose excluidos del presente contrato los servicios y todas aquellas actividades procedimientos e intervenciones que no tengan por objeto contribuir al diagnóstico tratamiento o rehabilitación de la patología derivada del siniestro o los servicios considerados como experimentales cosméticos y suntuarios.","2022-03-22",3,"2024-03-22",24.366666666666667,"Invitación directa","CargoAReserva",0,0,"NO",null,"Gerencia de Abastecimiento Estratégico\ncontratacion@positiva.gov.co\nPBX: (1)6502200 Ext: 10641","SI","SI","NO","SI","Pública clasificada","C65532022-Tipo de información Pública clasificada-Prestación de servicios: El CONTRATISTA se obliga con POSITIVA a la prestación de los servicios de salud para los asegurados y o afiliados a POSITIVA que accedan a los servicios habilitados del CONTRATISTA en calidad de asegurados a los ramos Administración de Riesgos Laborales ARL por causa exclusiva de un accidente de trabajo una enfermedad profesional) Accidentes Personales AP Educativo Generación Positiva AP Colectivos APCorto Plazo AP Individual y demás Ramos de Seguros autorizados a Positiva encontrándose excluidos del presente contrato los servicios y todas aquellas actividades procedimientos e intervenciones que no tengan por objeto contribuir al diagnóstico tratamiento o rehabilitación de la patología derivada del siniestro o los servicios considerados como experimentales cosméticos y suntuarios."]
["VICEPRESIDENCIA TÉCNICA","Gerencia Médica","NO","C65542022",85100000,"Prestación de servicios: El CONTRATISTA se obliga con POSITIVA a la prestación de los servicios de salud para los asegurados y o afiliados a POSITIVA que accedan a los servicios habilitados del CONTRATISTA en calidad de asegurados a los ramos Administración de Riesgos Laborales ARL por causa exclusiva de un accidente de trabajo una enfermedad profesional) Accidentes Personales AP Educativo Generación Positiva AP Colectivos APCorto Plazo AP Individual y demás Ramos de Seguros autorizados a Positiva encontrándose excluidos del presente contrato los servicios y todas aquellas actividades procedimientos e intervenciones que no tengan por objeto contribuir al diagnóstico tratamiento o rehabilitación de la patología derivada del siniestro o los servicios considerados como experimentales cosméticos y suntuarios.","2022-10-02",10,"2024-10-02",24.366666666666667,"Invitación directa","CargoAReserva",0,0,"NO",null,"Gerencia de Abastecimiento Estratégico\ncontratacion@positiva.gov.co\nPBX: (1)6502200 Ext: 10641","SI","SI","NO","SI","Pública clasificada","C65542022-Tipo de información Pública clasificada-Prestación de servicios: El CONTRATISTA se obliga con POSITIVA a la prestación de los servicios de salud para los asegurados y o afiliados a POSITIVA que accedan a los servicios habilitados del CONTRATISTA en calidad de asegurados a los ramos Administración de Riesgos Laborales ARL por causa exclusiva de un accidente de trabajo una enfermedad profesional) Accidentes Personales AP Educativo Generación Positiva AP Colectivos APCorto Plazo AP Individual y demás Ramos de Seguros autorizados a Positiva encontrándose excluidos del presente contrato los servicios y todas aquellas actividades procedimientos e intervenciones que no tengan por objeto contribuir al diagnóstico tratamiento o rehabilitación de la patología derivada del siniestro o los servicios considerados como experimentales cosméticos y suntuarios."]
["VICEPRESIDENCIA TÉCNICA","Gerencia Médica","NO","C65552022",85100000,"Prestación de servicios: El CONTRATISTA se obliga con POSITIVA a la prestación de los servicios de salud para los asegurados y o afiliados a POSITIVA que accedan a los servicios habilitados del CONTRATISTA en calidad de asegurados a los ramos Administración de Riesgos Laborales ARL por causa exclusiva de un accidente de trabajo una enfermedad profesional) Accidentes Personales AP Educativo Generación Positiva AP Colectivos APCorto Plazo AP Individual y demás Ramos de Seguros autorizados a Positiva encontrándose excluidos del presente contrato los servicios y todas aquellas actividades procedimientos e intervenciones que no tengan por objeto contribuir al diagnóstico tratamiento o rehabilitación de la patología derivada del siniestro o los servicios considerados como experimentales cosméticos y suntuarios.","2022-08-22",8,"2024-08-22",24.366666666666667,"Invitación directa","CargoAReserva",0,0,"NO",null,"Gerencia de Abastecimiento Estratégico\ncontratacion@positiva.gov.co\nPBX: (1)6502200 Ext: 10641","SI","SI","NO","SI","Pública clasificada","C65552022-Tipo de información Pública clasificada-Prestación de servicios: El CONTRATISTA se obliga con POSITIVA a la prestación de los servicios de salud para los asegurados y o afiliados a POSITIVA que accedan a los servicios habilitados del CONTRATISTA en calidad de asegurados a los ramos Administración de Riesgos Laborales ARL por causa exclusiva de un accidente de trabajo una enfermedad profesional) Accidentes Personales AP Educativo Generación Positiva AP Colectivos APCorto Plazo AP Individual y demás Ramos de Seguros autorizados a Positiva encontrándose excluidos del presente contrato los servicios y todas aquellas actividades procedimientos e intervenciones que no tengan por objeto contribuir al diagnóstico tratamiento o rehabilitación de la patología derivada del siniestro o los servicios considerados como experimentales cosméticos y suntuarios."]
["VICEPRESIDENCIA TÉCNICA","Gerencia Médica","NO","C65562022",85100000,"Prestación de servicios: El CONTRATISTA se obliga con POSITIVA a la prestación de los servicios de salud para los asegurados y o afiliados a POSITIVA que accedan a los servicios habilitados del CONTRATISTA en calidad de asegurados a los ramos Administración de Riesgos Laborales ARL por causa exclusiva de un accidente de trabajo una enfermedad profesional) Accidentes Personales AP Educativo Generación Positiva AP Colectivos APCorto Plazo AP Individual y demás Ramos de Seguros autorizados a Positiva encontrándose excluidos del presente contrato los servicios y todas aquellas actividades procedimientos e intervenciones que no tengan por objeto contribuir al diagnóstico tratamiento o rehabilitación de la patología derivada del siniestro o los servicios considerados como experimentales cosméticos y suntuarios.","2022-08-01",8,"2027-08-01",60.866666666666667,"Invitación directa","CargoAReserva",0,0,"NO",null,"Gerencia de Abastecimiento Estratégico\ncontratacion@positiva.gov.co\nPBX: (1)6502200 Ext: 10641","SI","SI","NO","SI","Pública clasificada","C65562022-Tipo de información Pública clasificada-Prestación de servicios: El CONTRATISTA se obliga con POSITIVA a la prestación de los servicios de salud para los asegurados y o afiliados a POSITIVA que accedan a los servicios habilitados del CONTRATISTA en calidad de asegurados a los ramos Administración de Riesgos Laborales ARL por causa exclusiva de un accidente de trabajo una enfermedad profesional) Accidentes Personales AP Educativo Generación Positiva AP Colectivos APCorto Plazo AP Individual y demás Ramos de Seguros autorizados a Positiva encontrándose excluidos del presente contrato los servicios y todas aquellas actividades procedimientos e intervenciones que no tengan por objeto contribuir al diagnóstico tratamiento o rehabilitación de la patología derivada del siniestro o los servicios considerados como experimentales cosméticos y suntuarios."]
["VICEPRESIDENCIA TÉCNICA","Gerencia Médica","NO","C65572022",85100000,"Prestación de servicios: El CONTRATISTA se obliga con POSITIVA a la prestación de los servicios de salud para los asegurados y o afiliados a POSITIVA que accedan a los servicios habilitados del CONTRATISTA en calidad de asegurados a los ramos Administración de Riesgos Laborales ARL por causa exclusiva de un accidente de trabajo una enfermedad profesional) Accidentes Personales AP Educativo Generación Positiva AP Colectivos APCorto Plazo AP Individual y demás Ramos de Seguros autorizados a Positiva encontrándose excluidos del presente contrato los servicios y todas aquellas actividades procedimientos e intervenciones que no tengan por objeto contribuir al diagnóstico tratamiento o rehabilitación de la patología derivada del siniestro o los servicios considerados como experimentales cosméticos y suntuarios.","2022-07-28",7,"2024-07-28",24.366666666666667,"Invitación directa","CargoAReserva",0,0,"NO",null,"Gerencia de Abastecimiento Estratégico\ncontratacion@positiva.gov.co\nPBX: (1)6502200 Ext: 10641","SI","SI","NO","SI","Pública clasificada","C65572022-Tipo de información Pública clasificada-Prestación de servicios: El CONTRATISTA se obliga con POSITIVA a la prestación de los servicios de salud para los asegurados y o afiliados a POSITIVA que accedan a los servicios habilitados del CONTRATISTA en calidad de asegurados a los ramos Administración de Riesgos Laborales ARL por causa exclusiva de un accidente de trabajo una enfermedad profesional) Accidentes Personales AP Educativo Generación Positiva AP Colectivos APCorto Plazo AP Individual y demás Ramos de Seguros autorizados a Positiva encontrándose excluidos del presente contrato los servicios y todas aquellas actividades procedimientos e intervenciones que no tengan por objeto contribuir al diagnóstico tratamiento o rehabilitación de la patología derivada del siniestro o los servicios considerados como experimentales cosméticos y suntuarios."]
["VICEPRESIDENCIA TÉCNICA","Gerencia Médica","NO","C65592022",85100000,"Prestación de servicios: El CONTRATISTA se obliga con POSITIVA a la prestación de los servicios de salud para los asegurados y o afiliados a POSITIVA que accedan a los servicios habilitados del CONTRATISTA en calidad de asegurados a los ramos Administración de Riesgos Laborales ARL por causa exclusiva de un accidente de trabajo una enfermedad profesional) Accidentes Personales AP Educativo Generación Positiva AP Colectivos APCorto Plazo AP Individual y demás Ramos de Seguros autorizados a Positiva encontrándose excluidos del presente contrato los servicios y todas aquellas actividades procedimientos e intervenciones que no tengan por objeto contribuir al diagnóstico tratamiento o rehabilitación de la patología derivada del siniestro o los servicios considerados como experimentales cosméticos y suntuarios.","2022-07-01",7,"2024-07-01",24.366666666666667,"Invitación directa","CargoAReserva",0,0,"NO",null,"Gerencia de Abastecimiento Estratégico\ncontratacion@positiva.gov.co\nPBX: (1)6502200 Ext: 10641","SI","SI","NO","SI","Pública clasificada","C65592022-Tipo de información Pública clasificada-Prestación de servicios: El CONTRATISTA se obliga con POSITIVA a la prestación de los servicios de salud para los asegurados y o afiliados a POSITIVA que accedan a los servicios habilitados del CONTRATISTA en calidad de asegurados a los ramos Administración de Riesgos Laborales ARL por causa exclusiva de un accidente de trabajo una enfermedad profesional) Accidentes Personales AP Educativo Generación Positiva AP Colectivos APCorto Plazo AP Individual y demás Ramos de Seguros autorizados a Positiva encontrándose excluidos del presente contrato los servicios y todas aquellas actividades procedimientos e intervenciones que no tengan por objeto contribuir al diagnóstico tratamiento o rehabilitación de la patología derivada del siniestro o los servicios considerados como experimentales cosméticos y suntuarios."]
["VICEPRESIDENCIA TÉCNICA","Gerencia Médica","NO","C65602022",85100000,"Prestación de servicios: El CONTRATISTA se obliga con POSITIVA a la prestación de los servicios de salud para los asegurados y o afiliados a POSITIVA que accedan a los servicios habilitados del CONTRATISTA en calidad de asegurados a los ramos Administración de Riesgos Laborales ARL por causa exclusiva de un accidente de trabajo una enfermedad profesional) Accidentes Personales AP Educativo Generación Positiva AP Colectivos APCorto Plazo AP Individual y demás Ramos de Seguros autorizados a Positiva encontrándose excluidos del presente contrato los servicios y todas aquellas actividades procedimientos e intervenciones que no tengan por objeto contribuir al diagnóstico tratamiento o rehabilitación de la patología derivada del siniestro o los servicios considerados como experimentales cosméticos y suntuarios.","2022-04-01",4,"2024-04-01",24.366666666666667,"Invitación directa","CargoAReserva",0,0,"NO",null,"Gerencia de Abastecimiento Estratégico\ncontratacion@positiva.gov.co\nPBX: (1)6502200 Ext: 10641","SI","SI","NO","SI","Pública clasificada","C65602022-Tipo de información Pública clasificada-Prestación de servicios: El CONTRATISTA se obliga con POSITIVA a la prestación de los servicios de salud para los asegurados y o afiliados a POSITIVA que accedan a los servicios habilitados del CONTRATISTA en calidad de asegurados a los ramos Administración de Riesgos Laborales ARL por causa exclusiva de un accidente de trabajo una enfermedad profesional) Accidentes Personales AP Educativo Generación Positiva AP Colectivos APCorto Plazo AP Individual y demás Ramos de Seguros autorizados a Positiva encontrándose excluidos del presente contrato los servicios y todas aquellas actividades procedimientos e intervenciones que no tengan por objeto contribuir al diagnóstico tratamiento o rehabilitación de la patología derivada del siniestro o los servicios considerados como experimentales cosméticos y suntuarios."]
["VICEPRESIDENCIA TÉCNICA","Gerencia Médica","NO","C65612022",85100000,"Prestación de servicios: El CONTRATISTA se obliga con POSITIVA a la prestación de los servicios de salud para los asegurados y o afiliados a POSITIVA que accedan a los servicios habilitados del CONTRATISTA en calidad de asegurados a los ramos Administración de Riesgos Laborales ARL por causa exclusiva de un accidente de trabajo una enfermedad profesional) Accidentes Personales AP Educativo Generación Positiva AP Colectivos APCorto Plazo AP Individual y demás Ramos de Seguros autorizados a Positiva encontrándose excluidos del presente contrato los servicios y todas aquellas actividades procedimientos e intervenciones que no tengan por objeto contribuir al diagnóstico tratamiento o rehabilitación de la patología derivada del siniestro o los servicios considerados como experimentales cosméticos y suntuarios.","2022-03-30",3,"2024-03-29",24.333333333333332,"Invitación directa","CargoAReserva",0,0,"NO",null,"Gerencia de Abastecimiento Estratégico\ncontratacion@positiva.gov.co\nPBX: (1)6502200 Ext: 10641","SI","SI","NO","SI","Pública clasificada","C65612022-Tipo de información Pública clasificada-Prestación de servicios: El CONTRATISTA se obliga con POSITIVA a la prestación de los servicios de salud para los asegurados y o afiliados a POSITIVA que accedan a los servicios habilitados del CONTRATISTA en calidad de asegurados a los ramos Administración de Riesgos Laborales ARL por causa exclusiva de un accidente de trabajo una enfermedad profesional) Accidentes Personales AP Educativo Generación Positiva AP Colectivos APCorto Plazo AP Individual y demás Ramos de Seguros autorizados a Positiva encontrándose excluidos del presente contrato los servicios y todas aquellas actividades procedimientos e intervenciones que no tengan por objeto contribuir al diagnóstico tratamiento o rehabilitación de la patología derivada del siniestro o los servicios considerados como experimentales cosméticos y suntuarios."]
["VICEPRESIDENCIA TÉCNICA","Gerencia Médica","NO","C65632022",85100000,"Prestación de servicios: El CONTRATISTA se obliga con POSITIVA a la prestación de los servicios de salud para los asegurados y o afiliados a POSITIVA que accedan a los servicios habilitados del CONTRATISTA en calidad de asegurados a los ramos Administración de Riesgos Laborales ARL por causa exclusiva de un accidente de trabajo una enfermedad profesional) Accidentes Personales AP Educativo Generación Positiva AP Colectivos APCorto Plazo AP Individual y demás Ramos de Seguros autorizados a Positiva encontrándose excluidos del presente contrato los servicios y todas aquellas actividades procedimientos e intervenciones que no tengan por objeto contribuir al diagnóstico tratamiento o rehabilitación de la patología derivada del siniestro o los servicios considerados como experimentales cosméticos y suntuarios.","2022-07-30",7,"2024-07-29",24.333333333333332,"Invitación directa","CargoAReserva",0,0,"NO",null,"Gerencia de Abastecimiento Estratégico\ncontratacion@positiva.gov.co\nPBX: (1)6502200 Ext: 10641","SI","SI","NO","SI","Pública clasificada","C65632022-Tipo de información Pública clasificada-Prestación de servicios: El CONTRATISTA se obliga con POSITIVA a la prestación de los servicios de salud para los asegurados y o afiliados a POSITIVA que accedan a los servicios habilitados del CONTRATISTA en calidad de asegurados a los ramos Administración de Riesgos Laborales ARL por causa exclusiva de un accidente de trabajo una enfermedad profesional) Accidentes Personales AP Educativo Generación Positiva AP Colectivos APCorto Plazo AP Individual y demás Ramos de Seguros autorizados a Positiva encontrándose excluidos del presente contrato los servicios y todas aquellas actividades procedimientos e intervenciones que no tengan por objeto contribuir al diagnóstico tratamiento o rehabilitación de la patología derivada del siniestro o los servicios considerados como experimentales cosméticos y suntuarios."]
["VICEPRESIDENCIA TÉCNICA","Gerencia Médica","NO","C65642022",85100000,"Prestación de servicios: El CONTRATISTA se obliga con POSITIVA a la prestación de los servicios de salud para los asegurados y o afiliados a POSITIVA que accedan a los servicios habilitados del CONTRATISTA en calidad de asegurados a los ramos Administración de Riesgos Laborales ARL por causa exclusiva de un accidente de trabajo una enfermedad profesional) Accidentes Personales AP Educativo Generación Positiva AP Colectivos APCorto Plazo AP Individual y demás Ramos de Seguros autorizados a Positiva encontrándose excluidos del presente contrato los servicios y todas aquellas actividades procedimientos e intervenciones que no tengan por objeto contribuir al diagnóstico tratamiento o rehabilitación de la patología derivada del siniestro o los servicios considerados como experimentales cosméticos y suntuarios.","2022-03-30",3,"2024-03-29",24.333333333333332,"Invitación directa","CargoAReserva",0,0,"NO",null,"Gerencia de Abastecimiento Estratégico\ncontratacion@positiva.gov.co\nPBX: (1)6502200 Ext: 10641","SI","SI","NO","SI","Pública clasificada","C65642022-Tipo de información Pública clasificada-Prestación de servicios: El CONTRATISTA se obliga con POSITIVA a la prestación de los servicios de salud para los asegurados y o afiliados a POSITIVA que accedan a los servicios habilitados del CONTRATISTA en calidad de asegurados a los ramos Administración de Riesgos Laborales ARL por causa exclusiva de un accidente de trabajo una enfermedad profesional) Accidentes Personales AP Educativo Generación Positiva AP Colectivos APCorto Plazo AP Individual y demás Ramos de Seguros autorizados a Positiva encontrándose excluidos del presente contrato los servicios y todas aquellas actividades procedimientos e intervenciones que no tengan por objeto contribuir al diagnóstico tratamiento o rehabilitación de la patología derivada del siniestro o los servicios considerados como experimentales cosméticos y suntuarios."]
["VICEPRESIDENCIA TÉCNICA","Gerencia Médica","NO","C65652022",85100000,"Prestación de servicios: El CONTRATISTA se obliga con POSITIVA a la prestación de los servicios de salud para los asegurados y o afiliados a POSITIVA que accedan a los servicios habilitados del CONTRATISTA en calidad de asegurados a los ramos Administración de Riesgos Laborales ARL por causa exclusiva de un accidente de trabajo una enfermedad profesional) Accidentes Personales AP Educativo Generación Positiva AP Colectivos APCorto Plazo AP Individual y demás Ramos de Seguros autorizados a Positiva encontrándose excluidos del presente contrato los servicios y todas aquellas actividades procedimientos e intervenciones que no tengan por objeto contribuir al diagnóstico tratamiento o rehabilitación de la patología derivada del siniestro o los servicios considerados como experimentales cosméticos y suntuarios.","2022-03-30",3,"2024-03-29",24.333333333333332,"Invitación directa","CargoAReserva",0,0,"NO",null,"Gerencia de Abastecimiento Estratégico\ncontratacion@positiva.gov.co\nPBX: (1)6502200 Ext: 10641","SI","SI","NO","SI","Pública clasificada","C65652022-Tipo de información Pública clasificada-Prestación de servicios: El CONTRATISTA se obliga con POSITIVA a la prestación de los servicios de salud para los asegurados y o afiliados a POSITIVA que accedan a los servicios habilitados del CONTRATISTA en calidad de asegurados a los ramos Administración de Riesgos Laborales ARL por causa exclusiva de un accidente de trabajo una enfermedad profesional) Accidentes Personales AP Educativo Generación Positiva AP Colectivos APCorto Plazo AP Individual y demás Ramos de Seguros autorizados a Positiva encontrándose excluidos del presente contrato los servicios y todas aquellas actividades procedimientos e intervenciones que no tengan por objeto contribuir al diagnóstico tratamiento o rehabilitación de la patología derivada del siniestro o los servicios considerados como experimentales cosméticos y suntuarios."]
["VICEPRESIDENCIA TÉCNICA","Gerencia Médica","NO","C65662022",85100000,"Prestación de servicios: El CONTRATISTA se obliga con POSITIVA a la prestación de los servicios de salud para los asegurados y o afiliados a POSITIVA que accedan a los servicios habilitados del CONTRATISTA en calidad de asegurados a los ramos Administración de Riesgos Laborales ARL por causa exclusiva de un accidente de trabajo una enfermedad profesional) Accidentes Personales AP Educativo Generación Positiva AP Colectivos APCorto Plazo AP Individual y demás Ramos de Seguros autorizados a Positiva encontrándose excluidos del presente contrato los servicios y todas aquellas actividades procedimientos e intervenciones que no tengan por objeto contribuir al diagnóstico tratamiento o rehabilitación de la patología derivada del siniestro o los servicios considerados como experimentales cosméticos y suntuarios.","2022-09-01",9,"2024-09-30",25.333333333333332,"Invitación directa","CargoAReserva",0,0,"NO",null,"Gerencia de Abastecimiento Estratégico\ncontratacion@positiva.gov.co\nPBX: (1)6502200 Ext: 10641","SI","SI","NO","SI","Pública clasificada","C65662022-Tipo de información Pública clasificada-Prestación de servicios: El CONTRATISTA se obliga con POSITIVA a la prestación de los servicios de salud para los asegurados y o afiliados a POSITIVA que accedan a los servicios habilitados del CONTRATISTA en calidad de asegurados a los ramos Administración de Riesgos Laborales ARL por causa exclusiva de un accidente de trabajo una enfermedad profesional) Accidentes Personales AP Educativo Generación Positiva AP Colectivos APCorto Plazo AP Individual y demás Ramos de Seguros autorizados a Positiva encontrándose excluidos del presente contrato los servicios y todas aquellas actividades procedimientos e intervenciones que no tengan por objeto contribuir al diagnóstico tratamiento o rehabilitación de la patología derivada del siniestro o los servicios considerados como experimentales cosméticos y suntuarios."]
["VICEPRESIDENCIA TÉCNICA","Gerencia Médica","NO","C65672022",85100000,"Prestación de servicios: El CONTRATISTA se obliga con POSITIVA a la prestación de los servicios de salud para los asegurados y o afiliados a POSITIVA que accedan a los servicios habilitados del CONTRATISTA en calidad de asegurados a los ramos Administración de Riesgos Laborales ARL por causa exclusiva de un accidente de trabajo una enfermedad profesional) Accidentes Personales AP Educativo Generación Positiva AP Colectivos APCorto Plazo AP Individual y demás Ramos de Seguros autorizados a Positiva encontrándose excluidos del presente contrato los servicios y todas aquellas actividades procedimientos e intervenciones que no tengan por objeto contribuir al diagnóstico tratamiento o rehabilitación de la patología derivada del siniestro o los servicios considerados como experimentales cosméticos y suntuarios.","2022-09-01",9,"2024-09-30",25.333333333333332,"Invitación directa","CargoAReserva",0,0,"NO",null,"Gerencia de Abastecimiento Estratégico\ncontratacion@positiva.gov.co\nPBX: (1)6502200 Ext: 10641","SI","SI","NO","SI","Pública clasificada","C65672022-Tipo de información Pública clasificada-Prestación de servicios: El CONTRATISTA se obliga con POSITIVA a la prestación de los servicios de salud para los asegurados y o afiliados a POSITIVA que accedan a los servicios habilitados del CONTRATISTA en calidad de asegurados a los ramos Administración de Riesgos Laborales ARL por causa exclusiva de un accidente de trabajo una enfermedad profesional) Accidentes Personales AP Educativo Generación Positiva AP Colectivos APCorto Plazo AP Individual y demás Ramos de Seguros autorizados a Positiva encontrándose excluidos del presente contrato los servicios y todas aquellas actividades procedimientos e intervenciones que no tengan por objeto contribuir al diagnóstico tratamiento o rehabilitación de la patología derivada del siniestro o los servicios considerados como experimentales cosméticos y suntuarios."]
["VICEPRESIDENCIA TÉCNICA","Gerencia Médica","NO","C65682022",85100000,"Prestación de servicios: El CONTRATISTA se obliga con POSITIVA a la prestación de los servicios de salud para los asegurados y o afiliados a POSITIVA que accedan a los servicios habilitados del CONTRATISTA en calidad de asegurados a los ramos Administración de Riesgos Laborales ARL por causa exclusiva de un accidente de trabajo una enfermedad profesional) Accidentes Personales AP Educativo Generación Positiva AP Colectivos APCorto Plazo AP Individual y demás Ramos de Seguros autorizados a Positiva encontrándose excluidos del presente contrato los servicios y todas aquellas actividades procedimientos e intervenciones que no tengan por objeto contribuir al diagnóstico tratamiento o rehabilitación de la patología derivada del siniestro o los servicios considerados como experimentales cosméticos y suntuarios.","2022-02-01",2,"2024-02-01",24.333333333333332,"Invitación directa","CargoAReserva",0,0,"NO",null,"Gerencia de Abastecimiento Estratégico\ncontratacion@positiva.gov.co\nPBX: (1)6502200 Ext: 10641","SI","SI","NO","SI","Pública clasificada","C65682022-Tipo de información Pública clasificada-Prestación de servicios: El CONTRATISTA se obliga con POSITIVA a la prestación de los servicios de salud para los asegurados y o afiliados a POSITIVA que accedan a los servicios habilitados del CONTRATISTA en calidad de asegurados a los ramos Administración de Riesgos Laborales ARL por causa exclusiva de un accidente de trabajo una enfermedad profesional) Accidentes Personales AP Educativo Generación Positiva AP Colectivos APCorto Plazo AP Individual y demás Ramos de Seguros autorizados a Positiva encontrándose excluidos del presente contrato los servicios y todas aquellas actividades procedimientos e intervenciones que no tengan por objeto contribuir al diagnóstico tratamiento o rehabilitación de la patología derivada del siniestro o los servicios considerados como experimentales cosméticos y suntuarios."]
["VICEPRESIDENCIA TÉCNICA","Gerencia Médica","NO","C65692022",85100000,"Prestación de servicios: El CONTRATISTA se obliga con POSITIVA a la prestación de los servicios de salud para los asegurados y o afiliados a POSITIVA que accedan a los servicios habilitados del CONTRATISTA en calidad de asegurados a los ramos Administración de Riesgos Laborales ARL por causa exclusiva de un accidente de trabajo una enfermedad profesional) Accidentes Personales AP Educativo Generación Positiva AP Colectivos APCorto Plazo AP Individual y demás Ramos de Seguros autorizados a Positiva encontrándose excluidos del presente contrato los servicios y todas aquellas actividades procedimientos e intervenciones que no tengan por objeto contribuir al diagnóstico tratamiento o rehabilitación de la patología derivada del siniestro o los servicios considerados como experimentales cosméticos y suntuarios.","2022-03-01",3,"2024-03-01",24.366666666666667,"Invitación directa","CargoAReserva",0,0,"NO",null,"Gerencia de Abastecimiento Estratégico\ncontratacion@positiva.gov.co\nPBX: (1)6502200 Ext: 10641","SI","SI","NO","SI","Pública clasificada","C65692022-Tipo de información Pública clasificada-Prestación de servicios: El CONTRATISTA se obliga con POSITIVA a la prestación de los servicios de salud para los asegurados y o afiliados a POSITIVA que accedan a los servicios habilitados del CONTRATISTA en calidad de asegurados a los ramos Administración de Riesgos Laborales ARL por causa exclusiva de un accidente de trabajo una enfermedad profesional) Accidentes Personales AP Educativo Generación Positiva AP Colectivos APCorto Plazo AP Individual y demás Ramos de Seguros autorizados a Positiva encontrándose excluidos del presente contrato los servicios y todas aquellas actividades procedimientos e intervenciones que no tengan por objeto contribuir al diagnóstico tratamiento o rehabilitación de la patología derivada del siniestro o los servicios considerados como experimentales cosméticos y suntuarios."]
["VICEPRESIDENCIA TÉCNICA","Gerencia Médica","NO","C65702022",85100000,"Prestación de servicios: El CONTRATISTA se obliga con POSITIVA a la prestación de los servicios de salud para los asegurados y o afiliados a POSITIVA que accedan a los servicios habilitados del CONTRATISTA en calidad de asegurados a los ramos Administración de Riesgos Laborales ARL por causa exclusiva de un accidente de trabajo una enfermedad profesional) Accidentes Personales AP Educativo Generación Positiva AP Colectivos APCorto Plazo AP Individual y demás Ramos de Seguros autorizados a Positiva encontrándose excluidos del presente contrato los servicios y todas aquellas actividades procedimientos e intervenciones que no tengan por objeto contribuir al diagnóstico tratamiento o rehabilitación de la patología derivada del siniestro o los servicios considerados como experimentales cosméticos y suntuarios.","2022-04-01",4,"2024-04-01",24.366666666666667,"Invitación directa","CargoAReserva",0,0,"NO",null,"Gerencia de Abastecimiento Estratégico\ncontratacion@positiva.gov.co\nPBX: (1)6502200 Ext: 10641","SI","SI","NO","SI","Pública clasificada","C65702022-Tipo de información Pública clasificada-Prestación de servicios: El CONTRATISTA se obliga con POSITIVA a la prestación de los servicios de salud para los asegurados y o afiliados a POSITIVA que accedan a los servicios habilitados del CONTRATISTA en calidad de asegurados a los ramos Administración de Riesgos Laborales ARL por causa exclusiva de un accidente de trabajo una enfermedad profesional) Accidentes Personales AP Educativo Generación Positiva AP Colectivos APCorto Plazo AP Individual y demás Ramos de Seguros autorizados a Positiva encontrándose excluidos del presente contrato los servicios y todas aquellas actividades procedimientos e intervenciones que no tengan por objeto contribuir al diagnóstico tratamiento o rehabilitación de la patología derivada del siniestro o los servicios considerados como experimentales cosméticos y suntuarios."]
["VICEPRESIDENCIA TÉCNICA","Gerencia Médica","NO","C65712022",85100000,"Prestación de servicios: El CONTRATISTA se obliga con POSITIVA a la prestación de los servicios de salud para los asegurados y o afiliados a POSITIVA que accedan a los servicios habilitados del CONTRATISTA en calidad de asegurados a los ramos Administración de Riesgos Laborales ARL por causa exclusiva de un accidente de trabajo una enfermedad profesional) Accidentes Personales AP Educativo Generación Positiva AP Colectivos APCorto Plazo AP Individual y demás Ramos de Seguros autorizados a Positiva encontrándose excluidos del presente contrato los servicios y todas aquellas actividades procedimientos e intervenciones que no tengan por objeto contribuir al diagnóstico tratamiento o rehabilitación de la patología derivada del siniestro o los servicios considerados como experimentales cosméticos y suntuarios.","2022-09-01",9,"2027-09-01",60.866666666666667,"Invitación directa","CargoAReserva",0,0,"NO",null,"Gerencia de Abastecimiento Estratégico\ncontratacion@positiva.gov.co\nPBX: (1)6502200 Ext: 10641","SI","SI","NO","SI","Pública clasificada","C65712022-Tipo de información Pública clasificada-Prestación de servicios: El CONTRATISTA se obliga con POSITIVA a la prestación de los servicios de salud para los asegurados y o afiliados a POSITIVA que accedan a los servicios habilitados del CONTRATISTA en calidad de asegurados a los ramos Administración de Riesgos Laborales ARL por causa exclusiva de un accidente de trabajo una enfermedad profesional) Accidentes Personales AP Educativo Generación Positiva AP Colectivos APCorto Plazo AP Individual y demás Ramos de Seguros autorizados a Positiva encontrándose excluidos del presente contrato los servicios y todas aquellas actividades procedimientos e intervenciones que no tengan por objeto contribuir al diagnóstico tratamiento o rehabilitación de la patología derivada del siniestro o los servicios considerados como experimentales cosméticos y suntuarios."]
["VICEPRESIDENCIA TÉCNICA","Gerencia Médica","NO","C65722022",85100000,"Prestación de servicios: El CONTRATISTA se obliga con POSITIVA a la prestación de los servicios de salud para los asegurados y o afiliados a POSITIVA que accedan a los servicios habilitados del CONTRATISTA en calidad de asegurados a los ramos Administración de Riesgos Laborales ARL por causa exclusiva de un accidente de trabajo una enfermedad profesional) Accidentes Personales AP Educativo Generación Positiva AP Colectivos APCorto Plazo AP Individual y demás Ramos de Seguros autorizados a Positiva encontrándose excluidos del presente contrato los servicios y todas aquellas actividades procedimientos e intervenciones que no tengan por objeto contribuir al diagnóstico tratamiento o rehabilitación de la patología derivada del siniestro o los servicios considerados como experimentales cosméticos y suntuarios.","2022-09-01",9,"2024-09-30",25.333333333333332,"Invitación directa","CargoAReserva",0,0,"NO",null,"Gerencia de Abastecimiento Estratégico\ncontratacion@positiva.gov.co\nPBX: (1)6502200 Ext: 10641","SI","SI","NO","SI","Pública clasificada","C65722022-Tipo de información Pública clasificada-Prestación de servicios: El CONTRATISTA se obliga con POSITIVA a la prestación de los servicios de salud para los asegurados y o afiliados a POSITIVA que accedan a los servicios habilitados del CONTRATISTA en calidad de asegurados a los ramos Administración de Riesgos Laborales ARL por causa exclusiva de un accidente de trabajo una enfermedad profesional) Accidentes Personales AP Educativo Generación Positiva AP Colectivos APCorto Plazo AP Individual y demás Ramos de Seguros autorizados a Positiva encontrándose excluidos del presente contrato los servicios y todas aquellas actividades procedimientos e intervenciones que no tengan por objeto contribuir al diagnóstico tratamiento o rehabilitación de la patología derivada del siniestro o los servicios considerados como experimentales cosméticos y suntuarios."]
["VICEPRESIDENCIA TÉCNICA","Gerencia Médica","NO","C65732022",85100000,"Prestación de servicios: El CONTRATISTA se obliga con POSITIVA a la prestación de los servicios de salud para los asegurados y o afiliados a POSITIVA que accedan a los servicios habilitados del CONTRATISTA en calidad de asegurados a los ramos Administración de Riesgos Laborales ARL por causa exclusiva de un accidente de trabajo una enfermedad profesional) Accidentes Personales AP Educativo Generación Positiva AP Colectivos APCorto Plazo AP Individual y demás Ramos de Seguros autorizados a Positiva encontrándose excluidos del presente contrato los servicios y todas aquellas actividades procedimientos e intervenciones que no tengan por objeto contribuir al diagnóstico tratamiento o rehabilitación de la patología derivada del siniestro o los servicios considerados como experimentales cosméticos y suntuarios.","2022-10-01",10,"2027-10-01",60.866666666666667,"Invitación directa","CargoAReserva",0,0,"NO",null,"Gerencia de Abastecimiento Estratégico\ncontratacion@positiva.gov.co\nPBX: (1)6502200 Ext: 10641","SI","SI","NO","SI","Pública clasificada","C65732022-Tipo de información Pública clasificada-Prestación de servicios: El CONTRATISTA se obliga con POSITIVA a la prestación de los servicios de salud para los asegurados y o afiliados a POSITIVA que accedan a los servicios habilitados del CONTRATISTA en calidad de asegurados a los ramos Administración de Riesgos Laborales ARL por causa exclusiva de un accidente de trabajo una enfermedad profesional) Accidentes Personales AP Educativo Generación Positiva AP Colectivos APCorto Plazo AP Individual y demás Ramos de Seguros autorizados a Positiva encontrándose excluidos del presente contrato los servicios y todas aquellas actividades procedimientos e intervenciones que no tengan por objeto contribuir al diagnóstico tratamiento o rehabilitación de la patología derivada del siniestro o los servicios considerados como experimentales cosméticos y suntuarios."]
["VICEPRESIDENCIA TÉCNICA","Gerencia Médica","NO","C65742022",85100000,"Prestación de servicios: El CONTRATISTA se obliga con POSITIVA a la prestación de los servicios de salud para los asegurados y o afiliados a POSITIVA que accedan a los servicios habilitados del CONTRATISTA en calidad de asegurados a los ramos Administración de Riesgos Laborales ARL por causa exclusiva de un accidente de trabajo una enfermedad profesional) Accidentes Personales AP Educativo Generación Positiva AP Colectivos APCorto Plazo AP Individual y demás Ramos de Seguros autorizados a Positiva encontrándose excluidos del presente contrato los servicios y todas aquellas actividades procedimientos e intervenciones que no tengan por objeto contribuir al diagnóstico tratamiento o rehabilitación de la patología derivada del siniestro o los servicios considerados como experimentales cosméticos y suntuarios.","2022-07-01",7,"2024-07-01",24.366666666666667,"Invitación directa","CargoAReserva",0,0,"NO",null,"Gerencia de Abastecimiento Estratégico\ncontratacion@positiva.gov.co\nPBX: (1)6502200 Ext: 10641","SI","SI","NO","SI","Pública clasificada","C65742022-Tipo de información Pública clasificada-Prestación de servicios: El CONTRATISTA se obliga con POSITIVA a la prestación de los servicios de salud para los asegurados y o afiliados a POSITIVA que accedan a los servicios habilitados del CONTRATISTA en calidad de asegurados a los ramos Administración de Riesgos Laborales ARL por causa exclusiva de un accidente de trabajo una enfermedad profesional) Accidentes Personales AP Educativo Generación Positiva AP Colectivos APCorto Plazo AP Individual y demás Ramos de Seguros autorizados a Positiva encontrándose excluidos del presente contrato los servicios y todas aquellas actividades procedimientos e intervenciones que no tengan por objeto contribuir al diagnóstico tratamiento o rehabilitación de la patología derivada del siniestro o los servicios considerados como experimentales cosméticos y suntuarios."]
["VICEPRESIDENCIA TÉCNICA","Gerencia Médica","NO","C65762022",85100000,"Prestación de servicios: El CONTRATISTA se obliga con POSITIVA a la prestación de los servicios de salud para los asegurados y o afiliados a POSITIVA que accedan a los servicios habilitados del CONTRATISTA en calidad de asegurados a los ramos Administración de Riesgos Laborales ARL por causa exclusiva de un accidente de trabajo una enfermedad profesional) Accidentes Personales AP Educativo Generación Positiva AP Colectivos APCorto Plazo AP Individual y demás Ramos de Seguros autorizados a Positiva encontrándose excluidos del presente contrato los servicios y todas aquellas actividades procedimientos e intervenciones que no tengan por objeto contribuir al diagnóstico tratamiento o rehabilitación de la patología derivada del siniestro o los servicios considerados como experimentales cosméticos y suntuarios.","2022-10-20",10,"2024-10-20",24.366666666666667,"Invitación directa","CargoAReserva",0,0,"NO",null,"Gerencia de Abastecimiento Estratégico\ncontratacion@positiva.gov.co\nPBX: (1)6502200 Ext: 10641","SI","SI","NO","SI","Pública clasificada","C65762022-Tipo de información Pública clasificada-Prestación de servicios: El CONTRATISTA se obliga con POSITIVA a la prestación de los servicios de salud para los asegurados y o afiliados a POSITIVA que accedan a los servicios habilitados del CONTRATISTA en calidad de asegurados a los ramos Administración de Riesgos Laborales ARL por causa exclusiva de un accidente de trabajo una enfermedad profesional) Accidentes Personales AP Educativo Generación Positiva AP Colectivos APCorto Plazo AP Individual y demás Ramos de Seguros autorizados a Positiva encontrándose excluidos del presente contrato los servicios y todas aquellas actividades procedimientos e intervenciones que no tengan por objeto contribuir al diagnóstico tratamiento o rehabilitación de la patología derivada del siniestro o los servicios considerados como experimentales cosméticos y suntuarios."]
["VICEPRESIDENCIA TÉCNICA","Gerencia Médica","NO","C65782022",85100000,"Prestación de servicios: El CONTRATISTA se obliga con POSITIVA a la prestación de los servicios de salud para los asegurados y o afiliados a POSITIVA que accedan a los servicios habilitados del CONTRATISTA en calidad de asegurados a los ramos Administración de Riesgos Laborales ARL por causa exclusiva de un accidente de trabajo una enfermedad profesional) Accidentes Personales AP Educativo Generación Positiva AP Colectivos APCorto Plazo AP Individual y demás Ramos de Seguros autorizados a Positiva encontrándose excluidos del presente contrato los servicios y todas aquellas actividades procedimientos e intervenciones que no tengan por objeto contribuir al diagnóstico tratamiento o rehabilitación de la patología derivada del siniestro o los servicios considerados como experimentales cosméticos y suntuarios.","2022-12-28",{"$f":"MONTH(G535)","v":12},"2024-12-28",24.366666666666667,"Invitación directa","CargoAReserva",0,0,"NO",null,"Gerencia de Abastecimiento Estratégico\ncontratacion@positiva.gov.co\nPBX: (1)6502200 Ext: 10641","SI","SI","NO","SI","Pública clasificada","C65782022-Tipo de información Pública clasificada-Prestación de servicios: El CONTRATISTA se obliga con POSITIVA a la prestación de los servicios de salud para los asegurados y o afiliados a POSITIVA que accedan a los servicios habilitados del CONTRATISTA en calidad de asegurados a los ramos Administración de Riesgos Laborales ARL por causa exclusiva de un accidente de trabajo una enfermedad profesional) Accidentes Personales AP Educativo Generación Positiva AP Colectivos APCorto Plazo AP Individual y demás Ramos de Seguros autorizados a Positiva encontrándose excluidos del presente contrato los servicios y todas aquellas actividades procedimientos e intervenciones que no tengan por objeto contribuir al diagnóstico tratamiento o rehabilitación de la patología derivada del siniestro o los servicios considerados como experimentales cosméticos y suntuarios."]
["VICEPRESIDENCIA TÉCNICA","Gerencia Médica","NO","C65792022",85100000,"Prestación de servicios: El CONTRATISTA se obliga con POSITIVA a la prestación de los servicios de salud para los asegurados y o afiliados a POSITIVA que accedan a los servicios habilitados del CONTRATISTA en calidad de asegurados a los ramos Administración de Riesgos Laborales ARL por causa exclusiva de un accidente de trabajo una enfermedad profesional) Accidentes Personales AP Educativo Generación Positiva AP Colectivos APCorto Plazo AP Individual y demás Ramos de Seguros autorizados a Positiva encontrándose excluidos del presente contrato los servicios y todas aquellas actividades procedimientos e intervenciones que no tengan por objeto contribuir al diagnóstico tratamiento o rehabilitación de la patología derivada del siniestro o los servicios considerados como experimentales cosméticos y suntuarios.","2022-09-01",9,"2024-09-30",25.333333333333332,"Invitación directa","CargoAReserva",0,0,"NO",null,"Gerencia de Abastecimiento Estratégico\ncontratacion@positiva.gov.co\nPBX: (1)6502200 Ext: 10641","SI","SI","NO","SI","Pública clasificada","C65792022-Tipo de información Pública clasificada-Prestación de servicios: El CONTRATISTA se obliga con POSITIVA a la prestación de los servicios de salud para los asegurados y o afiliados a POSITIVA que accedan a los servicios habilitados del CONTRATISTA en calidad de asegurados a los ramos Administración de Riesgos Laborales ARL por causa exclusiva de un accidente de trabajo una enfermedad profesional) Accidentes Personales AP Educativo Generación Positiva AP Colectivos APCorto Plazo AP Individual y demás Ramos de Seguros autorizados a Positiva encontrándose excluidos del presente contrato los servicios y todas aquellas actividades procedimientos e intervenciones que no tengan por objeto contribuir al diagnóstico tratamiento o rehabilitación de la patología derivada del siniestro o los servicios considerados como experimentales cosméticos y suntuarios."]
["VICEPRESIDENCIA TÉCNICA","Gerencia Médica","NO","C65802022",85100000,"Prestación de servicios: El CONTRATISTA se obliga con POSITIVA a la prestación de los servicios de salud para los asegurados y o afiliados a POSITIVA que accedan a los servicios habilitados del CONTRATISTA en calidad de asegurados a los ramos Administración de Riesgos Laborales ARL por causa exclusiva de un accidente de trabajo una enfermedad profesional) Accidentes Personales AP Educativo Generación Positiva AP Colectivos APCorto Plazo AP Individual y demás Ramos de Seguros autorizados a Positiva encontrándose excluidos del presente contrato los servicios y todas aquellas actividades procedimientos e intervenciones que no tengan por objeto contribuir al diagnóstico tratamiento o rehabilitación de la patología derivada del siniestro o los servicios considerados como experimentales cosméticos y suntuarios.","2022-02-01",2,"2027-02-01",60.866666666666667,"Invitación directa","CargoAReserva",0,0,"NO",null,"Gerencia de Abastecimiento Estratégico\ncontratacion@positiva.gov.co\nPBX: (1)6502200 Ext: 10641","SI","SI","NO","SI","Pública clasificada","C65802022-Tipo de información Pública clasificada-Prestación de servicios: El CONTRATISTA se obliga con POSITIVA a la prestación de los servicios de salud para los asegurados y o afiliados a POSITIVA que accedan a los servicios habilitados del CONTRATISTA en calidad de asegurados a los ramos Administración de Riesgos Laborales ARL por causa exclusiva de un accidente de trabajo una enfermedad profesional) Accidentes Personales AP Educativo Generación Positiva AP Colectivos APCorto Plazo AP Individual y demás Ramos de Seguros autorizados a Positiva encontrándose excluidos del presente contrato los servicios y todas aquellas actividades procedimientos e intervenciones que no tengan por objeto contribuir al diagnóstico tratamiento o rehabilitación de la patología derivada del siniestro o los servicios considerados como experimentales cosméticos y suntuarios."]
["VICEPRESIDENCIA TÉCNICA","Gerencia Médica","NO","C65812022",85100000,"Prestación de servicios: El CONTRATISTA se obliga con POSITIVA a la prestación de los servicios de salud para los asegurados y o afiliados a POSITIVA que accedan a los servicios habilitados del CONTRATISTA en calidad de asegurados a los ramos Administración de Riesgos Laborales ARL por causa exclusiva de un accidente de trabajo una enfermedad profesional) Accidentes Personales AP Educativo Generación Positiva AP Colectivos APCorto Plazo AP Individual y demás Ramos de Seguros autorizados a Positiva encontrándose excluidos del presente contrato los servicios y todas aquellas actividades procedimientos e intervenciones que no tengan por objeto contribuir al diagnóstico tratamiento o rehabilitación de la patología derivada del siniestro o los servicios considerados como experimentales cosméticos y suntuarios.","2022-03-01",3,"2027-03-01",60.866666666666667,"Invitación directa","CargoAReserva",0,0,"NO",null,"Gerencia de Abastecimiento Estratégico\ncontratacion@positiva.gov.co\nPBX: (1)6502200 Ext: 10641","SI","SI","NO","SI","Pública clasificada","C65812022-Tipo de información Pública clasificada-Prestación de servicios: El CONTRATISTA se obliga con POSITIVA a la prestación de los servicios de salud para los asegurados y o afiliados a POSITIVA que accedan a los servicios habilitados del CONTRATISTA en calidad de asegurados a los ramos Administración de Riesgos Laborales ARL por causa exclusiva de un accidente de trabajo una enfermedad profesional) Accidentes Personales AP Educativo Generación Positiva AP Colectivos APCorto Plazo AP Individual y demás Ramos de Seguros autorizados a Positiva encontrándose excluidos del presente contrato los servicios y todas aquellas actividades procedimientos e intervenciones que no tengan por objeto contribuir al diagnóstico tratamiento o rehabilitación de la patología derivada del siniestro o los servicios considerados como experimentales cosméticos y suntuarios."]
["VICEPRESIDENCIA TÉCNICA","Gerencia Médica","NO","C65822022",85100000,"Prestación de servicios: El CONTRATISTA se obliga con POSITIVA a la prestación de los servicios de salud para los asegurados y o afiliados a POSITIVA que accedan a los servicios habilitados del CONTRATISTA en calidad de asegurados a los ramos Administración de Riesgos Laborales ARL por causa exclusiva de un accidente de trabajo una enfermedad profesional) Accidentes Personales AP Educativo Generación Positiva AP Colectivos APCorto Plazo AP Individual y demás Ramos de Seguros autorizados a Positiva encontrándose excluidos del presente contrato los servicios y todas aquellas actividades procedimientos e intervenciones que no tengan por objeto contribuir al diagnóstico tratamiento o rehabilitación de la patología derivada del siniestro o los servicios considerados como experimentales cosméticos y suntuarios.","2022-04-01",4,"2027-04-01",60.866666666666667,"Invitación directa","CargoAReserva",0,0,"NO",null,"Gerencia de Abastecimiento Estratégico\ncontratacion@positiva.gov.co\nPBX: (1)6502200 Ext: 10641","SI","SI","NO","SI","Pública clasificada","C65822022-Tipo de información Pública clasificada-Prestación de servicios: El CONTRATISTA se obliga con POSITIVA a la prestación de los servicios de salud para los asegurados y o afiliados a POSITIVA que accedan a los servicios habilitados del CONTRATISTA en calidad de asegurados a los ramos Administración de Riesgos Laborales ARL por causa exclusiva de un accidente de trabajo una enfermedad profesional) Accidentes Personales AP Educativo Generación Positiva AP Colectivos APCorto Plazo AP Individual y demás Ramos de Seguros autorizados a Positiva encontrándose excluidos del presente contrato los servicios y todas aquellas actividades procedimientos e intervenciones que no tengan por objeto contribuir al diagnóstico tratamiento o rehabilitación de la patología derivada del siniestro o los servicios considerados como experimentales cosméticos y suntuarios."]
["VICEPRESIDENCIA TÉCNICA","Gerencia Médica","NO","C65832022",85100000,"Prestación de servicios: El CONTRATISTA se obliga con POSITIVA a la prestación de los servicios de salud para los asegurados y o afiliados a POSITIVA que accedan a los servicios habilitados del CONTRATISTA en calidad de asegurados a los ramos Administración de Riesgos Laborales ARL por causa exclusiva de un accidente de trabajo una enfermedad profesional) Accidentes Personales AP Educativo Generación Positiva AP Colectivos APCorto Plazo AP Individual y demás Ramos de Seguros autorizados a Positiva encontrándose excluidos del presente contrato los servicios y todas aquellas actividades procedimientos e intervenciones que no tengan por objeto contribuir al diagnóstico tratamiento o rehabilitación de la patología derivada del siniestro o los servicios considerados como experimentales cosméticos y suntuarios.","2022-10-01",10,"2024-10-30",25.333333333333332,"Invitación directa","CargoAReserva",0,0,"NO",null,"Gerencia de Abastecimiento Estratégico\ncontratacion@positiva.gov.co\nPBX: (1)6502200 Ext: 10641","SI","SI","NO","SI","Pública clasificada","C65832022-Tipo de información Pública clasificada-Prestación de servicios: El CONTRATISTA se obliga con POSITIVA a la prestación de los servicios de salud para los asegurados y o afiliados a POSITIVA que accedan a los servicios habilitados del CONTRATISTA en calidad de asegurados a los ramos Administración de Riesgos Laborales ARL por causa exclusiva de un accidente de trabajo una enfermedad profesional) Accidentes Personales AP Educativo Generación Positiva AP Colectivos APCorto Plazo AP Individual y demás Ramos de Seguros autorizados a Positiva encontrándose excluidos del presente contrato los servicios y todas aquellas actividades procedimientos e intervenciones que no tengan por objeto contribuir al diagnóstico tratamiento o rehabilitación de la patología derivada del siniestro o los servicios considerados como experimentales cosméticos y suntuarios."]
["VICEPRESIDENCIA TÉCNICA","Gerencia Médica","NO","C65842022",85100000,"Prestación de servicios: El CONTRATISTA se obliga con POSITIVA a la prestación de los servicios de salud para los asegurados y o afiliados a POSITIVA que accedan a los servicios habilitados del CONTRATISTA en calidad de asegurados a los ramos Administración de Riesgos Laborales ARL por causa exclusiva de un accidente de trabajo una enfermedad profesional) Accidentes Personales AP Educativo Generación Positiva AP Colectivos APCorto Plazo AP Individual y demás Ramos de Seguros autorizados a Positiva encontrándose excluidos del presente contrato los servicios y todas aquellas actividades procedimientos e intervenciones que no tengan por objeto contribuir al diagnóstico tratamiento o rehabilitación de la patología derivada del siniestro o los servicios considerados como experimentales cosméticos y suntuarios.","2022-10-01",10,"2024-10-30",{"$f":"(I541-G541)/30","v":25.333333333333332},"Invitación directa","CargoAReserva",0,0,"NO",null,"Gerencia de Abastecimiento Estratégico\ncontratacion@positiva.gov.co\nPBX: (1)6502200 Ext: 10641","SI","SI","NO","SI","Pública clasificada","C65842022-Tipo de información Pública clasificada-Prestación de servicios: El CONTRATISTA se obliga con POSITIVA a la prestación de los servicios de salud para los asegurados y o afiliados a POSITIVA que accedan a los servicios habilitados del CONTRATISTA en calidad de asegurados a los ramos Administración de Riesgos Laborales ARL por causa exclusiva de un accidente de trabajo una enfermedad profesional) Accidentes Personales AP Educativo Generación Positiva AP Colectivos APCorto Plazo AP Individual y demás Ramos de Seguros autorizados a Positiva encontrándose excluidos del presente contrato los servicios y todas aquellas actividades procedimientos e intervenciones que no tengan por objeto contribuir al diagnóstico tratamiento o rehabilitación de la patología derivada del siniestro o los servicios considerados como experimentales cosméticos y suntuarios."]
["VICEPRESIDENCIA TÉCNICA","Gerencia Médica","NO","C65852022",85100000,"Prestación de servicios: El CONTRATISTA se obliga con POSITIVA a la prestación de los servicios de salud para los asegurados y o afiliados a POSITIVA que accedan a los servicios habilitados del CONTRATISTA en calidad de asegurados a los ramos Administración de Riesgos Laborales ARL por causa exclusiva de un accidente de trabajo una enfermedad profesional) Accidentes Personales AP Educativo Generación Positiva AP Colectivos APCorto Plazo AP Individual y demás Ramos de Seguros autorizados a Positiva encontrándose excluidos del presente contrato los servicios y todas aquellas actividades procedimientos e intervenciones que no tengan por objeto contribuir al diagnóstico tratamiento o rehabilitación de la patología derivada del siniestro o los servicios considerados como experimentales cosméticos y suntuarios.","2022-03-29",3,"2024-03-29",24.366666666666667,"Invitación directa","CargoAReserva",0,0,"NO",null,"Gerencia de Abastecimiento Estratégico\ncontratacion@positiva.gov.co\nPBX: (1)6502200 Ext: 10641","SI","SI","NO","SI","Pública clasificada","C65852022-Tipo de información Pública clasificada-Prestación de servicios: El CONTRATISTA se obliga con POSITIVA a la prestación de los servicios de salud para los asegurados y o afiliados a POSITIVA que accedan a los servicios habilitados del CONTRATISTA en calidad de asegurados a los ramos Administración de Riesgos Laborales ARL por causa exclusiva de un accidente de trabajo una enfermedad profesional) Accidentes Personales AP Educativo Generación Positiva AP Colectivos APCorto Plazo AP Individual y demás Ramos de Seguros autorizados a Positiva encontrándose excluidos del presente contrato los servicios y todas aquellas actividades procedimientos e intervenciones que no tengan por objeto contribuir al diagnóstico tratamiento o rehabilitación de la patología derivada del siniestro o los servicios considerados como experimentales cosméticos y suntuarios."]
["VICEPRESIDENCIA TÉCNICA","Gerencia Médica","NO","C65882022",85100000,"Prestación de servicios: El CONTRATISTA se obliga con POSITIVA a la prestación de los servicios de salud para los asegurados y o afiliados a POSITIVA que accedan a los servicios habilitados del CONTRATISTA en calidad de asegurados a los ramos Administración de Riesgos Laborales ARL por causa exclusiva de un accidente de trabajo una enfermedad profesional) Accidentes Personales AP Educativo Generación Positiva AP Colectivos APCorto Plazo AP Individual y demás Ramos de Seguros autorizados a Positiva encontrándose excluidos del presente contrato los servicios y todas aquellas actividades procedimientos e intervenciones que no tengan por objeto contribuir al diagnóstico tratamiento o rehabilitación de la patología derivada del siniestro o los servicios considerados como experimentales cosméticos y suntuarios.","2022-08-24",8,"2024-08-24",24.366666666666667,"Invitación directa","CargoAReserva",0,0,"NO",null,"Gerencia de Abastecimiento Estratégico\ncontratacion@positiva.gov.co\nPBX: (1)6502200 Ext: 10641","SI","SI","NO","SI","Pública clasificada","C65882022-Tipo de información Pública clasificada-Prestación de servicios: El CONTRATISTA se obliga con POSITIVA a la prestación de los servicios de salud para los asegurados y o afiliados a POSITIVA que accedan a los servicios habilitados del CONTRATISTA en calidad de asegurados a los ramos Administración de Riesgos Laborales ARL por causa exclusiva de un accidente de trabajo una enfermedad profesional) Accidentes Personales AP Educativo Generación Positiva AP Colectivos APCorto Plazo AP Individual y demás Ramos de Seguros autorizados a Positiva encontrándose excluidos del presente contrato los servicios y todas aquellas actividades procedimientos e intervenciones que no tengan por objeto contribuir al diagnóstico tratamiento o rehabilitación de la patología derivada del siniestro o los servicios considerados como experimentales cosméticos y suntuarios."]
["VICEPRESIDENCIA TÉCNICA","Gerencia Médica","NO","C65892022",85100000,"Prestación de servicios: El CONTRATISTA se obliga con POSITIVA a la prestación de los servicios de salud para los asegurados y o afiliados a POSITIVA que accedan a los servicios habilitados del CONTRATISTA en calidad de asegurados a los ramos Administración de Riesgos Laborales ARL por causa exclusiva de un accidente de trabajo una enfermedad profesional) Accidentes Personales AP Educativo Generación Positiva AP Colectivos APCorto Plazo AP Individual y demás Ramos de Seguros autorizados a Positiva encontrándose excluidos del presente contrato los servicios y todas aquellas actividades procedimientos e intervenciones que no tengan por objeto contribuir al diagnóstico tratamiento o rehabilitación de la patología derivada del siniestro o los servicios considerados como experimentales cosméticos y suntuarios.","2022-11-16",11,"2024-11-16",24.366666666666667,"Invitación directa","CargoAReserva",0,0,"NO",null,"Gerencia de Abastecimiento Estratégico\ncontratacion@positiva.gov.co\nPBX: (1)6502200 Ext: 10641","SI","SI","NO","SI","Pública clasificada","C65892022-Tipo de información Pública clasificada-Prestación de servicios: El CONTRATISTA se obliga con POSITIVA a la prestación de los servicios de salud para los asegurados y o afiliados a POSITIVA que accedan a los servicios habilitados del CONTRATISTA en calidad de asegurados a los ramos Administración de Riesgos Laborales ARL por causa exclusiva de un accidente de trabajo una enfermedad profesional) Accidentes Personales AP Educativo Generación Positiva AP Colectivos APCorto Plazo AP Individual y demás Ramos de Seguros autorizados a Positiva encontrándose excluidos del presente contrato los servicios y todas aquellas actividades procedimientos e intervenciones que no tengan por objeto contribuir al diagnóstico tratamiento o rehabilitación de la patología derivada del siniestro o los servicios considerados como experimentales cosméticos y suntuarios."]
["VICEPRESIDENCIA TÉCNICA","Gerencia Médica","NO","C65902022",85100000,"Prestación de servicios: El CONTRATISTA se obliga con POSITIVA a la prestación de los servicios de salud para los asegurados y o afiliados a POSITIVA que accedan a los servicios habilitados del CONTRATISTA en calidad de asegurados a los ramos Administración de Riesgos Laborales ARL por causa exclusiva de un accidente de trabajo una enfermedad profesional) Accidentes Personales AP Educativo Generación Positiva AP Colectivos APCorto Plazo AP Individual y demás Ramos de Seguros autorizados a Positiva encontrándose excluidos del presente contrato los servicios y todas aquellas actividades procedimientos e intervenciones que no tengan por objeto contribuir al diagnóstico tratamiento o rehabilitación de la patología derivada del siniestro o los servicios considerados como experimentales cosméticos y suntuarios.","2022-11-16",11,"2024-11-16",24.366666666666667,"Invitación directa","CargoAReserva",0,0,"NO",null,"Gerencia de Abastecimiento Estratégico\ncontratacion@positiva.gov.co\nPBX: (1)6502200 Ext: 10641","SI","SI","NO","SI","Pública clasificada","C65902022-Tipo de información Pública clasificada-Prestación de servicios: El CONTRATISTA se obliga con POSITIVA a la prestación de los servicios de salud para los asegurados y o afiliados a POSITIVA que accedan a los servicios habilitados del CONTRATISTA en calidad de asegurados a los ramos Administración de Riesgos Laborales ARL por causa exclusiva de un accidente de trabajo una enfermedad profesional) Accidentes Personales AP Educativo Generación Positiva AP Colectivos APCorto Plazo AP Individual y demás Ramos de Seguros autorizados a Positiva encontrándose excluidos del presente contrato los servicios y todas aquellas actividades procedimientos e intervenciones que no tengan por objeto contribuir al diagnóstico tratamiento o rehabilitación de la patología derivada del siniestro o los servicios considerados como experimentales cosméticos y suntuarios."]
["VICEPRESIDENCIA TÉCNICA","Gerencia Médica","NO","C65912022",85100000,"Prestación de servicios: El CONTRATISTA se obliga con POSITIVA a la prestación de los servicios de salud para los asegurados y o afiliados a POSITIVA que accedan a los servicios habilitados del CONTRATISTA en calidad de asegurados a los ramos Administración de Riesgos Laborales ARL por causa exclusiva de un accidente de trabajo una enfermedad profesional) Accidentes Personales AP Educativo Generación Positiva AP Colectivos APCorto Plazo AP Individual y demás Ramos de Seguros autorizados a Positiva encontrándose excluidos del presente contrato los servicios y todas aquellas actividades procedimientos e intervenciones que no tengan por objeto contribuir al diagnóstico tratamiento o rehabilitación de la patología derivada del siniestro o los servicios considerados como experimentales cosméticos y suntuarios.","2022-12-06",12,"2024-12-06",24.366666666666667,"Invitación directa","CargoAReserva",0,0,"NO",null,"Gerencia de Abastecimiento Estratégico\ncontratacion@positiva.gov.co\nPBX: (1)6502200 Ext: 10641","SI","SI","NO","SI","Pública clasificada","C65912022-Tipo de información Pública clasificada-Prestación de servicios: El CONTRATISTA se obliga con POSITIVA a la prestación de los servicios de salud para los asegurados y o afiliados a POSITIVA que accedan a los servicios habilitados del CONTRATISTA en calidad de asegurados a los ramos Administración de Riesgos Laborales ARL por causa exclusiva de un accidente de trabajo una enfermedad profesional) Accidentes Personales AP Educativo Generación Positiva AP Colectivos APCorto Plazo AP Individual y demás Ramos de Seguros autorizados a Positiva encontrándose excluidos del presente contrato los servicios y todas aquellas actividades procedimientos e intervenciones que no tengan por objeto contribuir al diagnóstico tratamiento o rehabilitación de la patología derivada del siniestro o los servicios considerados como experimentales cosméticos y suntuarios."]
["VICEPRESIDENCIA TÉCNICA","Gerencia Médica","NO","C65922022",85100000,"Prestación de servicios: El CONTRATISTA se obliga con POSITIVA a la prestación de los servicios de salud para los asegurados y o afiliados a POSITIVA que accedan a los servicios habilitados del CONTRATISTA en calidad de asegurados a los ramos Administración de Riesgos Laborales ARL por causa exclusiva de un accidente de trabajo una enfermedad profesional) Accidentes Personales AP Educativo Generación Positiva AP Colectivos APCorto Plazo AP Individual y demás Ramos de Seguros autorizados a Positiva encontrándose excluidos del presente contrato los servicios y todas aquellas actividades procedimientos e intervenciones que no tengan por objeto contribuir al diagnóstico tratamiento o rehabilitación de la patología derivada del siniestro o los servicios considerados como experimentales cosméticos y suntuarios.","2022-12-07",12,"2024-12-07",24.366666666666667,"Invitación directa","CargoAReserva",0,0,"NO",null,"Gerencia de Abastecimiento Estratégico\ncontratacion@positiva.gov.co\nPBX: (1)6502200 Ext: 10641","SI","SI","NO","SI","Pública clasificada","C65922022-Tipo de información Pública clasificada-Prestación de servicios: El CONTRATISTA se obliga con POSITIVA a la prestación de los servicios de salud para los asegurados y o afiliados a POSITIVA que accedan a los servicios habilitados del CONTRATISTA en calidad de asegurados a los ramos Administración de Riesgos Laborales ARL por causa exclusiva de un accidente de trabajo una enfermedad profesional) Accidentes Personales AP Educativo Generación Positiva AP Colectivos APCorto Plazo AP Individual y demás Ramos de Seguros autorizados a Positiva encontrándose excluidos del presente contrato los servicios y todas aquellas actividades procedimientos e intervenciones que no tengan por objeto contribuir al diagnóstico tratamiento o rehabilitación de la patología derivada del siniestro o los servicios considerados como experimentales cosméticos y suntuarios."]
["VICEPRESIDENCIA TÉCNICA","Gerencia Médica","NO","C65932022",85100000,"Prestación de servicios: El CONTRATISTA se obliga con POSITIVA a la prestación de los servicios de salud para los asegurados y o afiliados a POSITIVA que accedan a los servicios habilitados del CONTRATISTA en calidad de asegurados a los ramos Administración de Riesgos Laborales ARL por causa exclusiva de un accidente de trabajo una enfermedad profesional) Accidentes Personales AP Educativo Generación Positiva AP Colectivos APCorto Plazo AP Individual y demás Ramos de Seguros autorizados a Positiva encontrándose excluidos del presente contrato los servicios y todas aquellas actividades procedimientos e intervenciones que no tengan por objeto contribuir al diagnóstico tratamiento o rehabilitación de la patología derivada del siniestro o los servicios considerados como experimentales cosméticos y suntuarios.","2022-12-20",12,"2024-12-20",24.366666666666667,"Invitación directa","CargoAReserva",0,0,"NO",null,"Gerencia de Abastecimiento Estratégico\ncontratacion@positiva.gov.co\nPBX: (1)6502200 Ext: 10641","SI","SI","NO","SI","Pública clasificada","C65932022-Tipo de información Pública clasificada-Prestación de servicios: El CONTRATISTA se obliga con POSITIVA a la prestación de los servicios de salud para los asegurados y o afiliados a POSITIVA que accedan a los servicios habilitados del CONTRATISTA en calidad de asegurados a los ramos Administración de Riesgos Laborales ARL por causa exclusiva de un accidente de trabajo una enfermedad profesional) Accidentes Personales AP Educativo Generación Positiva AP Colectivos APCorto Plazo AP Individual y demás Ramos de Seguros autorizados a Positiva encontrándose excluidos del presente contrato los servicios y todas aquellas actividades procedimientos e intervenciones que no tengan por objeto contribuir al diagnóstico tratamiento o rehabilitación de la patología derivada del siniestro o los servicios considerados como experimentales cosméticos y suntuarios."]
["VICEPRESIDENCIA TÉCNICA","Gerencia Médica","NO","C65942022",85100000,"Prestación de servicios: El CONTRATISTA se obliga con POSITIVA a la prestación de los servicios de salud para los asegurados y o afiliados a POSITIVA que accedan a los servicios habilitados del CONTRATISTA en calidad de asegurados a los ramos Administración de Riesgos Laborales ARL por causa exclusiva de un accidente de trabajo una enfermedad profesional) Accidentes Personales AP Educativo Generación Positiva AP Colectivos APCorto Plazo AP Individual y demás Ramos de Seguros autorizados a Positiva encontrándose excluidos del presente contrato los servicios y todas aquellas actividades procedimientos e intervenciones que no tengan por objeto contribuir al diagnóstico tratamiento o rehabilitación de la patología derivada del siniestro o los servicios considerados como experimentales cosméticos y suntuarios.","2022-12-29",12,"2024-12-29",24.366666666666667,"Invitación directa","CargoAReserva",0,0,"NO",null,"Gerencia de Abastecimiento Estratégico\ncontratacion@positiva.gov.co\nPBX: (1)6502200 Ext: 10641","SI","SI","NO","SI","Pública clasificada","C65942022-Tipo de información Pública clasificada-Prestación de servicios: El CONTRATISTA se obliga con POSITIVA a la prestación de los servicios de salud para los asegurados y o afiliados a POSITIVA que accedan a los servicios habilitados del CONTRATISTA en calidad de asegurados a los ramos Administración de Riesgos Laborales ARL por causa exclusiva de un accidente de trabajo una enfermedad profesional) Accidentes Personales AP Educativo Generación Positiva AP Colectivos APCorto Plazo AP Individual y demás Ramos de Seguros autorizados a Positiva encontrándose excluidos del presente contrato los servicios y todas aquellas actividades procedimientos e intervenciones que no tengan por objeto contribuir al diagnóstico tratamiento o rehabilitación de la patología derivada del siniestro o los servicios considerados como experimentales cosméticos y suntuarios."]
["VICEPRESIDENCIA TÉCNICA","Gerencia Médica","NO","C65952022",85100000,"Prestación de servicios: El CONTRATISTA se obliga con POSITIVA a la prestación de los servicios de salud para los asegurados y o afiliados a POSITIVA que accedan a los servicios habilitados del CONTRATISTA en calidad de asegurados a los ramos Administración de Riesgos Laborales ARL por causa exclusiva de un accidente de trabajo una enfermedad profesional) Accidentes Personales AP Educativo Generación Positiva AP Colectivos APCorto Plazo AP Individual y demás Ramos de Seguros autorizados a Positiva encontrándose excluidos del presente contrato los servicios y todas aquellas actividades procedimientos e intervenciones que no tengan por objeto contribuir al diagnóstico tratamiento o rehabilitación de la patología derivada del siniestro o los servicios considerados como experimentales cosméticos y suntuarios.","2022-10-01",10,"2024-10-30",25.333333333333332,"Invitación directa","CargoAReserva",0,0,"NO",null,"Gerencia de Abastecimiento Estratégico\ncontratacion@positiva.gov.co\nPBX: (1)6502200 Ext: 10641","SI","SI","NO","SI","Pública clasificada","C65952022-Tipo de información Pública clasificada-Prestación de servicios: El CONTRATISTA se obliga con POSITIVA a la prestación de los servicios de salud para los asegurados y o afiliados a POSITIVA que accedan a los servicios habilitados del CONTRATISTA en calidad de asegurados a los ramos Administración de Riesgos Laborales ARL por causa exclusiva de un accidente de trabajo una enfermedad profesional) Accidentes Personales AP Educativo Generación Positiva AP Colectivos APCorto Plazo AP Individual y demás Ramos de Seguros autorizados a Positiva encontrándose excluidos del presente contrato los servicios y todas aquellas actividades procedimientos e intervenciones que no tengan por objeto contribuir al diagnóstico tratamiento o rehabilitación de la patología derivada del siniestro o los servicios considerados como experimentales cosméticos y suntuarios."]
["VICEPRESIDENCIA TÉCNICA","Gerencia Médica","NO","C65962022",85100000,"Prestación de servicios: El CONTRATISTA se obliga con POSITIVA a la prestación de los servicios de salud para los asegurados y o afiliados a POSITIVA que accedan a los servicios habilitados del CONTRATISTA en calidad de asegurados a los ramos Administración de Riesgos Laborales ARL por causa exclusiva de un accidente de trabajo una enfermedad profesional) Accidentes Personales AP Educativo Generación Positiva AP Colectivos APCorto Plazo AP Individual y demás Ramos de Seguros autorizados a Positiva encontrándose excluidos del presente contrato los servicios y todas aquellas actividades procedimientos e intervenciones que no tengan por objeto contribuir al diagnóstico tratamiento o rehabilitación de la patología derivada del siniestro o los servicios considerados como experimentales cosméticos y suntuarios.","2022-07-15",7,"2024-07-15",24.366666666666667,"Invitación directa","CargoAReserva",0,0,"NO",null,"Gerencia de Abastecimiento Estratégico\ncontratacion@positiva.gov.co\nPBX: (1)6502200 Ext: 10641","SI","SI","NO","SI","Pública clasificada","C65962022-Tipo de información Pública clasificada-Prestación de servicios: El CONTRATISTA se obliga con POSITIVA a la prestación de los servicios de salud para los asegurados y o afiliados a POSITIVA que accedan a los servicios habilitados del CONTRATISTA en calidad de asegurados a los ramos Administración de Riesgos Laborales ARL por causa exclusiva de un accidente de trabajo una enfermedad profesional) Accidentes Personales AP Educativo Generación Positiva AP Colectivos APCorto Plazo AP Individual y demás Ramos de Seguros autorizados a Positiva encontrándose excluidos del presente contrato los servicios y todas aquellas actividades procedimientos e intervenciones que no tengan por objeto contribuir al diagnóstico tratamiento o rehabilitación de la patología derivada del siniestro o los servicios considerados como experimentales cosméticos y suntuarios."]
["VICEPRESIDENCIA TÉCNICA","Gerencia Médica","NO","C65972022",85100000,"Prestación de servicios: El CONTRATISTA se obliga con POSITIVA a la prestación de los servicios de salud para los asegurados y o afiliados a POSITIVA que accedan a los servicios habilitados del CONTRATISTA en calidad de asegurados a los ramos Administración de Riesgos Laborales ARL por causa exclusiva de un accidente de trabajo una enfermedad profesional) Accidentes Personales AP Educativo Generación Positiva AP Colectivos APCorto Plazo AP Individual y demás Ramos de Seguros autorizados a Positiva encontrándose excluidos del presente contrato los servicios y todas aquellas actividades procedimientos e intervenciones que no tengan por objeto contribuir al diagnóstico tratamiento o rehabilitación de la patología derivada del siniestro o los servicios considerados como experimentales cosméticos y suntuarios.","2022-08-16",8,"2024-08-16",24.366666666666667,"Invitación directa","CargoAReserva",0,0,"NO",null,"Gerencia de Abastecimiento Estratégico\ncontratacion@positiva.gov.co\nPBX: (1)6502200 Ext: 10641","SI","SI","NO","SI","Pública clasificada","C65972022-Tipo de información Pública clasificada-Prestación de servicios: El CONTRATISTA se obliga con POSITIVA a la prestación de los servicios de salud para los asegurados y o afiliados a POSITIVA que accedan a los servicios habilitados del CONTRATISTA en calidad de asegurados a los ramos Administración de Riesgos Laborales ARL por causa exclusiva de un accidente de trabajo una enfermedad profesional) Accidentes Personales AP Educativo Generación Positiva AP Colectivos APCorto Plazo AP Individual y demás Ramos de Seguros autorizados a Positiva encontrándose excluidos del presente contrato los servicios y todas aquellas actividades procedimientos e intervenciones que no tengan por objeto contribuir al diagnóstico tratamiento o rehabilitación de la patología derivada del siniestro o los servicios considerados como experimentales cosméticos y suntuarios."]
["VICEPRESIDENCIA TÉCNICA","Gerencia Médica","NO","C65982022",85100000,"Prestación de servicios: El CONTRATISTA se obliga con POSITIVA a la prestación de los servicios de salud para los asegurados y o afiliados a POSITIVA que accedan a los servicios habilitados del CONTRATISTA en calidad de asegurados a los ramos Administración de Riesgos Laborales ARL por causa exclusiva de un accidente de trabajo una enfermedad profesional) Accidentes Personales AP Educativo Generación Positiva AP Colectivos APCorto Plazo AP Individual y demás Ramos de Seguros autorizados a Positiva encontrándose excluidos del presente contrato los servicios y todas aquellas actividades procedimientos e intervenciones que no tengan por objeto contribuir al diagnóstico tratamiento o rehabilitación de la patología derivada del siniestro o los servicios considerados como experimentales cosméticos y suntuarios.","2022-09-25",9,"2024-09-25",24.366666666666667,"Invitación directa","CargoAReserva",0,0,"NO",null,"Gerencia de Abastecimiento Estratégico\ncontratacion@positiva.gov.co\nPBX: (1)6502200 Ext: 10641","SI","SI","NO","SI","Pública clasificada","C65982022-Tipo de información Pública clasificada-Prestación de servicios: El CONTRATISTA se obliga con POSITIVA a la prestación de los servicios de salud para los asegurados y o afiliados a POSITIVA que accedan a los servicios habilitados del CONTRATISTA en calidad de asegurados a los ramos Administración de Riesgos Laborales ARL por causa exclusiva de un accidente de trabajo una enfermedad profesional) Accidentes Personales AP Educativo Generación Positiva AP Colectivos APCorto Plazo AP Individual y demás Ramos de Seguros autorizados a Positiva encontrándose excluidos del presente contrato los servicios y todas aquellas actividades procedimientos e intervenciones que no tengan por objeto contribuir al diagnóstico tratamiento o rehabilitación de la patología derivada del siniestro o los servicios considerados como experimentales cosméticos y suntuarios."]
["VICEPRESIDENCIA TÉCNICA","Gerencia Médica","NO","C65992022",85100000,"Prestación de servicios: El CONTRATISTA se obliga con POSITIVA a la prestación de los servicios de salud para los asegurados y o afiliados a POSITIVA que accedan a los servicios habilitados del CONTRATISTA en calidad de asegurados a los ramos Administración de Riesgos Laborales ARL por causa exclusiva de un accidente de trabajo una enfermedad profesional) Accidentes Personales AP Educativo Generación Positiva AP Colectivos APCorto Plazo AP Individual y demás Ramos de Seguros autorizados a Positiva encontrándose excluidos del presente contrato los servicios y todas aquellas actividades procedimientos e intervenciones que no tengan por objeto contribuir al diagnóstico tratamiento o rehabilitación de la patología derivada del siniestro o los servicios considerados como experimentales cosméticos y suntuarios.","2022-08-15",8,"2024-08-15",24.366666666666667,"Invitación directa","CargoAReserva",0,0,"NO",null,"Gerencia de Abastecimiento Estratégico\ncontratacion@positiva.gov.co\nPBX: (1)6502200 Ext: 10641","SI","SI","NO","SI","Pública clasificada","C65992022-Tipo de información Pública clasificada-Prestación de servicios: El CONTRATISTA se obliga con POSITIVA a la prestación de los servicios de salud para los asegurados y o afiliados a POSITIVA que accedan a los servicios habilitados del CONTRATISTA en calidad de asegurados a los ramos Administración de Riesgos Laborales ARL por causa exclusiva de un accidente de trabajo una enfermedad profesional) Accidentes Personales AP Educativo Generación Positiva AP Colectivos APCorto Plazo AP Individual y demás Ramos de Seguros autorizados a Positiva encontrándose excluidos del presente contrato los servicios y todas aquellas actividades procedimientos e intervenciones que no tengan por objeto contribuir al diagnóstico tratamiento o rehabilitación de la patología derivada del siniestro o los servicios considerados como experimentales cosméticos y suntuarios."]
["VICEPRESIDENCIA TÉCNICA","Gerencia Médica","NO","C66002022",85100000,"Prestación de servicios: El CONTRATISTA se obliga con POSITIVA a la prestación de los servicios de salud para los asegurados y o afiliados a POSITIVA que accedan a los servicios habilitados del CONTRATISTA en calidad de asegurados a los ramos Administración de Riesgos Laborales ARL por causa exclusiva de un accidente de trabajo una enfermedad profesional) Accidentes Personales AP Educativo Generación Positiva AP Colectivos APCorto Plazo AP Individual y demás Ramos de Seguros autorizados a Positiva encontrándose excluidos del presente contrato los servicios y todas aquellas actividades procedimientos e intervenciones que no tengan por objeto contribuir al diagnóstico tratamiento o rehabilitación de la patología derivada del siniestro o los servicios considerados como experimentales cosméticos y suntuarios.","2022-08-16",8,"2024-08-16",24.366666666666667,"Invitación directa","CargoAReserva",0,0,"NO",null,"Gerencia de Abastecimiento Estratégico\ncontratacion@positiva.gov.co\nPBX: (1)6502200 Ext: 10641","SI","SI","NO","SI","Pública clasificada","C66002022-Tipo de información Pública clasificada-Prestación de servicios: El CONTRATISTA se obliga con POSITIVA a la prestación de los servicios de salud para los asegurados y o afiliados a POSITIVA que accedan a los servicios habilitados del CONTRATISTA en calidad de asegurados a los ramos Administración de Riesgos Laborales ARL por causa exclusiva de un accidente de trabajo una enfermedad profesional) Accidentes Personales AP Educativo Generación Positiva AP Colectivos APCorto Plazo AP Individual y demás Ramos de Seguros autorizados a Positiva encontrándose excluidos del presente contrato los servicios y todas aquellas actividades procedimientos e intervenciones que no tengan por objeto contribuir al diagnóstico tratamiento o rehabilitación de la patología derivada del siniestro o los servicios considerados como experimentales cosméticos y suntuarios."]
["VICEPRESIDENCIA TÉCNICA","Gerencia Médica","NO","C66012022",85100000,"Prestación de servicios: El CONTRATISTA se obliga con POSITIVA a la prestación de los servicios de salud para los asegurados y o afiliados a POSITIVA que accedan a los servicios habilitados del CONTRATISTA en calidad de asegurados a los ramos Administración de Riesgos Laborales ARL por causa exclusiva de un accidente de trabajo una enfermedad profesional) Accidentes Personales AP Educativo Generación Positiva AP Colectivos APCorto Plazo AP Individual y demás Ramos de Seguros autorizados a Positiva encontrándose excluidos del presente contrato los servicios y todas aquellas actividades procedimientos e intervenciones que no tengan por objeto contribuir al diagnóstico tratamiento o rehabilitación de la patología derivada del siniestro o los servicios considerados como experimentales cosméticos y suntuarios.","2022-03-01",3,"2024-03-01",24.366666666666667,"Invitación directa","CargoAReserva",0,0,"NO",null,"Gerencia de Abastecimiento Estratégico\ncontratacion@positiva.gov.co\nPBX: (1)6502200 Ext: 10641","SI","SI","NO","SI","Pública clasificada","C66012022-Tipo de información Pública clasificada-Prestación de servicios: El CONTRATISTA se obliga con POSITIVA a la prestación de los servicios de salud para los asegurados y o afiliados a POSITIVA que accedan a los servicios habilitados del CONTRATISTA en calidad de asegurados a los ramos Administración de Riesgos Laborales ARL por causa exclusiva de un accidente de trabajo una enfermedad profesional) Accidentes Personales AP Educativo Generación Positiva AP Colectivos APCorto Plazo AP Individual y demás Ramos de Seguros autorizados a Positiva encontrándose excluidos del presente contrato los servicios y todas aquellas actividades procedimientos e intervenciones que no tengan por objeto contribuir al diagnóstico tratamiento o rehabilitación de la patología derivada del siniestro o los servicios considerados como experimentales cosméticos y suntuarios."]
["VICEPRESIDENCIA TÉCNICA","Gerencia Médica","NO","C66022022",85100000,"Prestación de servicios: El CONTRATISTA se obliga con POSITIVA a la prestación de los servicios de salud para los asegurados y o afiliados a POSITIVA que accedan a los servicios habilitados del CONTRATISTA en calidad de asegurados a los ramos Administración de Riesgos Laborales ARL por causa exclusiva de un accidente de trabajo una enfermedad profesional) Accidentes Personales AP Educativo Generación Positiva AP Colectivos APCorto Plazo AP Individual y demás Ramos de Seguros autorizados a Positiva encontrándose excluidos del presente contrato los servicios y todas aquellas actividades procedimientos e intervenciones que no tengan por objeto contribuir al diagnóstico tratamiento o rehabilitación de la patología derivada del siniestro o los servicios considerados como experimentales cosméticos y suntuarios.","2022-03-11",3,"2024-03-11",24.366666666666667,"Invitación directa","CargoAReserva",0,0,"NO",null,"Gerencia de Abastecimiento Estratégico\ncontratacion@positiva.gov.co\nPBX: (1)6502200 Ext: 10641","SI","SI","NO","SI","Pública clasificada","C66022022-Tipo de información Pública clasificada-Prestación de servicios: El CONTRATISTA se obliga con POSITIVA a la prestación de los servicios de salud para los asegurados y o afiliados a POSITIVA que accedan a los servicios habilitados del CONTRATISTA en calidad de asegurados a los ramos Administración de Riesgos Laborales ARL por causa exclusiva de un accidente de trabajo una enfermedad profesional) Accidentes Personales AP Educativo Generación Positiva AP Colectivos APCorto Plazo AP Individual y demás Ramos de Seguros autorizados a Positiva encontrándose excluidos del presente contrato los servicios y todas aquellas actividades procedimientos e intervenciones que no tengan por objeto contribuir al diagnóstico tratamiento o rehabilitación de la patología derivada del siniestro o los servicios considerados como experimentales cosméticos y suntuarios."]
["VICEPRESIDENCIA TÉCNICA","Gerencia Médica","NO","C66032022",85100000,"Prestación de servicios: El CONTRATISTA se obliga con POSITIVA a la prestación de los servicios de salud para los asegurados y o afiliados a POSITIVA que accedan a los servicios habilitados del CONTRATISTA en calidad de asegurados a los ramos Administración de Riesgos Laborales ARL por causa exclusiva de un accidente de trabajo una enfermedad profesional) Accidentes Personales AP Educativo Generación Positiva AP Colectivos APCorto Plazo AP Individual y demás Ramos de Seguros autorizados a Positiva encontrándose excluidos del presente contrato los servicios y todas aquellas actividades procedimientos e intervenciones que no tengan por objeto contribuir al diagnóstico tratamiento o rehabilitación de la patología derivada del siniestro o los servicios considerados como experimentales cosméticos y suntuarios.","2022-04-01",4,"2024-04-01",24.366666666666667,"Invitación directa","CargoAReserva",0,0,"NO",null,"Gerencia de Abastecimiento Estratégico\ncontratacion@positiva.gov.co\nPBX: (1)6502200 Ext: 10641","SI","SI","NO","SI","Pública clasificada","C66032022-Tipo de información Pública clasificada-Prestación de servicios: El CONTRATISTA se obliga con POSITIVA a la prestación de los servicios de salud para los asegurados y o afiliados a POSITIVA que accedan a los servicios habilitados del CONTRATISTA en calidad de asegurados a los ramos Administración de Riesgos Laborales ARL por causa exclusiva de un accidente de trabajo una enfermedad profesional) Accidentes Personales AP Educativo Generación Positiva AP Colectivos APCorto Plazo AP Individual y demás Ramos de Seguros autorizados a Positiva encontrándose excluidos del presente contrato los servicios y todas aquellas actividades procedimientos e intervenciones que no tengan por objeto contribuir al diagnóstico tratamiento o rehabilitación de la patología derivada del siniestro o los servicios considerados como experimentales cosméticos y suntuarios."]
["VICEPRESIDENCIA TÉCNICA","Gerencia Médica","NO","C66042022",85100000,"Prestación de servicios: El CONTRATISTA se obliga con POSITIVA a la prestación de los servicios de salud para los asegurados y o afiliados a POSITIVA que accedan a los servicios habilitados del CONTRATISTA en calidad de asegurados a los ramos Administración de Riesgos Laborales ARL por causa exclusiva de un accidente de trabajo una enfermedad profesional) Accidentes Personales AP Educativo Generación Positiva AP Colectivos APCorto Plazo AP Individual y demás Ramos de Seguros autorizados a Positiva encontrándose excluidos del presente contrato los servicios y todas aquellas actividades procedimientos e intervenciones que no tengan por objeto contribuir al diagnóstico tratamiento o rehabilitación de la patología derivada del siniestro o los servicios considerados como experimentales cosméticos y suntuarios.","2022-04-01",4,"2024-04-01",24.366666666666667,"Invitación directa","CargoAReserva",0,0,"NO",null,"Gerencia de Abastecimiento Estratégico\ncontratacion@positiva.gov.co\nPBX: (1)6502200 Ext: 10641","SI","SI","NO","SI","Pública clasificada","C66042022-Tipo de información Pública clasificada-Prestación de servicios: El CONTRATISTA se obliga con POSITIVA a la prestación de los servicios de salud para los asegurados y o afiliados a POSITIVA que accedan a los servicios habilitados del CONTRATISTA en calidad de asegurados a los ramos Administración de Riesgos Laborales ARL por causa exclusiva de un accidente de trabajo una enfermedad profesional) Accidentes Personales AP Educativo Generación Positiva AP Colectivos APCorto Plazo AP Individual y demás Ramos de Seguros autorizados a Positiva encontrándose excluidos del presente contrato los servicios y todas aquellas actividades procedimientos e intervenciones que no tengan por objeto contribuir al diagnóstico tratamiento o rehabilitación de la patología derivada del siniestro o los servicios considerados como experimentales cosméticos y suntuarios."]
["VICEPRESIDENCIA TÉCNICA","Gerencia Médica","NO","C66052022",85100000,"Prestación de servicios: El CONTRATISTA se obliga con POSITIVA a la prestación de los servicios de salud para los asegurados y o afiliados a POSITIVA que accedan a los servicios habilitados del CONTRATISTA en calidad de asegurados a los ramos Administración de Riesgos Laborales ARL por causa exclusiva de un accidente de trabajo una enfermedad profesional) Accidentes Personales AP Educativo Generación Positiva AP Colectivos APCorto Plazo AP Individual y demás Ramos de Seguros autorizados a Positiva encontrándose excluidos del presente contrato los servicios y todas aquellas actividades procedimientos e intervenciones que no tengan por objeto contribuir al diagnóstico tratamiento o rehabilitación de la patología derivada del siniestro o los servicios considerados como experimentales cosméticos y suntuarios.","2022-05-04",5,"2024-05-04",24.366666666666667,"Invitación directa","CargoAReserva",0,0,"NO",null,"Gerencia de Abastecimiento Estratégico\ncontratacion@positiva.gov.co\nPBX: (1)6502200 Ext: 10641","SI","SI","NO","SI","Pública clasificada","C66052022-Tipo de información Pública clasificada-Prestación de servicios: El CONTRATISTA se obliga con POSITIVA a la prestación de los servicios de salud para los asegurados y o afiliados a POSITIVA que accedan a los servicios habilitados del CONTRATISTA en calidad de asegurados a los ramos Administración de Riesgos Laborales ARL por causa exclusiva de un accidente de trabajo una enfermedad profesional) Accidentes Personales AP Educativo Generación Positiva AP Colectivos APCorto Plazo AP Individual y demás Ramos de Seguros autorizados a Positiva encontrándose excluidos del presente contrato los servicios y todas aquellas actividades procedimientos e intervenciones que no tengan por objeto contribuir al diagnóstico tratamiento o rehabilitación de la patología derivada del siniestro o los servicios considerados como experimentales cosméticos y suntuarios."]
["VICEPRESIDENCIA TÉCNICA","Gerencia Médica","NO","C66062022",85100000,"Prestación de servicios: El CONTRATISTA se obliga con POSITIVA a la prestación de los servicios de salud para los asegurados y o afiliados a POSITIVA que accedan a los servicios habilitados del CONTRATISTA en calidad de asegurados a los ramos Administración de Riesgos Laborales ARL por causa exclusiva de un accidente de trabajo una enfermedad profesional) Accidentes Personales AP Educativo Generación Positiva AP Colectivos APCorto Plazo AP Individual y demás Ramos de Seguros autorizados a Positiva encontrándose excluidos del presente contrato los servicios y todas aquellas actividades procedimientos e intervenciones que no tengan por objeto contribuir al diagnóstico tratamiento o rehabilitación de la patología derivada del siniestro o los servicios considerados como experimentales cosméticos y suntuarios.","2022-07-20",7,"2024-07-20",24.366666666666667,"Invitación directa","CargoAReserva",0,0,"NO",null,"Gerencia de Abastecimiento Estratégico\ncontratacion@positiva.gov.co\nPBX: (1)6502200 Ext: 10641","SI","SI","NO","SI","Pública clasificada","C66062022-Tipo de información Pública clasificada-Prestación de servicios: El CONTRATISTA se obliga con POSITIVA a la prestación de los servicios de salud para los asegurados y o afiliados a POSITIVA que accedan a los servicios habilitados del CONTRATISTA en calidad de asegurados a los ramos Administración de Riesgos Laborales ARL por causa exclusiva de un accidente de trabajo una enfermedad profesional) Accidentes Personales AP Educativo Generación Positiva AP Colectivos APCorto Plazo AP Individual y demás Ramos de Seguros autorizados a Positiva encontrándose excluidos del presente contrato los servicios y todas aquellas actividades procedimientos e intervenciones que no tengan por objeto contribuir al diagnóstico tratamiento o rehabilitación de la patología derivada del siniestro o los servicios considerados como experimentales cosméticos y suntuarios."]
["VICEPRESIDENCIA TÉCNICA","Gerencia Médica","NO","C66072022",85100000,"Prestación de servicios: El CONTRATISTA se obliga con POSITIVA a la prestación de los servicios de salud para los asegurados y o afiliados a POSITIVA que accedan a los servicios habilitados del CONTRATISTA en calidad de asegurados a los ramos Administración de Riesgos Laborales ARL por causa exclusiva de un accidente de trabajo una enfermedad profesional) Accidentes Personales AP Educativo Generación Positiva AP Colectivos APCorto Plazo AP Individual y demás Ramos de Seguros autorizados a Positiva encontrándose excluidos del presente contrato los servicios y todas aquellas actividades procedimientos e intervenciones que no tengan por objeto contribuir al diagnóstico tratamiento o rehabilitación de la patología derivada del siniestro o los servicios considerados como experimentales cosméticos y suntuarios.","2022-08-11",8,"2024-08-11",24.366666666666667,"Invitación directa","CargoAReserva",0,0,"NO",null,"Gerencia de Abastecimiento Estratégico\ncontratacion@positiva.gov.co\nPBX: (1)6502200 Ext: 10641","SI","SI","NO","SI","Pública clasificada","C66072022-Tipo de información Pública clasificada-Prestación de servicios: El CONTRATISTA se obliga con POSITIVA a la prestación de los servicios de salud para los asegurados y o afiliados a POSITIVA que accedan a los servicios habilitados del CONTRATISTA en calidad de asegurados a los ramos Administración de Riesgos Laborales ARL por causa exclusiva de un accidente de trabajo una enfermedad profesional) Accidentes Personales AP Educativo Generación Positiva AP Colectivos APCorto Plazo AP Individual y demás Ramos de Seguros autorizados a Positiva encontrándose excluidos del presente contrato los servicios y todas aquellas actividades procedimientos e intervenciones que no tengan por objeto contribuir al diagnóstico tratamiento o rehabilitación de la patología derivada del siniestro o los servicios considerados como experimentales cosméticos y suntuarios."]
["VICEPRESIDENCIA TÉCNICA","Gerencia Médica","NO","C66082022",85100000,"Prestación de servicios: El CONTRATISTA se obliga con POSITIVA a la prestación de los servicios de salud para los asegurados y o afiliados a POSITIVA que accedan a los servicios habilitados del CONTRATISTA en calidad de asegurados a los ramos Administración de Riesgos Laborales ARL por causa exclusiva de un accidente de trabajo una enfermedad profesional) Accidentes Personales AP Educativo Generación Positiva AP Colectivos APCorto Plazo AP Individual y demás Ramos de Seguros autorizados a Positiva encontrándose excluidos del presente contrato los servicios y todas aquellas actividades procedimientos e intervenciones que no tengan por objeto contribuir al diagnóstico tratamiento o rehabilitación de la patología derivada del siniestro o los servicios considerados como experimentales cosméticos y suntuarios.","2022-12-19",12,"2024-12-19",24.366666666666667,"Invitación directa","CargoAReserva",0,0,"NO",null,"Gerencia de Abastecimiento Estratégico\ncontratacion@positiva.gov.co\nPBX: (1)6502200 Ext: 10641","SI","SI","NO","SI","Pública clasificada","C66082022-Tipo de información Pública clasificada-Prestación de servicios: El CONTRATISTA se obliga con POSITIVA a la prestación de los servicios de salud para los asegurados y o afiliados a POSITIVA que accedan a los servicios habilitados del CONTRATISTA en calidad de asegurados a los ramos Administración de Riesgos Laborales ARL por causa exclusiva de un accidente de trabajo una enfermedad profesional) Accidentes Personales AP Educativo Generación Positiva AP Colectivos APCorto Plazo AP Individual y demás Ramos de Seguros autorizados a Positiva encontrándose excluidos del presente contrato los servicios y todas aquellas actividades procedimientos e intervenciones que no tengan por objeto contribuir al diagnóstico tratamiento o rehabilitación de la patología derivada del siniestro o los servicios considerados como experimentales cosméticos y suntuarios."]
["VICEPRESIDENCIA TÉCNICA","Gerencia Médica","NO","C66092022",85100000,"Prestación de servicios: El CONTRATISTA se obliga con POSITIVA a la prestación de los servicios de salud para los asegurados y o afiliados a POSITIVA que accedan a los servicios habilitados del CONTRATISTA en calidad de asegurados a los ramos Administración de Riesgos Laborales ARL por causa exclusiva de un accidente de trabajo una enfermedad profesional) Accidentes Personales AP Educativo Generación Positiva AP Colectivos APCorto Plazo AP Individual y demás Ramos de Seguros autorizados a Positiva encontrándose excluidos del presente contrato los servicios y todas aquellas actividades procedimientos e intervenciones que no tengan por objeto contribuir al diagnóstico tratamiento o rehabilitación de la patología derivada del siniestro o los servicios considerados como experimentales cosméticos y suntuarios.","2022-04-06",4,"2024-04-06",24.366666666666667,"Invitación directa","CargoAReserva",0,0,"NO",null,"Gerencia de Abastecimiento Estratégico\ncontratacion@positiva.gov.co\nPBX: (1)6502200 Ext: 10641","SI","SI","NO","SI","Pública clasificada","C66092022-Tipo de información Pública clasificada-Prestación de servicios: El CONTRATISTA se obliga con POSITIVA a la prestación de los servicios de salud para los asegurados y o afiliados a POSITIVA que accedan a los servicios habilitados del CONTRATISTA en calidad de asegurados a los ramos Administración de Riesgos Laborales ARL por causa exclusiva de un accidente de trabajo una enfermedad profesional) Accidentes Personales AP Educativo Generación Positiva AP Colectivos APCorto Plazo AP Individual y demás Ramos de Seguros autorizados a Positiva encontrándose excluidos del presente contrato los servicios y todas aquellas actividades procedimientos e intervenciones que no tengan por objeto contribuir al diagnóstico tratamiento o rehabilitación de la patología derivada del siniestro o los servicios considerados como experimentales cosméticos y suntuarios."]
["VICEPRESIDENCIA TÉCNICA","Gerencia Médica","NO","C66102022",85100000,"Prestación de servicios: El CONTRATISTA se obliga con POSITIVA a la prestación de los servicios de salud para los asegurados y o afiliados a POSITIVA que accedan a los servicios habilitados del CONTRATISTA en calidad de asegurados a los ramos Administración de Riesgos Laborales ARL por causa exclusiva de un accidente de trabajo una enfermedad profesional) Accidentes Personales AP Educativo Generación Positiva AP Colectivos APCorto Plazo AP Individual y demás Ramos de Seguros autorizados a Positiva encontrándose excluidos del presente contrato los servicios y todas aquellas actividades procedimientos e intervenciones que no tengan por objeto contribuir al diagnóstico tratamiento o rehabilitación de la patología derivada del siniestro o los servicios considerados como experimentales cosméticos y suntuarios.","2022-08-24",8,"2024-08-24",24.366666666666667,"Invitación directa","CargoAReserva",0,0,"NO",null,"Gerencia de Abastecimiento Estratégico\ncontratacion@positiva.gov.co\nPBX: (1)6502200 Ext: 10641","SI","SI","NO","SI","Pública clasificada","C66102022-Tipo de información Pública clasificada-Prestación de servicios: El CONTRATISTA se obliga con POSITIVA a la prestación de los servicios de salud para los asegurados y o afiliados a POSITIVA que accedan a los servicios habilitados del CONTRATISTA en calidad de asegurados a los ramos Administración de Riesgos Laborales ARL por causa exclusiva de un accidente de trabajo una enfermedad profesional) Accidentes Personales AP Educativo Generación Positiva AP Colectivos APCorto Plazo AP Individual y demás Ramos de Seguros autorizados a Positiva encontrándose excluidos del presente contrato los servicios y todas aquellas actividades procedimientos e intervenciones que no tengan por objeto contribuir al diagnóstico tratamiento o rehabilitación de la patología derivada del siniestro o los servicios considerados como experimentales cosméticos y suntuarios."]
["VICEPRESIDENCIA TÉCNICA","Gerencia Médica","NO","C66112022",85100000,"Prestación de servicios: El CONTRATISTA se obliga con POSITIVA a la prestación de los servicios de salud para los asegurados y o afiliados a POSITIVA que accedan a los servicios habilitados del CONTRATISTA en calidad de asegurados a los ramos Administración de Riesgos Laborales ARL por causa exclusiva de un accidente de trabajo una enfermedad profesional) Accidentes Personales AP Educativo Generación Positiva AP Colectivos APCorto Plazo AP Individual y demás Ramos de Seguros autorizados a Positiva encontrándose excluidos del presente contrato los servicios y todas aquellas actividades procedimientos e intervenciones que no tengan por objeto contribuir al diagnóstico tratamiento o rehabilitación de la patología derivada del siniestro o los servicios considerados como experimentales cosméticos y suntuarios.","2022-03-04",3,"2027-03-24",61.533333333333331,"Invitación directa","CargoAReserva",0,0,"NO",null,"Gerencia de Abastecimiento Estratégico\ncontratacion@positiva.gov.co\nPBX: (1)6502200 Ext: 10641","SI","SI","NO","SI",{"$f":"IF(U566=\"SI\",\"Pública clasificada\",\"Pública\")","v":"Pública clasificada"},{"$f":"CONCATENATE(D566,\"-\",\"Tipo de información\",\" \",V566,\"-\",F566)","v":"C66112022-Tipo de información Pública clasificada-Prestación de servicios: El CONTRATISTA se obliga con POSITIVA a la prestación de los servicios de salud para los asegurados y o afiliados a POSITIVA que accedan a los servicios habilitados del CONTRATISTA en calidad de asegurados a los ramos Administración de Riesgos Laborales ARL por causa exclusiva de un accidente de trabajo una enfermedad profesional) Accidentes Personales AP Educativo Generación Positiva AP Colectivos APCorto Plazo AP Individual y demás Ramos de Seguros autorizados a Positiva encontrándose excluidos del presente contrato los servicios y todas aquellas actividades procedimientos e intervenciones que no tengan por objeto contribuir al diagnóstico tratamiento o rehabilitación de la patología derivada del siniestro o los servicios considerados como experimentales cosméticos y suntuarios."}]
["VICEPRESIDENCIA TÉCNICA","Gerencia Médica","NO","C66122022",85100000,"Prestación de servicios: El CONTRATISTA se obliga con POSITIVA a la prestación de los servicios de salud para los asegurados y o afiliados a POSITIVA que accedan a los servicios habilitados del CONTRATISTA en calidad de asegurados a los ramos Administración de Riesgos Laborales ARL por causa exclusiva de un accidente de trabajo una enfermedad profesional) Accidentes Personales AP Educativo Generación Positiva AP Colectivos APCorto Plazo AP Individual y demás Ramos de Seguros autorizados a Positiva encontrándose excluidos del presente contrato los servicios y todas aquellas actividades procedimientos e intervenciones que no tengan por objeto contribuir al diagnóstico tratamiento o rehabilitación de la patología derivada del siniestro o los servicios considerados como experimentales cosméticos y suntuarios.","2022-03-15",3,"2024-03-15",24.366666666666667,"Invitación directa","CargoAReserva",0,0,"NO",null,"Gerencia de Abastecimiento Estratégico\ncontratacion@positiva.gov.co\nPBX: (1)6502200 Ext: 10641","SI","SI","NO","SI","Pública clasificada","C66122022-Tipo de información Pública clasificada-Prestación de servicios: El CONTRATISTA se obliga con POSITIVA a la prestación de los servicios de salud para los asegurados y o afiliados a POSITIVA que accedan a los servicios habilitados del CONTRATISTA en calidad de asegurados a los ramos Administración de Riesgos Laborales ARL por causa exclusiva de un accidente de trabajo una enfermedad profesional) Accidentes Personales AP Educativo Generación Positiva AP Colectivos APCorto Plazo AP Individual y demás Ramos de Seguros autorizados a Positiva encontrándose excluidos del presente contrato los servicios y todas aquellas actividades procedimientos e intervenciones que no tengan por objeto contribuir al diagnóstico tratamiento o rehabilitación de la patología derivada del siniestro o los servicios considerados como experimentales cosméticos y suntuarios."]
["VICEPRESIDENCIA TÉCNICA","Gerencia Médica","NO","C66132022",85100000,"Prestación de servicios: El CONTRATISTA se obliga con POSITIVA a la prestación de los servicios de salud para los asegurados y o afiliados a POSITIVA que accedan a los servicios habilitados del CONTRATISTA en calidad de asegurados a los ramos Administración de Riesgos Laborales ARL por causa exclusiva de un accidente de trabajo una enfermedad profesional) Accidentes Personales AP Educativo Generación Positiva AP Colectivos APCorto Plazo AP Individual y demás Ramos de Seguros autorizados a Positiva encontrándose excluidos del presente contrato los servicios y todas aquellas actividades procedimientos e intervenciones que no tengan por objeto contribuir al diagnóstico tratamiento o rehabilitación de la patología derivada del siniestro o los servicios considerados como experimentales cosméticos y suntuarios.","2022-04-21",4,"2024-04-21",24.366666666666667,"Invitación directa","CargoAReserva",0,0,"NO",null,"Gerencia de Abastecimiento Estratégico\ncontratacion@positiva.gov.co\nPBX: (1)6502200 Ext: 10641","SI","SI","NO","SI","Pública clasificada","C66132022-Tipo de información Pública clasificada-Prestación de servicios: El CONTRATISTA se obliga con POSITIVA a la prestación de los servicios de salud para los asegurados y o afiliados a POSITIVA que accedan a los servicios habilitados del CONTRATISTA en calidad de asegurados a los ramos Administración de Riesgos Laborales ARL por causa exclusiva de un accidente de trabajo una enfermedad profesional) Accidentes Personales AP Educativo Generación Positiva AP Colectivos APCorto Plazo AP Individual y demás Ramos de Seguros autorizados a Positiva encontrándose excluidos del presente contrato los servicios y todas aquellas actividades procedimientos e intervenciones que no tengan por objeto contribuir al diagnóstico tratamiento o rehabilitación de la patología derivada del siniestro o los servicios considerados como experimentales cosméticos y suntuarios."]
["VICEPRESIDENCIA TÉCNICA","Gerencia Médica","NO","C66162022",85100000,"Prestación de servicios: El CONTRATISTA se obliga con POSITIVA a la prestación de los servicios de salud para los asegurados y o afiliados a POSITIVA que accedan a los servicios habilitados del CONTRATISTA en calidad de asegurados a los ramos Administración de Riesgos Laborales ARL por causa exclusiva de un accidente de trabajo una enfermedad profesional) Accidentes Personales AP Educativo Generación Positiva AP Colectivos APCorto Plazo AP Individual y demás Ramos de Seguros autorizados a Positiva encontrándose excluidos del presente contrato los servicios y todas aquellas actividades procedimientos e intervenciones que no tengan por objeto contribuir al diagnóstico tratamiento o rehabilitación de la patología derivada del siniestro o los servicios considerados como experimentales cosméticos y suntuarios.","2022-09-20",9,"2024-09-20",24.366666666666667,"Invitación directa","CargoAReserva",0,0,"NO",null,"Gerencia de Abastecimiento Estratégico\ncontratacion@positiva.gov.co\nPBX: (1)6502200 Ext: 10641","SI","SI","NO","SI","Pública clasificada","C66162022-Tipo de información Pública clasificada-Prestación de servicios: El CONTRATISTA se obliga con POSITIVA a la prestación de los servicios de salud para los asegurados y o afiliados a POSITIVA que accedan a los servicios habilitados del CONTRATISTA en calidad de asegurados a los ramos Administración de Riesgos Laborales ARL por causa exclusiva de un accidente de trabajo una enfermedad profesional) Accidentes Personales AP Educativo Generación Positiva AP Colectivos APCorto Plazo AP Individual y demás Ramos de Seguros autorizados a Positiva encontrándose excluidos del presente contrato los servicios y todas aquellas actividades procedimientos e intervenciones que no tengan por objeto contribuir al diagnóstico tratamiento o rehabilitación de la patología derivada del siniestro o los servicios considerados como experimentales cosméticos y suntuarios."]
["VICEPRESIDENCIA TÉCNICA","Gerencia Médica","NO","C66172022",85100000,"Prestación de servicios: El CONTRATISTA se obliga con POSITIVA a la prestación de los servicios de salud para los asegurados y o afiliados a POSITIVA que accedan a los servicios habilitados del CONTRATISTA en calidad de asegurados a los ramos Administración de Riesgos Laborales ARL por causa exclusiva de un accidente de trabajo una enfermedad profesional) Accidentes Personales AP Educativo Generación Positiva AP Colectivos APCorto Plazo AP Individual y demás Ramos de Seguros autorizados a Positiva encontrándose excluidos del presente contrato los servicios y todas aquellas actividades procedimientos e intervenciones que no tengan por objeto contribuir al diagnóstico tratamiento o rehabilitación de la patología derivada del siniestro o los servicios considerados como experimentales cosméticos y suntuarios.","2022-12-27",12,"2024-12-27",24.366666666666667,"Invitación directa","CargoAReserva",0,0,"NO",null,"Gerencia de Abastecimiento Estratégico\ncontratacion@positiva.gov.co\nPBX: (1)6502200 Ext: 10641","SI","SI","NO","SI","Pública clasificada","C66172022-Tipo de información Pública clasificada-Prestación de servicios: El CONTRATISTA se obliga con POSITIVA a la prestación de los servicios de salud para los asegurados y o afiliados a POSITIVA que accedan a los servicios habilitados del CONTRATISTA en calidad de asegurados a los ramos Administración de Riesgos Laborales ARL por causa exclusiva de un accidente de trabajo una enfermedad profesional) Accidentes Personales AP Educativo Generación Positiva AP Colectivos APCorto Plazo AP Individual y demás Ramos de Seguros autorizados a Positiva encontrándose excluidos del presente contrato los servicios y todas aquellas actividades procedimientos e intervenciones que no tengan por objeto contribuir al diagnóstico tratamiento o rehabilitación de la patología derivada del siniestro o los servicios considerados como experimentales cosméticos y suntuarios."]
["VICEPRESIDENCIA TÉCNICA","Gerencia Médica","NO","C66182022",85100000,"Prestación de servicios: El CONTRATISTA se obliga con POSITIVA a la prestación de los servicios de salud para los asegurados y o afiliados a POSITIVA que accedan a los servicios habilitados del CONTRATISTA en calidad de asegurados a los ramos Administración de Riesgos Laborales ARL por causa exclusiva de un accidente de trabajo una enfermedad profesional) Accidentes Personales AP Educativo Generación Positiva AP Colectivos APCorto Plazo AP Individual y demás Ramos de Seguros autorizados a Positiva encontrándose excluidos del presente contrato los servicios y todas aquellas actividades procedimientos e intervenciones que no tengan por objeto contribuir al diagnóstico tratamiento o rehabilitación de la patología derivada del siniestro o los servicios considerados como experimentales cosméticos y suntuarios.","2022-10-01",10,"2024-10-30",25.333333333333332,"Invitación directa","CargoAReserva",0,0,"NO",null,"Gerencia de Abastecimiento Estratégico\ncontratacion@positiva.gov.co\nPBX: (1)6502200 Ext: 10641","SI","SI","NO","SI","Pública clasificada","C66182022-Tipo de información Pública clasificada-Prestación de servicios: El CONTRATISTA se obliga con POSITIVA a la prestación de los servicios de salud para los asegurados y o afiliados a POSITIVA que accedan a los servicios habilitados del CONTRATISTA en calidad de asegurados a los ramos Administración de Riesgos Laborales ARL por causa exclusiva de un accidente de trabajo una enfermedad profesional) Accidentes Personales AP Educativo Generación Positiva AP Colectivos APCorto Plazo AP Individual y demás Ramos de Seguros autorizados a Positiva encontrándose excluidos del presente contrato los servicios y todas aquellas actividades procedimientos e intervenciones que no tengan por objeto contribuir al diagnóstico tratamiento o rehabilitación de la patología derivada del siniestro o los servicios considerados como experimentales cosméticos y suntuarios."]
["VICEPRESIDENCIA TÉCNICA","Gerencia Médica","NO","C66192022",85100000,"Prestación de servicios: El CONTRATISTA se obliga con POSITIVA a la prestación de los servicios de salud para los asegurados y o afiliados a POSITIVA que accedan a los servicios habilitados del CONTRATISTA en calidad de asegurados a los ramos Administración de Riesgos Laborales ARL por causa exclusiva de un accidente de trabajo una enfermedad profesional) Accidentes Personales AP Educativo Generación Positiva AP Colectivos APCorto Plazo AP Individual y demás Ramos de Seguros autorizados a Positiva encontrándose excluidos del presente contrato los servicios y todas aquellas actividades procedimientos e intervenciones que no tengan por objeto contribuir al diagnóstico tratamiento o rehabilitación de la patología derivada del siniestro o los servicios considerados como experimentales cosméticos y suntuarios.","2022-08-01",8,"2024-08-01",24.366666666666667,"Invitación directa","CargoAReserva",0,0,"NO",null,"Gerencia de Abastecimiento Estratégico\ncontratacion@positiva.gov.co\nPBX: (1)6502200 Ext: 10641","SI","SI","NO","SI","Pública clasificada","C66192022-Tipo de información Pública clasificada-Prestación de servicios: El CONTRATISTA se obliga con POSITIVA a la prestación de los servicios de salud para los asegurados y o afiliados a POSITIVA que accedan a los servicios habilitados del CONTRATISTA en calidad de asegurados a los ramos Administración de Riesgos Laborales ARL por causa exclusiva de un accidente de trabajo una enfermedad profesional) Accidentes Personales AP Educativo Generación Positiva AP Colectivos APCorto Plazo AP Individual y demás Ramos de Seguros autorizados a Positiva encontrándose excluidos del presente contrato los servicios y todas aquellas actividades procedimientos e intervenciones que no tengan por objeto contribuir al diagnóstico tratamiento o rehabilitación de la patología derivada del siniestro o los servicios considerados como experimentales cosméticos y suntuarios."]
["VICEPRESIDENCIA TÉCNICA","Gerencia Médica","NO","C66222022",85100000,"Prestación de servicios: El CONTRATISTA se obliga con POSITIVA a la prestación de los servicios de salud para los asegurados y o afiliados a POSITIVA que accedan a los servicios habilitados del CONTRATISTA en calidad de asegurados a los ramos Administración de Riesgos Laborales ARL por causa exclusiva de un accidente de trabajo una enfermedad profesional) Accidentes Personales AP Educativo Generación Positiva AP Colectivos APCorto Plazo AP Individual y demás Ramos de Seguros autorizados a Positiva encontrándose excluidos del presente contrato los servicios y todas aquellas actividades procedimientos e intervenciones que no tengan por objeto contribuir al diagnóstico tratamiento o rehabilitación de la patología derivada del siniestro o los servicios considerados como experimentales cosméticos y suntuarios.","2022-08-15",8,"2024-08-15",24.366666666666667,"Invitación directa","CargoAReserva",0,0,"NO",null,"Gerencia de Abastecimiento Estratégico\ncontratacion@positiva.gov.co\nPBX: (1)6502200 Ext: 10641","SI","SI","NO","SI","Pública clasificada","C66222022-Tipo de información Pública clasificada-Prestación de servicios: El CONTRATISTA se obliga con POSITIVA a la prestación de los servicios de salud para los asegurados y o afiliados a POSITIVA que accedan a los servicios habilitados del CONTRATISTA en calidad de asegurados a los ramos Administración de Riesgos Laborales ARL por causa exclusiva de un accidente de trabajo una enfermedad profesional) Accidentes Personales AP Educativo Generación Positiva AP Colectivos APCorto Plazo AP Individual y demás Ramos de Seguros autorizados a Positiva encontrándose excluidos del presente contrato los servicios y todas aquellas actividades procedimientos e intervenciones que no tengan por objeto contribuir al diagnóstico tratamiento o rehabilitación de la patología derivada del siniestro o los servicios considerados como experimentales cosméticos y suntuarios."]
["VICEPRESIDENCIA TÉCNICA","Gerencia Médica","NO","C66232022",85100000,"Prestación de servicios: El CONTRATISTA se obliga con POSITIVA a la prestación de los servicios de salud para los asegurados y o afiliados a POSITIVA que accedan a los servicios habilitados del CONTRATISTA en calidad de asegurados a los ramos Administración de Riesgos Laborales ARL por causa exclusiva de un accidente de trabajo una enfermedad profesional) Accidentes Personales AP Educativo Generación Positiva AP Colectivos APCorto Plazo AP Individual y demás Ramos de Seguros autorizados a Positiva encontrándose excluidos del presente contrato los servicios y todas aquellas actividades procedimientos e intervenciones que no tengan por objeto contribuir al diagnóstico tratamiento o rehabilitación de la patología derivada del siniestro o los servicios considerados como experimentales cosméticos y suntuarios.","2022-10-18",10,"2024-10-18",24.366666666666667,"Invitación directa","CargoAReserva",0,0,"NO",null,"Gerencia de Abastecimiento Estratégico\ncontratacion@positiva.gov.co\nPBX: (1)6502200 Ext: 10641","SI","SI","NO","SI","Pública clasificada","C66232022-Tipo de información Pública clasificada-Prestación de servicios: El CONTRATISTA se obliga con POSITIVA a la prestación de los servicios de salud para los asegurados y o afiliados a POSITIVA que accedan a los servicios habilitados del CONTRATISTA en calidad de asegurados a los ramos Administración de Riesgos Laborales ARL por causa exclusiva de un accidente de trabajo una enfermedad profesional) Accidentes Personales AP Educativo Generación Positiva AP Colectivos APCorto Plazo AP Individual y demás Ramos de Seguros autorizados a Positiva encontrándose excluidos del presente contrato los servicios y todas aquellas actividades procedimientos e intervenciones que no tengan por objeto contribuir al diagnóstico tratamiento o rehabilitación de la patología derivada del siniestro o los servicios considerados como experimentales cosméticos y suntuarios."]
["VICEPRESIDENCIA TÉCNICA","Gerencia Médica","NO","C66242022",85100000,"Prestación de servicios: El CONTRATISTA se obliga con POSITIVA a la prestación de los servicios de salud para los asegurados y o afiliados a POSITIVA que accedan a los servicios habilitados del CONTRATISTA en calidad de asegurados a los ramos Administración de Riesgos Laborales ARL por causa exclusiva de un accidente de trabajo una enfermedad profesional) Accidentes Personales AP Educativo Generación Positiva AP Colectivos APCorto Plazo AP Individual y demás Ramos de Seguros autorizados a Positiva encontrándose excluidos del presente contrato los servicios y todas aquellas actividades procedimientos e intervenciones que no tengan por objeto contribuir al diagnóstico tratamiento o rehabilitación de la patología derivada del siniestro o los servicios considerados como experimentales cosméticos y suntuarios.","2022-09-25",9,"2024-09-25",24.366666666666667,"Invitación directa","CargoAReserva",0,0,"NO",null,"Gerencia de Abastecimiento Estratégico\ncontratacion@positiva.gov.co\nPBX: (1)6502200 Ext: 10641","SI","SI","NO","SI","Pública clasificada","C66242022-Tipo de información Pública clasificada-Prestación de servicios: El CONTRATISTA se obliga con POSITIVA a la prestación de los servicios de salud para los asegurados y o afiliados a POSITIVA que accedan a los servicios habilitados del CONTRATISTA en calidad de asegurados a los ramos Administración de Riesgos Laborales ARL por causa exclusiva de un accidente de trabajo una enfermedad profesional) Accidentes Personales AP Educativo Generación Positiva AP Colectivos APCorto Plazo AP Individual y demás Ramos de Seguros autorizados a Positiva encontrándose excluidos del presente contrato los servicios y todas aquellas actividades procedimientos e intervenciones que no tengan por objeto contribuir al diagnóstico tratamiento o rehabilitación de la patología derivada del siniestro o los servicios considerados como experimentales cosméticos y suntuarios."]
["VICEPRESIDENCIA TÉCNICA","Gerencia Médica","NO","C66252022",85100000,"Prestación de servicios: El CONTRATISTA se obliga con POSITIVA a la prestación de los servicios de salud para los asegurados y o afiliados a POSITIVA que accedan a los servicios habilitados del CONTRATISTA en calidad de asegurados a los ramos Administración de Riesgos Laborales ARL por causa exclusiva de un accidente de trabajo una enfermedad profesional) Accidentes Personales AP Educativo Generación Positiva AP Colectivos APCorto Plazo AP Individual y demás Ramos de Seguros autorizados a Positiva encontrándose excluidos del presente contrato los servicios y todas aquellas actividades procedimientos e intervenciones que no tengan por objeto contribuir al diagnóstico tratamiento o rehabilitación de la patología derivada del siniestro o los servicios considerados como experimentales cosméticos y suntuarios.","2022-09-24",9,"2027-09-24",60.866666666666667,"Invitación directa","CargoAReserva",0,0,"NO",null,"Gerencia de Abastecimiento Estratégico\ncontratacion@positiva.gov.co\nPBX: (1)6502200 Ext: 10641","SI","SI","NO","SI","Pública clasificada","C66252022-Tipo de información Pública clasificada-Prestación de servicios: El CONTRATISTA se obliga con POSITIVA a la prestación de los servicios de salud para los asegurados y o afiliados a POSITIVA que accedan a los servicios habilitados del CONTRATISTA en calidad de asegurados a los ramos Administración de Riesgos Laborales ARL por causa exclusiva de un accidente de trabajo una enfermedad profesional) Accidentes Personales AP Educativo Generación Positiva AP Colectivos APCorto Plazo AP Individual y demás Ramos de Seguros autorizados a Positiva encontrándose excluidos del presente contrato los servicios y todas aquellas actividades procedimientos e intervenciones que no tengan por objeto contribuir al diagnóstico tratamiento o rehabilitación de la patología derivada del siniestro o los servicios considerados como experimentales cosméticos y suntuarios."]
["VICEPRESIDENCIA TÉCNICA","Gerencia Médica","NO","C66262022",85100000,"Prestación de servicios: El CONTRATISTA se obliga con POSITIVA a la prestación de los servicios de salud para los asegurados y o afiliados a POSITIVA que accedan a los servicios habilitados del CONTRATISTA en calidad de asegurados a los ramos Administración de Riesgos Laborales ARL por causa exclusiva de un accidente de trabajo una enfermedad profesional) Accidentes Personales AP Educativo Generación Positiva AP Colectivos APCorto Plazo AP Individual y demás Ramos de Seguros autorizados a Positiva encontrándose excluidos del presente contrato los servicios y todas aquellas actividades procedimientos e intervenciones que no tengan por objeto contribuir al diagnóstico tratamiento o rehabilitación de la patología derivada del siniestro o los servicios considerados como experimentales cosméticos y suntuarios.","2022-07-01",7,"2027-04-01",57.833333333333336,"Invitación directa","CargoAReserva",0,0,"NO",null,"Gerencia de Abastecimiento Estratégico\ncontratacion@positiva.gov.co\nPBX: (1)6502200 Ext: 10641","SI","SI","NO","SI","Pública clasificada","C66262022-Tipo de información Pública clasificada-Prestación de servicios: El CONTRATISTA se obliga con POSITIVA a la prestación de los servicios de salud para los asegurados y o afiliados a POSITIVA que accedan a los servicios habilitados del CONTRATISTA en calidad de asegurados a los ramos Administración de Riesgos Laborales ARL por causa exclusiva de un accidente de trabajo una enfermedad profesional) Accidentes Personales AP Educativo Generación Positiva AP Colectivos APCorto Plazo AP Individual y demás Ramos de Seguros autorizados a Positiva encontrándose excluidos del presente contrato los servicios y todas aquellas actividades procedimientos e intervenciones que no tengan por objeto contribuir al diagnóstico tratamiento o rehabilitación de la patología derivada del siniestro o los servicios considerados como experimentales cosméticos y suntuarios."]
["VICEPRESIDENCIA TÉCNICA","Gerencia Médica","NO","C66272022",85100000,"Prestación de servicios: El CONTRATISTA se obliga con POSITIVA a la prestación de los servicios de salud para los asegurados y o afiliados a POSITIVA que accedan a los servicios habilitados del CONTRATISTA en calidad de asegurados a los ramos Administración de Riesgos Laborales ARL por causa exclusiva de un accidente de trabajo una enfermedad profesional) Accidentes Personales AP Educativo Generación Positiva AP Colectivos APCorto Plazo AP Individual y demás Ramos de Seguros autorizados a Positiva encontrándose excluidos del presente contrato los servicios y todas aquellas actividades procedimientos e intervenciones que no tengan por objeto contribuir al diagnóstico tratamiento o rehabilitación de la patología derivada del siniestro o los servicios considerados como experimentales cosméticos y suntuarios.","2022-07-19",7,"2024-07-19",24.366666666666667,"Invitación directa","CargoAReserva",0,0,"NO",null,"Gerencia de Abastecimiento Estratégico\ncontratacion@positiva.gov.co\nPBX: (1)6502200 Ext: 10641","SI","SI","NO","SI","Pública clasificada","C66272022-Tipo de información Pública clasificada-Prestación de servicios: El CONTRATISTA se obliga con POSITIVA a la prestación de los servicios de salud para los asegurados y o afiliados a POSITIVA que accedan a los servicios habilitados del CONTRATISTA en calidad de asegurados a los ramos Administración de Riesgos Laborales ARL por causa exclusiva de un accidente de trabajo una enfermedad profesional) Accidentes Personales AP Educativo Generación Positiva AP Colectivos APCorto Plazo AP Individual y demás Ramos de Seguros autorizados a Positiva encontrándose excluidos del presente contrato los servicios y todas aquellas actividades procedimientos e intervenciones que no tengan por objeto contribuir al diagnóstico tratamiento o rehabilitación de la patología derivada del siniestro o los servicios considerados como experimentales cosméticos y suntuarios."]
["VICEPRESIDENCIA TÉCNICA","Gerencia Médica","NO","C66292022",85100000,"Prestación de servicios: El CONTRATISTA se obliga con POSITIVA a la prestación de los servicios de salud para los asegurados y o afiliados a POSITIVA que accedan a los servicios habilitados del CONTRATISTA en calidad de asegurados a los ramos Administración de Riesgos Laborales ARL por causa exclusiva de un accidente de trabajo una enfermedad profesional) Accidentes Personales AP Educativo Generación Positiva AP Colectivos APCorto Plazo AP Individual y demás Ramos de Seguros autorizados a Positiva encontrándose excluidos del presente contrato los servicios y todas aquellas actividades procedimientos e intervenciones que no tengan por objeto contribuir al diagnóstico tratamiento o rehabilitación de la patología derivada del siniestro o los servicios considerados como experimentales cosméticos y suntuarios.","2022-03-24",3,"2024-03-24",24.366666666666667,"Invitación directa","CargoAReserva",0,0,"NO",null,"Gerencia de Abastecimiento Estratégico\ncontratacion@positiva.gov.co\nPBX: (1)6502200 Ext: 10641","SI","SI","NO","SI","Pública clasificada","C66292022-Tipo de información Pública clasificada-Prestación de servicios: El CONTRATISTA se obliga con POSITIVA a la prestación de los servicios de salud para los asegurados y o afiliados a POSITIVA que accedan a los servicios habilitados del CONTRATISTA en calidad de asegurados a los ramos Administración de Riesgos Laborales ARL por causa exclusiva de un accidente de trabajo una enfermedad profesional) Accidentes Personales AP Educativo Generación Positiva AP Colectivos APCorto Plazo AP Individual y demás Ramos de Seguros autorizados a Positiva encontrándose excluidos del presente contrato los servicios y todas aquellas actividades procedimientos e intervenciones que no tengan por objeto contribuir al diagnóstico tratamiento o rehabilitación de la patología derivada del siniestro o los servicios considerados como experimentales cosméticos y suntuarios."]
["VICEPRESIDENCIA TÉCNICA","Gerencia Médica","NO","C66302022",85100000,"Prestación de servicios: El CONTRATISTA se obliga con POSITIVA a la prestación de los servicios de salud para los asegurados y o afiliados a POSITIVA que accedan a los servicios habilitados del CONTRATISTA en calidad de asegurados a los ramos Administración de Riesgos Laborales ARL por causa exclusiva de un accidente de trabajo una enfermedad profesional) Accidentes Personales AP Educativo Generación Positiva AP Colectivos APCorto Plazo AP Individual y demás Ramos de Seguros autorizados a Positiva encontrándose excluidos del presente contrato los servicios y todas aquellas actividades procedimientos e intervenciones que no tengan por objeto contribuir al diagnóstico tratamiento o rehabilitación de la patología derivada del siniestro o los servicios considerados como experimentales cosméticos y suntuarios.","2022-07-13",7,"2024-07-13",24.366666666666667,"Invitación directa","CargoAReserva",0,0,"NO",null,"Gerencia de Abastecimiento Estratégico\ncontratacion@positiva.gov.co\nPBX: (1)6502200 Ext: 10641","SI","SI","NO","SI","Pública clasificada","C66302022-Tipo de información Pública clasificada-Prestación de servicios: El CONTRATISTA se obliga con POSITIVA a la prestación de los servicios de salud para los asegurados y o afiliados a POSITIVA que accedan a los servicios habilitados del CONTRATISTA en calidad de asegurados a los ramos Administración de Riesgos Laborales ARL por causa exclusiva de un accidente de trabajo una enfermedad profesional) Accidentes Personales AP Educativo Generación Positiva AP Colectivos APCorto Plazo AP Individual y demás Ramos de Seguros autorizados a Positiva encontrándose excluidos del presente contrato los servicios y todas aquellas actividades procedimientos e intervenciones que no tengan por objeto contribuir al diagnóstico tratamiento o rehabilitación de la patología derivada del siniestro o los servicios considerados como experimentales cosméticos y suntuarios."]
["VICEPRESIDENCIA TÉCNICA","Gerencia Médica","NO","C66312022",85100000,"Prestación de servicios: El CONTRATISTA se obliga con POSITIVA a la prestación de los servicios de salud para los asegurados y o afiliados a POSITIVA que accedan a los servicios habilitados del CONTRATISTA en calidad de asegurados a los ramos Administración de Riesgos Laborales ARL por causa exclusiva de un accidente de trabajo una enfermedad profesional) Accidentes Personales AP Educativo Generación Positiva AP Colectivos APCorto Plazo AP Individual y demás Ramos de Seguros autorizados a Positiva encontrándose excluidos del presente contrato los servicios y todas aquellas actividades procedimientos e intervenciones que no tengan por objeto contribuir al diagnóstico tratamiento o rehabilitación de la patología derivada del siniestro o los servicios considerados como experimentales cosméticos y suntuarios.","2022-08-04",8,"2024-08-04",24.366666666666667,"Invitación directa","CargoAReserva",0,0,"NO",null,"Gerencia de Abastecimiento Estratégico\ncontratacion@positiva.gov.co\nPBX: (1)6502200 Ext: 10641","SI","SI","NO","SI","Pública clasificada","C66312022-Tipo de información Pública clasificada-Prestación de servicios: El CONTRATISTA se obliga con POSITIVA a la prestación de los servicios de salud para los asegurados y o afiliados a POSITIVA que accedan a los servicios habilitados del CONTRATISTA en calidad de asegurados a los ramos Administración de Riesgos Laborales ARL por causa exclusiva de un accidente de trabajo una enfermedad profesional) Accidentes Personales AP Educativo Generación Positiva AP Colectivos APCorto Plazo AP Individual y demás Ramos de Seguros autorizados a Positiva encontrándose excluidos del presente contrato los servicios y todas aquellas actividades procedimientos e intervenciones que no tengan por objeto contribuir al diagnóstico tratamiento o rehabilitación de la patología derivada del siniestro o los servicios considerados como experimentales cosméticos y suntuarios."]
["VICEPRESIDENCIA TÉCNICA","Gerencia Médica","NO","C66322022",85100000,"Prestación de servicios: El CONTRATISTA se obliga con POSITIVA a la prestación de los servicios de salud para los asegurados y o afiliados a POSITIVA que accedan a los servicios habilitados del CONTRATISTA en calidad de asegurados a los ramos Administración de Riesgos Laborales ARL por causa exclusiva de un accidente de trabajo una enfermedad profesional) Accidentes Personales AP Educativo Generación Positiva AP Colectivos APCorto Plazo AP Individual y demás Ramos de Seguros autorizados a Positiva encontrándose excluidos del presente contrato los servicios y todas aquellas actividades procedimientos e intervenciones que no tengan por objeto contribuir al diagnóstico tratamiento o rehabilitación de la patología derivada del siniestro o los servicios considerados como experimentales cosméticos y suntuarios.","2022-10-18",10,"2024-10-18",24.366666666666667,"Invitación directa","CargoAReserva",0,0,"NO",null,"Gerencia de Abastecimiento Estratégico\ncontratacion@positiva.gov.co\nPBX: (1)6502200 Ext: 10641","SI","SI","NO","SI","Pública clasificada","C66322022-Tipo de información Pública clasificada-Prestación de servicios: El CONTRATISTA se obliga con POSITIVA a la prestación de los servicios de salud para los asegurados y o afiliados a POSITIVA que accedan a los servicios habilitados del CONTRATISTA en calidad de asegurados a los ramos Administración de Riesgos Laborales ARL por causa exclusiva de un accidente de trabajo una enfermedad profesional) Accidentes Personales AP Educativo Generación Positiva AP Colectivos APCorto Plazo AP Individual y demás Ramos de Seguros autorizados a Positiva encontrándose excluidos del presente contrato los servicios y todas aquellas actividades procedimientos e intervenciones que no tengan por objeto contribuir al diagnóstico tratamiento o rehabilitación de la patología derivada del siniestro o los servicios considerados como experimentales cosméticos y suntuarios."]
["VICEPRESIDENCIA TÉCNICA","Gerencia Médica","NO","C66332022",85100000,"Prestación de servicios: El CONTRATISTA se obliga con POSITIVA a la prestación de los servicios de salud para los asegurados y o afiliados a POSITIVA que accedan a los servicios habilitados del CONTRATISTA en calidad de asegurados a los ramos Administración de Riesgos Laborales ARL por causa exclusiva de un accidente de trabajo una enfermedad profesional) Accidentes Personales AP Educativo Generación Positiva AP Colectivos APCorto Plazo AP Individual y demás Ramos de Seguros autorizados a Positiva encontrándose excluidos del presente contrato los servicios y todas aquellas actividades procedimientos e intervenciones que no tengan por objeto contribuir al diagnóstico tratamiento o rehabilitación de la patología derivada del siniestro o los servicios considerados como experimentales cosméticos y suntuarios.","2022-11-17",11,"2024-11-17",24.366666666666667,"Invitación directa","CargoAReserva",0,0,"NO",null,"Gerencia de Abastecimiento Estratégico\ncontratacion@positiva.gov.co\nPBX: (1)6502200 Ext: 10641","SI","SI","NO","SI","Pública clasificada","C66332022-Tipo de información Pública clasificada-Prestación de servicios: El CONTRATISTA se obliga con POSITIVA a la prestación de los servicios de salud para los asegurados y o afiliados a POSITIVA que accedan a los servicios habilitados del CONTRATISTA en calidad de asegurados a los ramos Administración de Riesgos Laborales ARL por causa exclusiva de un accidente de trabajo una enfermedad profesional) Accidentes Personales AP Educativo Generación Positiva AP Colectivos APCorto Plazo AP Individual y demás Ramos de Seguros autorizados a Positiva encontrándose excluidos del presente contrato los servicios y todas aquellas actividades procedimientos e intervenciones que no tengan por objeto contribuir al diagnóstico tratamiento o rehabilitación de la patología derivada del siniestro o los servicios considerados como experimentales cosméticos y suntuarios."]
["VICEPRESIDENCIA TÉCNICA","Gerencia Médica","NO","C66342022",85100000,"Prestación de servicios: El CONTRATISTA se obliga con POSITIVA a la prestación de los servicios de salud para los asegurados y o afiliados a POSITIVA que accedan a los servicios habilitados del CONTRATISTA en calidad de asegurados a los ramos Administración de Riesgos Laborales ARL por causa exclusiva de un accidente de trabajo una enfermedad profesional) Accidentes Personales AP Educativo Generación Positiva AP Colectivos APCorto Plazo AP Individual y demás Ramos de Seguros autorizados a Positiva encontrándose excluidos del presente contrato los servicios y todas aquellas actividades procedimientos e intervenciones que no tengan por objeto contribuir al diagnóstico tratamiento o rehabilitación de la patología derivada del siniestro o los servicios considerados como experimentales cosméticos y suntuarios.","2022-12-07",12,"2024-12-07",24.366666666666667,"Invitación directa","CargoAReserva",0,0,"NO",null,"Gerencia de Abastecimiento Estratégico\ncontratacion@positiva.gov.co\nPBX: (1)6502200 Ext: 10641","SI","SI","NO","SI","Pública clasificada","C66342022-Tipo de información Pública clasificada-Prestación de servicios: El CONTRATISTA se obliga con POSITIVA a la prestación de los servicios de salud para los asegurados y o afiliados a POSITIVA que accedan a los servicios habilitados del CONTRATISTA en calidad de asegurados a los ramos Administración de Riesgos Laborales ARL por causa exclusiva de un accidente de trabajo una enfermedad profesional) Accidentes Personales AP Educativo Generación Positiva AP Colectivos APCorto Plazo AP Individual y demás Ramos de Seguros autorizados a Positiva encontrándose excluidos del presente contrato los servicios y todas aquellas actividades procedimientos e intervenciones que no tengan por objeto contribuir al diagnóstico tratamiento o rehabilitación de la patología derivada del siniestro o los servicios considerados como experimentales cosméticos y suntuarios."]
["VICEPRESIDENCIA TÉCNICA","Gerencia Médica","NO","C66352022",85100000,"Prestación de servicios: El CONTRATISTA se obliga con POSITIVA a la prestación de los servicios de salud para los asegurados y o afiliados a POSITIVA que accedan a los servicios habilitados del CONTRATISTA en calidad de asegurados a los ramos Administración de Riesgos Laborales ARL por causa exclusiva de un accidente de trabajo una enfermedad profesional) Accidentes Personales AP Educativo Generación Positiva AP Colectivos APCorto Plazo AP Individual y demás Ramos de Seguros autorizados a Positiva encontrándose excluidos del presente contrato los servicios y todas aquellas actividades procedimientos e intervenciones que no tengan por objeto contribuir al diagnóstico tratamiento o rehabilitación de la patología derivada del siniestro o los servicios considerados como experimentales cosméticos y suntuarios.","2022-10-01",10,"2024-10-30",25.333333333333332,"Invitación directa","CargoAReserva",0,0,"NO",null,"Gerencia de Abastecimiento Estratégico\ncontratacion@positiva.gov.co\nPBX: (1)6502200 Ext: 10641","SI","SI","NO","SI","Pública clasificada","C66352022-Tipo de información Pública clasificada-Prestación de servicios: El CONTRATISTA se obliga con POSITIVA a la prestación de los servicios de salud para los asegurados y o afiliados a POSITIVA que accedan a los servicios habilitados del CONTRATISTA en calidad de asegurados a los ramos Administración de Riesgos Laborales ARL por causa exclusiva de un accidente de trabajo una enfermedad profesional) Accidentes Personales AP Educativo Generación Positiva AP Colectivos APCorto Plazo AP Individual y demás Ramos de Seguros autorizados a Positiva encontrándose excluidos del presente contrato los servicios y todas aquellas actividades procedimientos e intervenciones que no tengan por objeto contribuir al diagnóstico tratamiento o rehabilitación de la patología derivada del siniestro o los servicios considerados como experimentales cosméticos y suntuarios."]
["VICEPRESIDENCIA TÉCNICA","Gerencia Médica","NO","C66362022",85100000,"Prestación de servicios: El CONTRATISTA se obliga con POSITIVA a la prestación de los servicios de salud para los asegurados y o afiliados a POSITIVA que accedan a los servicios habilitados del CONTRATISTA en calidad de asegurados a los ramos Administración de Riesgos Laborales ARL por causa exclusiva de un accidente de trabajo una enfermedad profesional) Accidentes Personales AP Educativo Generación Positiva AP Colectivos APCorto Plazo AP Individual y demás Ramos de Seguros autorizados a Positiva encontrándose excluidos del presente contrato los servicios y todas aquellas actividades procedimientos e intervenciones que no tengan por objeto contribuir al diagnóstico tratamiento o rehabilitación de la patología derivada del siniestro o los servicios considerados como experimentales cosméticos y suntuarios.","2022-03-02",3,"2024-03-02",24.366666666666667,"Invitación directa","CargoAReserva",0,0,"NO",null,"Gerencia de Abastecimiento Estratégico\ncontratacion@positiva.gov.co\nPBX: (1)6502200 Ext: 10641","SI","SI","NO","SI","Pública clasificada","C66362022-Tipo de información Pública clasificada-Prestación de servicios: El CONTRATISTA se obliga con POSITIVA a la prestación de los servicios de salud para los asegurados y o afiliados a POSITIVA que accedan a los servicios habilitados del CONTRATISTA en calidad de asegurados a los ramos Administración de Riesgos Laborales ARL por causa exclusiva de un accidente de trabajo una enfermedad profesional) Accidentes Personales AP Educativo Generación Positiva AP Colectivos APCorto Plazo AP Individual y demás Ramos de Seguros autorizados a Positiva encontrándose excluidos del presente contrato los servicios y todas aquellas actividades procedimientos e intervenciones que no tengan por objeto contribuir al diagnóstico tratamiento o rehabilitación de la patología derivada del siniestro o los servicios considerados como experimentales cosméticos y suntuarios."]
["VICEPRESIDENCIA TÉCNICA","Gerencia Médica","NO","C66372022",85100000,"Prestación de servicios: El CONTRATISTA se obliga con POSITIVA a la prestación de los servicios de salud para los asegurados y o afiliados a POSITIVA que accedan a los servicios habilitados del CONTRATISTA en calidad de asegurados a los ramos Administración de Riesgos Laborales ARL por causa exclusiva de un accidente de trabajo una enfermedad profesional) Accidentes Personales AP Educativo Generación Positiva AP Colectivos APCorto Plazo AP Individual y demás Ramos de Seguros autorizados a Positiva encontrándose excluidos del presente contrato los servicios y todas aquellas actividades procedimientos e intervenciones que no tengan por objeto contribuir al diagnóstico tratamiento o rehabilitación de la patología derivada del siniestro o los servicios considerados como experimentales cosméticos y suntuarios.","2022-08-05",8,"2024-08-05",24.366666666666667,"Invitación directa","CargoAReserva",0,0,"NO",null,"Gerencia de Abastecimiento Estratégico\ncontratacion@positiva.gov.co\nPBX: (1)6502200 Ext: 10641","SI","SI","NO","SI","Pública clasificada","C66372022-Tipo de información Pública clasificada-Prestación de servicios: El CONTRATISTA se obliga con POSITIVA a la prestación de los servicios de salud para los asegurados y o afiliados a POSITIVA que accedan a los servicios habilitados del CONTRATISTA en calidad de asegurados a los ramos Administración de Riesgos Laborales ARL por causa exclusiva de un accidente de trabajo una enfermedad profesional) Accidentes Personales AP Educativo Generación Positiva AP Colectivos APCorto Plazo AP Individual y demás Ramos de Seguros autorizados a Positiva encontrándose excluidos del presente contrato los servicios y todas aquellas actividades procedimientos e intervenciones que no tengan por objeto contribuir al diagnóstico tratamiento o rehabilitación de la patología derivada del siniestro o los servicios considerados como experimentales cosméticos y suntuarios."]
["VICEPRESIDENCIA TÉCNICA","Gerencia Médica","NO","C66382022",85100000,"Prestación de servicios: El CONTRATISTA se obliga con POSITIVA a la prestación de los servicios de salud para los asegurados y o afiliados a POSITIVA que accedan a los servicios habilitados del CONTRATISTA en calidad de asegurados a los ramos Administración de Riesgos Laborales ARL por causa exclusiva de un accidente de trabajo una enfermedad profesional) Accidentes Personales AP Educativo Generación Positiva AP Colectivos APCorto Plazo AP Individual y demás Ramos de Seguros autorizados a Positiva encontrándose excluidos del presente contrato los servicios y todas aquellas actividades procedimientos e intervenciones que no tengan por objeto contribuir al diagnóstico tratamiento o rehabilitación de la patología derivada del siniestro o los servicios considerados como experimentales cosméticos y suntuarios.","2022-04-04",4,"2024-04-04",24.366666666666667,"Invitación directa","CargoAReserva",0,0,"NO",null,"Gerencia de Abastecimiento Estratégico\ncontratacion@positiva.gov.co\nPBX: (1)6502200 Ext: 10641","SI","SI","NO","SI","Pública clasificada","C66382022-Tipo de información Pública clasificada-Prestación de servicios: El CONTRATISTA se obliga con POSITIVA a la prestación de los servicios de salud para los asegurados y o afiliados a POSITIVA que accedan a los servicios habilitados del CONTRATISTA en calidad de asegurados a los ramos Administración de Riesgos Laborales ARL por causa exclusiva de un accidente de trabajo una enfermedad profesional) Accidentes Personales AP Educativo Generación Positiva AP Colectivos APCorto Plazo AP Individual y demás Ramos de Seguros autorizados a Positiva encontrándose excluidos del presente contrato los servicios y todas aquellas actividades procedimientos e intervenciones que no tengan por objeto contribuir al diagnóstico tratamiento o rehabilitación de la patología derivada del siniestro o los servicios considerados como experimentales cosméticos y suntuarios."]
["VICEPRESIDENCIA TÉCNICA","Gerencia Médica","NO","C66392022",85100000,"Prestación de servicios: El CONTRATISTA se obliga con POSITIVA a la prestación de los servicios de salud para los asegurados y o afiliados a POSITIVA que accedan a los servicios habilitados del CONTRATISTA en calidad de asegurados a los ramos Administración de Riesgos Laborales ARL por causa exclusiva de un accidente de trabajo una enfermedad profesional) Accidentes Personales AP Educativo Generación Positiva AP Colectivos APCorto Plazo AP Individual y demás Ramos de Seguros autorizados a Positiva encontrándose excluidos del presente contrato los servicios y todas aquellas actividades procedimientos e intervenciones que no tengan por objeto contribuir al diagnóstico tratamiento o rehabilitación de la patología derivada del siniestro o los servicios considerados como experimentales cosméticos y suntuarios.","2022-10-03",10,"2027-10-02",60.833333333333336,"Invitación directa","CargoAReserva",0,0,"NO",null,"Gerencia de Abastecimiento Estratégico\ncontratacion@positiva.gov.co\nPBX: (1)6502200 Ext: 10641","SI","SI","NO","SI","Pública clasificada","C66392022-Tipo de información Pública clasificada-Prestación de servicios: El CONTRATISTA se obliga con POSITIVA a la prestación de los servicios de salud para los asegurados y o afiliados a POSITIVA que accedan a los servicios habilitados del CONTRATISTA en calidad de asegurados a los ramos Administración de Riesgos Laborales ARL por causa exclusiva de un accidente de trabajo una enfermedad profesional) Accidentes Personales AP Educativo Generación Positiva AP Colectivos APCorto Plazo AP Individual y demás Ramos de Seguros autorizados a Positiva encontrándose excluidos del presente contrato los servicios y todas aquellas actividades procedimientos e intervenciones que no tengan por objeto contribuir al diagnóstico tratamiento o rehabilitación de la patología derivada del siniestro o los servicios considerados como experimentales cosméticos y suntuarios."]
["VICEPRESIDENCIA TÉCNICA","Gerencia Médica","NO","C66402022",85100000,"Prestación de servicios: El CONTRATISTA se obliga con POSITIVA a la prestación de los servicios de salud para los asegurados y o afiliados a POSITIVA que accedan a los servicios habilitados del CONTRATISTA en calidad de asegurados a los ramos Administración de Riesgos Laborales ARL por causa exclusiva de un accidente de trabajo una enfermedad profesional) Accidentes Personales AP Educativo Generación Positiva AP Colectivos APCorto Plazo AP Individual y demás Ramos de Seguros autorizados a Positiva encontrándose excluidos del presente contrato los servicios y todas aquellas actividades procedimientos e intervenciones que no tengan por objeto contribuir al diagnóstico tratamiento o rehabilitación de la patología derivada del siniestro o los servicios considerados como experimentales cosméticos y suntuarios.","2022-09-03",9,"2027-06-03",57.8,"Invitación directa","CargoAReserva",0,0,"NO",null,"Gerencia de Abastecimiento Estratégico\ncontratacion@positiva.gov.co\nPBX: (1)6502200 Ext: 10641","SI","SI","NO","SI","Pública clasificada","C66402022-Tipo de información Pública clasificada-Prestación de servicios: El CONTRATISTA se obliga con POSITIVA a la prestación de los servicios de salud para los asegurados y o afiliados a POSITIVA que accedan a los servicios habilitados del CONTRATISTA en calidad de asegurados a los ramos Administración de Riesgos Laborales ARL por causa exclusiva de un accidente de trabajo una enfermedad profesional) Accidentes Personales AP Educativo Generación Positiva AP Colectivos APCorto Plazo AP Individual y demás Ramos de Seguros autorizados a Positiva encontrándose excluidos del presente contrato los servicios y todas aquellas actividades procedimientos e intervenciones que no tengan por objeto contribuir al diagnóstico tratamiento o rehabilitación de la patología derivada del siniestro o los servicios considerados como experimentales cosméticos y suntuarios."]
["VICEPRESIDENCIA TÉCNICA","Gerencia Médica","NO","C66412022",85100000,"Prestación de servicios: El CONTRATISTA se obliga con POSITIVA a la prestación de los servicios de salud para los asegurados y o afiliados a POSITIVA que accedan a los servicios habilitados del CONTRATISTA en calidad de asegurados a los ramos Administración de Riesgos Laborales ARL por causa exclusiva de un accidente de trabajo una enfermedad profesional) Accidentes Personales AP Educativo Generación Positiva AP Colectivos APCorto Plazo AP Individual y demás Ramos de Seguros autorizados a Positiva encontrándose excluidos del presente contrato los servicios y todas aquellas actividades procedimientos e intervenciones que no tengan por objeto contribuir al diagnóstico tratamiento o rehabilitación de la patología derivada del siniestro o los servicios considerados como experimentales cosméticos y suntuarios.","2022-04-22",4,"2027-04-22",60.866666666666667,"Invitación directa","CargoAReserva",0,0,"NO",null,"Gerencia de Abastecimiento Estratégico\ncontratacion@positiva.gov.co\nPBX: (1)6502200 Ext: 10641","SI","SI","NO","SI","Pública clasificada","C66412022-Tipo de información Pública clasificada-Prestación de servicios: El CONTRATISTA se obliga con POSITIVA a la prestación de los servicios de salud para los asegurados y o afiliados a POSITIVA que accedan a los servicios habilitados del CONTRATISTA en calidad de asegurados a los ramos Administración de Riesgos Laborales ARL por causa exclusiva de un accidente de trabajo una enfermedad profesional) Accidentes Personales AP Educativo Generación Positiva AP Colectivos APCorto Plazo AP Individual y demás Ramos de Seguros autorizados a Positiva encontrándose excluidos del presente contrato los servicios y todas aquellas actividades procedimientos e intervenciones que no tengan por objeto contribuir al diagnóstico tratamiento o rehabilitación de la patología derivada del siniestro o los servicios considerados como experimentales cosméticos y suntuarios."]
["VICEPRESIDENCIA TÉCNICA","Gerencia Médica","NO","C66442022",85100000,"Prestación de servicios: El CONTRATISTA se obliga con POSITIVA a la prestación de los servicios de salud para los asegurados y o afiliados a POSITIVA que accedan a los servicios habilitados del CONTRATISTA en calidad de asegurados a los ramos Administración de Riesgos Laborales ARL por causa exclusiva de un accidente de trabajo una enfermedad profesional) Accidentes Personales AP Educativo Generación Positiva AP Colectivos APCorto Plazo AP Individual y demás Ramos de Seguros autorizados a Positiva encontrándose excluidos del presente contrato los servicios y todas aquellas actividades procedimientos e intervenciones que no tengan por objeto contribuir al diagnóstico tratamiento o rehabilitación de la patología derivada del siniestro o los servicios considerados como experimentales cosméticos y suntuarios.","2022-08-24",8,"2024-08-24",24.366666666666667,"Invitación directa","CargoAReserva",0,0,"NO",null,"Gerencia de Abastecimiento Estratégico\ncontratacion@positiva.gov.co\nPBX: (1)6502200 Ext: 10641","SI","SI","NO","SI","Pública clasificada","C66442022-Tipo de información Pública clasificada-Prestación de servicios: El CONTRATISTA se obliga con POSITIVA a la prestación de los servicios de salud para los asegurados y o afiliados a POSITIVA que accedan a los servicios habilitados del CONTRATISTA en calidad de asegurados a los ramos Administración de Riesgos Laborales ARL por causa exclusiva de un accidente de trabajo una enfermedad profesional) Accidentes Personales AP Educativo Generación Positiva AP Colectivos APCorto Plazo AP Individual y demás Ramos de Seguros autorizados a Positiva encontrándose excluidos del presente contrato los servicios y todas aquellas actividades procedimientos e intervenciones que no tengan por objeto contribuir al diagnóstico tratamiento o rehabilitación de la patología derivada del siniestro o los servicios considerados como experimentales cosméticos y suntuarios."]
["VICEPRESIDENCIA TÉCNICA","Gerencia Médica","NO","C66452022",85100000,"Prestación de servicios: El CONTRATISTA se obliga con POSITIVA a la prestación de los servicios de salud para los asegurados y o afiliados a POSITIVA que accedan a los servicios habilitados del CONTRATISTA en calidad de asegurados a los ramos Administración de Riesgos Laborales ARL por causa exclusiva de un accidente de trabajo una enfermedad profesional) Accidentes Personales AP Educativo Generación Positiva AP Colectivos APCorto Plazo AP Individual y demás Ramos de Seguros autorizados a Positiva encontrándose excluidos del presente contrato los servicios y todas aquellas actividades procedimientos e intervenciones que no tengan por objeto contribuir al diagnóstico tratamiento o rehabilitación de la patología derivada del siniestro o los servicios considerados como experimentales cosméticos y suntuarios.","2022-10-01",10,"2024-10-30",25.333333333333332,"Invitación directa","CargoAReserva",0,0,"NO",null,"Gerencia de Abastecimiento Estratégico\ncontratacion@positiva.gov.co\nPBX: (1)6502200 Ext: 10641","SI","SI","NO","SI","Pública clasificada","C66452022-Tipo de información Pública clasificada-Prestación de servicios: El CONTRATISTA se obliga con POSITIVA a la prestación de los servicios de salud para los asegurados y o afiliados a POSITIVA que accedan a los servicios habilitados del CONTRATISTA en calidad de asegurados a los ramos Administración de Riesgos Laborales ARL por causa exclusiva de un accidente de trabajo una enfermedad profesional) Accidentes Personales AP Educativo Generación Positiva AP Colectivos APCorto Plazo AP Individual y demás Ramos de Seguros autorizados a Positiva encontrándose excluidos del presente contrato los servicios y todas aquellas actividades procedimientos e intervenciones que no tengan por objeto contribuir al diagnóstico tratamiento o rehabilitación de la patología derivada del siniestro o los servicios considerados como experimentales cosméticos y suntuarios."]
["VICEPRESIDENCIA TÉCNICA","Gerencia Médica","NO","C66462022",85100000,"Prestación de servicios: El CONTRATISTA se obliga con POSITIVA a la prestación de los servicios de salud para los asegurados y o afiliados a POSITIVA que accedan a los servicios habilitados del CONTRATISTA en calidad de asegurados a los ramos Administración de Riesgos Laborales ARL por causa exclusiva de un accidente de trabajo una enfermedad profesional) Accidentes Personales AP Educativo Generación Positiva AP Colectivos APCorto Plazo AP Individual y demás Ramos de Seguros autorizados a Positiva encontrándose excluidos del presente contrato los servicios y todas aquellas actividades procedimientos e intervenciones que no tengan por objeto contribuir al diagnóstico tratamiento o rehabilitación de la patología derivada del siniestro o los servicios considerados como experimentales cosméticos y suntuarios.","2022-05-16",5,"2024-05-16",24.366666666666667,"Invitación directa","CargoAReserva",0,0,"NO",null,"Gerencia de Abastecimiento Estratégico\ncontratacion@positiva.gov.co\nPBX: (1)6502200 Ext: 10641","SI","SI","NO","SI","Pública clasificada","C66462022-Tipo de información Pública clasificada-Prestación de servicios: El CONTRATISTA se obliga con POSITIVA a la prestación de los servicios de salud para los asegurados y o afiliados a POSITIVA que accedan a los servicios habilitados del CONTRATISTA en calidad de asegurados a los ramos Administración de Riesgos Laborales ARL por causa exclusiva de un accidente de trabajo una enfermedad profesional) Accidentes Personales AP Educativo Generación Positiva AP Colectivos APCorto Plazo AP Individual y demás Ramos de Seguros autorizados a Positiva encontrándose excluidos del presente contrato los servicios y todas aquellas actividades procedimientos e intervenciones que no tengan por objeto contribuir al diagnóstico tratamiento o rehabilitación de la patología derivada del siniestro o los servicios considerados como experimentales cosméticos y suntuarios."]
["VICEPRESIDENCIA TÉCNICA","Gerencia Médica","NO","C66472022",85100000,"Prestación de servicios: El CONTRATISTA se obliga con POSITIVA a la prestación de los servicios de salud para los asegurados y o afiliados a POSITIVA que accedan a los servicios habilitados del CONTRATISTA en calidad de asegurados a los ramos Administración de Riesgos Laborales ARL por causa exclusiva de un accidente de trabajo una enfermedad profesional) Accidentes Personales AP Educativo Generación Positiva AP Colectivos APCorto Plazo AP Individual y demás Ramos de Seguros autorizados a Positiva encontrándose excluidos del presente contrato los servicios y todas aquellas actividades procedimientos e intervenciones que no tengan por objeto contribuir al diagnóstico tratamiento o rehabilitación de la patología derivada del siniestro o los servicios considerados como experimentales cosméticos y suntuarios.","2022-02-01",2,"2024-02-01",24.333333333333332,"Invitación directa","CargoAReserva",0,0,"NO",null,"Gerencia de Abastecimiento Estratégico\ncontratacion@positiva.gov.co\nPBX: (1)6502200 Ext: 10641","SI","SI","NO","SI","Pública clasificada","C66472022-Tipo de información Pública clasificada-Prestación de servicios: El CONTRATISTA se obliga con POSITIVA a la prestación de los servicios de salud para los asegurados y o afiliados a POSITIVA que accedan a los servicios habilitados del CONTRATISTA en calidad de asegurados a los ramos Administración de Riesgos Laborales ARL por causa exclusiva de un accidente de trabajo una enfermedad profesional) Accidentes Personales AP Educativo Generación Positiva AP Colectivos APCorto Plazo AP Individual y demás Ramos de Seguros autorizados a Positiva encontrándose excluidos del presente contrato los servicios y todas aquellas actividades procedimientos e intervenciones que no tengan por objeto contribuir al diagnóstico tratamiento o rehabilitación de la patología derivada del siniestro o los servicios considerados como experimentales cosméticos y suntuarios."]
["VICEPRESIDENCIA TÉCNICA","Gerencia Médica","NO","C66482022",85100000,"Prestación de servicios: El CONTRATISTA se obliga con POSITIVA a la prestación de los servicios de salud para los asegurados y o afiliados a POSITIVA que accedan a los servicios habilitados del CONTRATISTA en calidad de asegurados a los ramos Administración de Riesgos Laborales ARL por causa exclusiva de un accidente de trabajo una enfermedad profesional) Accidentes Personales AP Educativo Generación Positiva AP Colectivos APCorto Plazo AP Individual y demás Ramos de Seguros autorizados a Positiva encontrándose excluidos del presente contrato los servicios y todas aquellas actividades procedimientos e intervenciones que no tengan por objeto contribuir al diagnóstico tratamiento o rehabilitación de la patología derivada del siniestro o los servicios considerados como experimentales cosméticos y suntuarios.","2022-02-01",2,"2024-02-02",24.366666666666667,"Invitación directa","CargoAReserva",0,0,"NO",null,"Gerencia de Abastecimiento Estratégico\ncontratacion@positiva.gov.co\nPBX: (1)6502200 Ext: 10641","SI","SI","NO","SI","Pública clasificada","C66482022-Tipo de información Pública clasificada-Prestación de servicios: El CONTRATISTA se obliga con POSITIVA a la prestación de los servicios de salud para los asegurados y o afiliados a POSITIVA que accedan a los servicios habilitados del CONTRATISTA en calidad de asegurados a los ramos Administración de Riesgos Laborales ARL por causa exclusiva de un accidente de trabajo una enfermedad profesional) Accidentes Personales AP Educativo Generación Positiva AP Colectivos APCorto Plazo AP Individual y demás Ramos de Seguros autorizados a Positiva encontrándose excluidos del presente contrato los servicios y todas aquellas actividades procedimientos e intervenciones que no tengan por objeto contribuir al diagnóstico tratamiento o rehabilitación de la patología derivada del siniestro o los servicios considerados como experimentales cosméticos y suntuarios."]
["VICEPRESIDENCIA TÉCNICA","Gerencia Médica","NO","C66492022",85100000,"Prestación de servicios: El CONTRATISTA se obliga con POSITIVA a la prestación de los servicios de salud para los asegurados y o afiliados a POSITIVA que accedan a los servicios habilitados del CONTRATISTA en calidad de asegurados a los ramos Administración de Riesgos Laborales ARL por causa exclusiva de un accidente de trabajo una enfermedad profesional) Accidentes Personales AP Educativo Generación Positiva AP Colectivos APCorto Plazo AP Individual y demás Ramos de Seguros autorizados a Positiva encontrándose excluidos del presente contrato los servicios y todas aquellas actividades procedimientos e intervenciones que no tengan por objeto contribuir al diagnóstico tratamiento o rehabilitación de la patología derivada del siniestro o los servicios considerados como experimentales cosméticos y suntuarios.","2022-02-01",2,"2024-02-01",24.333333333333332,"Invitación directa","CargoAReserva",0,0,"NO",null,"Gerencia de Abastecimiento Estratégico\ncontratacion@positiva.gov.co\nPBX: (1)6502200 Ext: 10641","SI","SI","NO","SI","Pública clasificada","C66492022-Tipo de información Pública clasificada-Prestación de servicios: El CONTRATISTA se obliga con POSITIVA a la prestación de los servicios de salud para los asegurados y o afiliados a POSITIVA que accedan a los servicios habilitados del CONTRATISTA en calidad de asegurados a los ramos Administración de Riesgos Laborales ARL por causa exclusiva de un accidente de trabajo una enfermedad profesional) Accidentes Personales AP Educativo Generación Positiva AP Colectivos APCorto Plazo AP Individual y demás Ramos de Seguros autorizados a Positiva encontrándose excluidos del presente contrato los servicios y todas aquellas actividades procedimientos e intervenciones que no tengan por objeto contribuir al diagnóstico tratamiento o rehabilitación de la patología derivada del siniestro o los servicios considerados como experimentales cosméticos y suntuarios."]
["VICEPRESIDENCIA TÉCNICA","Gerencia Médica","NO","C66502022",85100000,"Prestación de servicios: El CONTRATISTA se obliga con POSITIVA a la prestación de los servicios de salud para los asegurados y o afiliados a POSITIVA que accedan a los servicios habilitados del CONTRATISTA en calidad de asegurados a los ramos Administración de Riesgos Laborales ARL por causa exclusiva de un accidente de trabajo una enfermedad profesional) Accidentes Personales AP Educativo Generación Positiva AP Colectivos APCorto Plazo AP Individual y demás Ramos de Seguros autorizados a Positiva encontrándose excluidos del presente contrato los servicios y todas aquellas actividades procedimientos e intervenciones que no tengan por objeto contribuir al diagnóstico tratamiento o rehabilitación de la patología derivada del siniestro o los servicios considerados como experimentales cosméticos y suntuarios.","2022-10-01",10,"2024-10-30",25.333333333333332,"Invitación directa","CargoAReserva",0,0,"NO",null,"Gerencia de Abastecimiento Estratégico\ncontratacion@positiva.gov.co\nPBX: (1)6502200 Ext: 10641","SI","SI","NO","SI","Pública clasificada","C66502022-Tipo de información Pública clasificada-Prestación de servicios: El CONTRATISTA se obliga con POSITIVA a la prestación de los servicios de salud para los asegurados y o afiliados a POSITIVA que accedan a los servicios habilitados del CONTRATISTA en calidad de asegurados a los ramos Administración de Riesgos Laborales ARL por causa exclusiva de un accidente de trabajo una enfermedad profesional) Accidentes Personales AP Educativo Generación Positiva AP Colectivos APCorto Plazo AP Individual y demás Ramos de Seguros autorizados a Positiva encontrándose excluidos del presente contrato los servicios y todas aquellas actividades procedimientos e intervenciones que no tengan por objeto contribuir al diagnóstico tratamiento o rehabilitación de la patología derivada del siniestro o los servicios considerados como experimentales cosméticos y suntuarios."]
["VICEPRESIDENCIA TÉCNICA","Gerencia Médica","NO","C66512022",85100000,"Prestación de servicios: El CONTRATISTA se obliga con POSITIVA a la prestación de los servicios de salud para los asegurados y o afiliados a POSITIVA que accedan a los servicios habilitados del CONTRATISTA en calidad de asegurados a los ramos Administración de Riesgos Laborales ARL por causa exclusiva de un accidente de trabajo una enfermedad profesional) Accidentes Personales AP Educativo Generación Positiva AP Colectivos APCorto Plazo AP Individual y demás Ramos de Seguros autorizados a Positiva encontrándose excluidos del presente contrato los servicios y todas aquellas actividades procedimientos e intervenciones que no tengan por objeto contribuir al diagnóstico tratamiento o rehabilitación de la patología derivada del siniestro o los servicios considerados como experimentales cosméticos y suntuarios.","2022-10-01",{"$f":"MONTH(G599)","v":10},"2024-10-30",25.333333333333332,"Invitación directa","CargoAReserva",0,0,"NO",null,"Gerencia de Abastecimiento Estratégico\ncontratacion@positiva.gov.co\nPBX: (1)6502200 Ext: 10641","SI","SI","NO","SI","Pública clasificada","C66512022-Tipo de información Pública clasificada-Prestación de servicios: El CONTRATISTA se obliga con POSITIVA a la prestación de los servicios de salud para los asegurados y o afiliados a POSITIVA que accedan a los servicios habilitados del CONTRATISTA en calidad de asegurados a los ramos Administración de Riesgos Laborales ARL por causa exclusiva de un accidente de trabajo una enfermedad profesional) Accidentes Personales AP Educativo Generación Positiva AP Colectivos APCorto Plazo AP Individual y demás Ramos de Seguros autorizados a Positiva encontrándose excluidos del presente contrato los servicios y todas aquellas actividades procedimientos e intervenciones que no tengan por objeto contribuir al diagnóstico tratamiento o rehabilitación de la patología derivada del siniestro o los servicios considerados como experimentales cosméticos y suntuarios."]
["VICEPRESIDENCIA TÉCNICA","Gerencia Médica","NO","C66522022",85100000,"Prestación de servicios: El CONTRATISTA se obliga con POSITIVA a la prestación de los servicios de salud para los asegurados y o afiliados a POSITIVA que accedan a los servicios habilitados del CONTRATISTA en calidad de asegurados a los ramos Administración de Riesgos Laborales ARL por causa exclusiva de un accidente de trabajo una enfermedad profesional) Accidentes Personales AP Educativo Generación Positiva AP Colectivos APCorto Plazo AP Individual y demás Ramos de Seguros autorizados a Positiva encontrándose excluidos del presente contrato los servicios y todas aquellas actividades procedimientos e intervenciones que no tengan por objeto contribuir al diagnóstico tratamiento o rehabilitación de la patología derivada del siniestro o los servicios considerados como experimentales cosméticos y suntuarios.","2022-09-19",9,"2024-09-19",24.366666666666667,"Invitación directa","CargoAReserva",0,0,"NO",null,"Gerencia de Abastecimiento Estratégico\ncontratacion@positiva.gov.co\nPBX: (1)6502200 Ext: 10641","SI","SI","NO","SI","Pública clasificada","C66522022-Tipo de información Pública clasificada-Prestación de servicios: El CONTRATISTA se obliga con POSITIVA a la prestación de los servicios de salud para los asegurados y o afiliados a POSITIVA que accedan a los servicios habilitados del CONTRATISTA en calidad de asegurados a los ramos Administración de Riesgos Laborales ARL por causa exclusiva de un accidente de trabajo una enfermedad profesional) Accidentes Personales AP Educativo Generación Positiva AP Colectivos APCorto Plazo AP Individual y demás Ramos de Seguros autorizados a Positiva encontrándose excluidos del presente contrato los servicios y todas aquellas actividades procedimientos e intervenciones que no tengan por objeto contribuir al diagnóstico tratamiento o rehabilitación de la patología derivada del siniestro o los servicios considerados como experimentales cosméticos y suntuarios."]
["VICEPRESIDENCIA TÉCNICA","Gerencia Médica","NO","C66532022",85100000,"Prestación de servicios: El CONTRATISTA se obliga con POSITIVA a la prestación de los servicios de salud para los asegurados y o afiliados a POSITIVA que accedan a los servicios habilitados del CONTRATISTA en calidad de asegurados a los ramos Administración de Riesgos Laborales ARL por causa exclusiva de un accidente de trabajo una enfermedad profesional) Accidentes Personales AP Educativo Generación Positiva AP Colectivos APCorto Plazo AP Individual y demás Ramos de Seguros autorizados a Positiva encontrándose excluidos del presente contrato los servicios y todas aquellas actividades procedimientos e intervenciones que no tengan por objeto contribuir al diagnóstico tratamiento o rehabilitación de la patología derivada del siniestro o los servicios considerados como experimentales cosméticos y suntuarios.","2022-09-01",9,"2024-09-01",24.366666666666667,"Invitación directa","CargoAReserva",0,0,"NO",null,"Gerencia de Abastecimiento Estratégico\ncontratacion@positiva.gov.co\nPBX: (1)6502200 Ext: 10641","SI","SI","NO","SI","Pública clasificada","C66532022-Tipo de información Pública clasificada-Prestación de servicios: El CONTRATISTA se obliga con POSITIVA a la prestación de los servicios de salud para los asegurados y o afiliados a POSITIVA que accedan a los servicios habilitados del CONTRATISTA en calidad de asegurados a los ramos Administración de Riesgos Laborales ARL por causa exclusiva de un accidente de trabajo una enfermedad profesional) Accidentes Personales AP Educativo Generación Positiva AP Colectivos APCorto Plazo AP Individual y demás Ramos de Seguros autorizados a Positiva encontrándose excluidos del presente contrato los servicios y todas aquellas actividades procedimientos e intervenciones que no tengan por objeto contribuir al diagnóstico tratamiento o rehabilitación de la patología derivada del siniestro o los servicios considerados como experimentales cosméticos y suntuarios."]
["VICEPRESIDENCIA TÉCNICA","Gerencia Médica","NO","C66542022",85100000,"Prestación de servicios: El CONTRATISTA se obliga con POSITIVA a la prestación de los servicios de salud para los asegurados y o afiliados a POSITIVA que accedan a los servicios habilitados del CONTRATISTA en calidad de asegurados a los ramos Administración de Riesgos Laborales ARL por causa exclusiva de un accidente de trabajo una enfermedad profesional) Accidentes Personales AP Educativo Generación Positiva AP Colectivos APCorto Plazo AP Individual y demás Ramos de Seguros autorizados a Positiva encontrándose excluidos del presente contrato los servicios y todas aquellas actividades procedimientos e intervenciones que no tengan por objeto contribuir al diagnóstico tratamiento o rehabilitación de la patología derivada del siniestro o los servicios considerados como experimentales cosméticos y suntuarios.","2022-10-01",10,"2024-10-01",24.366666666666667,"Invitación directa","CargoAReserva",0,0,"NO",null,"Gerencia de Abastecimiento Estratégico\ncontratacion@positiva.gov.co\nPBX: (1)6502200 Ext: 10641","SI","SI","NO","SI","Pública clasificada","C66542022-Tipo de información Pública clasificada-Prestación de servicios: El CONTRATISTA se obliga con POSITIVA a la prestación de los servicios de salud para los asegurados y o afiliados a POSITIVA que accedan a los servicios habilitados del CONTRATISTA en calidad de asegurados a los ramos Administración de Riesgos Laborales ARL por causa exclusiva de un accidente de trabajo una enfermedad profesional) Accidentes Personales AP Educativo Generación Positiva AP Colectivos APCorto Plazo AP Individual y demás Ramos de Seguros autorizados a Positiva encontrándose excluidos del presente contrato los servicios y todas aquellas actividades procedimientos e intervenciones que no tengan por objeto contribuir al diagnóstico tratamiento o rehabilitación de la patología derivada del siniestro o los servicios considerados como experimentales cosméticos y suntuarios."]
["VICEPRESIDENCIA TÉCNICA","Gerencia Médica","NO","C66552022",85100000,"Prestación de servicios: El CONTRATISTA se obliga con POSITIVA a la prestación de los servicios de salud para los asegurados y o afiliados a POSITIVA que accedan a los servicios habilitados del CONTRATISTA en calidad de asegurados a los ramos Administración de Riesgos Laborales ARL por causa exclusiva de un accidente de trabajo una enfermedad profesional) Accidentes Personales AP Educativo Generación Positiva AP Colectivos APCorto Plazo AP Individual y demás Ramos de Seguros autorizados a Positiva encontrándose excluidos del presente contrato los servicios y todas aquellas actividades procedimientos e intervenciones que no tengan por objeto contribuir al diagnóstico tratamiento o rehabilitación de la patología derivada del siniestro o los servicios considerados como experimentales cosméticos y suntuarios.","2022-11-01",11,"2024-11-01",24.366666666666667,"Invitación directa","CargoAReserva",0,0,"NO",null,"Gerencia de Abastecimiento Estratégico\ncontratacion@positiva.gov.co\nPBX: (1)6502200 Ext: 10641","SI","SI","NO","SI","Pública clasificada","C66552022-Tipo de información Pública clasificada-Prestación de servicios: El CONTRATISTA se obliga con POSITIVA a la prestación de los servicios de salud para los asegurados y o afiliados a POSITIVA que accedan a los servicios habilitados del CONTRATISTA en calidad de asegurados a los ramos Administración de Riesgos Laborales ARL por causa exclusiva de un accidente de trabajo una enfermedad profesional) Accidentes Personales AP Educativo Generación Positiva AP Colectivos APCorto Plazo AP Individual y demás Ramos de Seguros autorizados a Positiva encontrándose excluidos del presente contrato los servicios y todas aquellas actividades procedimientos e intervenciones que no tengan por objeto contribuir al diagnóstico tratamiento o rehabilitación de la patología derivada del siniestro o los servicios considerados como experimentales cosméticos y suntuarios."]
["VICEPRESIDENCIA TÉCNICA","Gerencia Médica","NO","C66562022",85100000,"Prestación de servicios: El CONTRATISTA se obliga con POSITIVA a la prestación de los servicios de salud para los asegurados y o afiliados a POSITIVA que accedan a los servicios habilitados del CONTRATISTA en calidad de asegurados a los ramos Administración de Riesgos Laborales ARL por causa exclusiva de un accidente de trabajo una enfermedad profesional) Accidentes Personales AP Educativo Generación Positiva AP Colectivos APCorto Plazo AP Individual y demás Ramos de Seguros autorizados a Positiva encontrándose excluidos del presente contrato los servicios y todas aquellas actividades procedimientos e intervenciones que no tengan por objeto contribuir al diagnóstico tratamiento o rehabilitación de la patología derivada del siniestro o los servicios considerados como experimentales cosméticos y suntuarios.","2022-02-01",2,"2024-02-01",24.333333333333332,"Invitación directa","CargoAReserva",0,0,"NO",null,"Gerencia de Abastecimiento Estratégico\ncontratacion@positiva.gov.co\nPBX: (1)6502200 Ext: 10641","SI","SI","NO","SI","Pública clasificada","C66562022-Tipo de información Pública clasificada-Prestación de servicios: El CONTRATISTA se obliga con POSITIVA a la prestación de los servicios de salud para los asegurados y o afiliados a POSITIVA que accedan a los servicios habilitados del CONTRATISTA en calidad de asegurados a los ramos Administración de Riesgos Laborales ARL por causa exclusiva de un accidente de trabajo una enfermedad profesional) Accidentes Personales AP Educativo Generación Positiva AP Colectivos APCorto Plazo AP Individual y demás Ramos de Seguros autorizados a Positiva encontrándose excluidos del presente contrato los servicios y todas aquellas actividades procedimientos e intervenciones que no tengan por objeto contribuir al diagnóstico tratamiento o rehabilitación de la patología derivada del siniestro o los servicios considerados como experimentales cosméticos y suntuarios."]
["VICEPRESIDENCIA TÉCNICA","Gerencia Médica","NO","C66572022",85100000,"Prestación de servicios: El CONTRATISTA se obliga con POSITIVA a la prestación de los servicios de salud para los asegurados y o afiliados a POSITIVA que accedan a los servicios habilitados del CONTRATISTA en calidad de asegurados a los ramos Administración de Riesgos Laborales ARL por causa exclusiva de un accidente de trabajo una enfermedad profesional) Accidentes Personales AP Educativo Generación Positiva AP Colectivos APCorto Plazo AP Individual y demás Ramos de Seguros autorizados a Positiva encontrándose excluidos del presente contrato los servicios y todas aquellas actividades procedimientos e intervenciones que no tengan por objeto contribuir al diagnóstico tratamiento o rehabilitación de la patología derivada del siniestro o los servicios considerados como experimentales cosméticos y suntuarios.","2022-03-01",3,"2024-03-01",{"$f":"(I605-G605)/30","v":24.366666666666667},"Invitación directa","CargoAReserva",0,0,"NO",null,"Gerencia de Abastecimiento Estratégico\ncontratacion@positiva.gov.co\nPBX: (1)6502200 Ext: 10641","SI","SI","NO","SI","Pública clasificada","C66572022-Tipo de información Pública clasificada-Prestación de servicios: El CONTRATISTA se obliga con POSITIVA a la prestación de los servicios de salud para los asegurados y o afiliados a POSITIVA que accedan a los servicios habilitados del CONTRATISTA en calidad de asegurados a los ramos Administración de Riesgos Laborales ARL por causa exclusiva de un accidente de trabajo una enfermedad profesional) Accidentes Personales AP Educativo Generación Positiva AP Colectivos APCorto Plazo AP Individual y demás Ramos de Seguros autorizados a Positiva encontrándose excluidos del presente contrato los servicios y todas aquellas actividades procedimientos e intervenciones que no tengan por objeto contribuir al diagnóstico tratamiento o rehabilitación de la patología derivada del siniestro o los servicios considerados como experimentales cosméticos y suntuarios."]
["VICEPRESIDENCIA TÉCNICA","Gerencia Médica","NO","C66582022",85100000,"Prestación de servicios: El CONTRATISTA se obliga con POSITIVA a la prestación de los servicios de salud para los asegurados y o afiliados a POSITIVA que accedan a los servicios habilitados del CONTRATISTA en calidad de asegurados a los ramos Administración de Riesgos Laborales ARL por causa exclusiva de un accidente de trabajo una enfermedad profesional) Accidentes Personales AP Educativo Generación Positiva AP Colectivos APCorto Plazo AP Individual y demás Ramos de Seguros autorizados a Positiva encontrándose excluidos del presente contrato los servicios y todas aquellas actividades procedimientos e intervenciones que no tengan por objeto contribuir al diagnóstico tratamiento o rehabilitación de la patología derivada del siniestro o los servicios considerados como experimentales cosméticos y suntuarios.","2022-04-01",4,"2024-04-01",24.366666666666667,"Invitación directa","CargoAReserva",0,0,"NO",null,"Gerencia de Abastecimiento Estratégico\ncontratacion@positiva.gov.co\nPBX: (1)6502200 Ext: 10641","SI","SI","NO","SI","Pública clasificada","C66582022-Tipo de información Pública clasificada-Prestación de servicios: El CONTRATISTA se obliga con POSITIVA a la prestación de los servicios de salud para los asegurados y o afiliados a POSITIVA que accedan a los servicios habilitados del CONTRATISTA en calidad de asegurados a los ramos Administración de Riesgos Laborales ARL por causa exclusiva de un accidente de trabajo una enfermedad profesional) Accidentes Personales AP Educativo Generación Positiva AP Colectivos APCorto Plazo AP Individual y demás Ramos de Seguros autorizados a Positiva encontrándose excluidos del presente contrato los servicios y todas aquellas actividades procedimientos e intervenciones que no tengan por objeto contribuir al diagnóstico tratamiento o rehabilitación de la patología derivada del siniestro o los servicios considerados como experimentales cosméticos y suntuarios."]
["VICEPRESIDENCIA TÉCNICA","Gerencia Médica","NO","C66592022",85100000,"Prestación de servicios: El CONTRATISTA se obliga con POSITIVA a la prestación de los servicios de salud para los asegurados y o afiliados a POSITIVA que accedan a los servicios habilitados del CONTRATISTA en calidad de asegurados a los ramos Administración de Riesgos Laborales ARL por causa exclusiva de un accidente de trabajo una enfermedad profesional) Accidentes Personales AP Educativo Generación Positiva AP Colectivos APCorto Plazo AP Individual y demás Ramos de Seguros autorizados a Positiva encontrándose excluidos del presente contrato los servicios y todas aquellas actividades procedimientos e intervenciones que no tengan por objeto contribuir al diagnóstico tratamiento o rehabilitación de la patología derivada del siniestro o los servicios considerados como experimentales cosméticos y suntuarios.","2022-05-01",5,"2024-05-01",24.366666666666667,"Invitación directa","CargoAReserva",0,0,"NO",null,"Gerencia de Abastecimiento Estratégico\ncontratacion@positiva.gov.co\nPBX: (1)6502200 Ext: 10641","SI","SI","NO","SI","Pública clasificada","C66592022-Tipo de información Pública clasificada-Prestación de servicios: El CONTRATISTA se obliga con POSITIVA a la prestación de los servicios de salud para los asegurados y o afiliados a POSITIVA que accedan a los servicios habilitados del CONTRATISTA en calidad de asegurados a los ramos Administración de Riesgos Laborales ARL por causa exclusiva de un accidente de trabajo una enfermedad profesional) Accidentes Personales AP Educativo Generación Positiva AP Colectivos APCorto Plazo AP Individual y demás Ramos de Seguros autorizados a Positiva encontrándose excluidos del presente contrato los servicios y todas aquellas actividades procedimientos e intervenciones que no tengan por objeto contribuir al diagnóstico tratamiento o rehabilitación de la patología derivada del siniestro o los servicios considerados como experimentales cosméticos y suntuarios."]
["VICEPRESIDENCIA TÉCNICA","Gerencia Médica","NO","C66602022",85100000,"Prestación de servicios: El CONTRATISTA se obliga con POSITIVA a la prestación de los servicios de salud para los asegurados y o afiliados a POSITIVA que accedan a los servicios habilitados del CONTRATISTA en calidad de asegurados a los ramos Administración de Riesgos Laborales ARL por causa exclusiva de un accidente de trabajo una enfermedad profesional) Accidentes Personales AP Educativo Generación Positiva AP Colectivos APCorto Plazo AP Individual y demás Ramos de Seguros autorizados a Positiva encontrándose excluidos del presente contrato los servicios y todas aquellas actividades procedimientos e intervenciones que no tengan por objeto contribuir al diagnóstico tratamiento o rehabilitación de la patología derivada del siniestro o los servicios considerados como experimentales cosméticos y suntuarios.","2022-05-05",5,"2024-05-05",24.366666666666667,"Invitación directa","CargoAReserva",0,0,"NO",null,"Gerencia de Abastecimiento Estratégico\ncontratacion@positiva.gov.co\nPBX: (1)6502200 Ext: 10641","SI","SI","NO","SI","Pública clasificada","C66602022-Tipo de información Pública clasificada-Prestación de servicios: El CONTRATISTA se obliga con POSITIVA a la prestación de los servicios de salud para los asegurados y o afiliados a POSITIVA que accedan a los servicios habilitados del CONTRATISTA en calidad de asegurados a los ramos Administración de Riesgos Laborales ARL por causa exclusiva de un accidente de trabajo una enfermedad profesional) Accidentes Personales AP Educativo Generación Positiva AP Colectivos APCorto Plazo AP Individual y demás Ramos de Seguros autorizados a Positiva encontrándose excluidos del presente contrato los servicios y todas aquellas actividades procedimientos e intervenciones que no tengan por objeto contribuir al diagnóstico tratamiento o rehabilitación de la patología derivada del siniestro o los servicios considerados como experimentales cosméticos y suntuarios."]
["VICEPRESIDENCIA TÉCNICA","Gerencia Médica","NO","C66612022",85100000,"Prestación de servicios: El CONTRATISTA se obliga con POSITIVA a la prestación de los servicios de salud para los asegurados y o afiliados a POSITIVA que accedan a los servicios habilitados del CONTRATISTA en calidad de asegurados a los ramos Administración de Riesgos Laborales ARL por causa exclusiva de un accidente de trabajo una enfermedad profesional) Accidentes Personales AP Educativo Generación Positiva AP Colectivos APCorto Plazo AP Individual y demás Ramos de Seguros autorizados a Positiva encontrándose excluidos del presente contrato los servicios y todas aquellas actividades procedimientos e intervenciones que no tengan por objeto contribuir al diagnóstico tratamiento o rehabilitación de la patología derivada del siniestro o los servicios considerados como experimentales cosméticos y suntuarios.","2022-04-20",4,"2024-04-20",24.366666666666667,"Invitación directa","CargoAReserva",0,0,"NO",null,"Gerencia de Abastecimiento Estratégico\ncontratacion@positiva.gov.co\nPBX: (1)6502200 Ext: 10641","SI","SI","NO","SI","Pública clasificada","C66612022-Tipo de información Pública clasificada-Prestación de servicios: El CONTRATISTA se obliga con POSITIVA a la prestación de los servicios de salud para los asegurados y o afiliados a POSITIVA que accedan a los servicios habilitados del CONTRATISTA en calidad de asegurados a los ramos Administración de Riesgos Laborales ARL por causa exclusiva de un accidente de trabajo una enfermedad profesional) Accidentes Personales AP Educativo Generación Positiva AP Colectivos APCorto Plazo AP Individual y demás Ramos de Seguros autorizados a Positiva encontrándose excluidos del presente contrato los servicios y todas aquellas actividades procedimientos e intervenciones que no tengan por objeto contribuir al diagnóstico tratamiento o rehabilitación de la patología derivada del siniestro o los servicios considerados como experimentales cosméticos y suntuarios."]
["VICEPRESIDENCIA TÉCNICA","Gerencia Médica","NO","C66622022",85100000,"Prestación de servicios: El CONTRATISTA se obliga con POSITIVA a la prestación de los servicios de salud para los asegurados y o afiliados a POSITIVA que accedan a los servicios habilitados del CONTRATISTA en calidad de asegurados a los ramos Administración de Riesgos Laborales ARL por causa exclusiva de un accidente de trabajo una enfermedad profesional) Accidentes Personales AP Educativo Generación Positiva AP Colectivos APCorto Plazo AP Individual y demás Ramos de Seguros autorizados a Positiva encontrándose excluidos del presente contrato los servicios y todas aquellas actividades procedimientos e intervenciones que no tengan por objeto contribuir al diagnóstico tratamiento o rehabilitación de la patología derivada del siniestro o los servicios considerados como experimentales cosméticos y suntuarios.","2022-05-16",5,"2024-05-16",24.366666666666667,"Invitación directa","CargoAReserva",0,0,"NO",null,"Gerencia de Abastecimiento Estratégico\ncontratacion@positiva.gov.co\nPBX: (1)6502200 Ext: 10641","SI","SI","NO","SI","Pública clasificada","C66622022-Tipo de información Pública clasificada-Prestación de servicios: El CONTRATISTA se obliga con POSITIVA a la prestación de los servicios de salud para los asegurados y o afiliados a POSITIVA que accedan a los servicios habilitados del CONTRATISTA en calidad de asegurados a los ramos Administración de Riesgos Laborales ARL por causa exclusiva de un accidente de trabajo una enfermedad profesional) Accidentes Personales AP Educativo Generación Positiva AP Colectivos APCorto Plazo AP Individual y demás Ramos de Seguros autorizados a Positiva encontrándose excluidos del presente contrato los servicios y todas aquellas actividades procedimientos e intervenciones que no tengan por objeto contribuir al diagnóstico tratamiento o rehabilitación de la patología derivada del siniestro o los servicios considerados como experimentales cosméticos y suntuarios."]
["VICEPRESIDENCIA TÉCNICA","Gerencia Médica","NO","C66632022",85100000,"Prestación de servicios: El CONTRATISTA se obliga con POSITIVA a la prestación de los servicios de salud para los asegurados y o afiliados a POSITIVA que accedan a los servicios habilitados del CONTRATISTA en calidad de asegurados a los ramos Administración de Riesgos Laborales ARL por causa exclusiva de un accidente de trabajo una enfermedad profesional) Accidentes Personales AP Educativo Generación Positiva AP Colectivos APCorto Plazo AP Individual y demás Ramos de Seguros autorizados a Positiva encontrándose excluidos del presente contrato los servicios y todas aquellas actividades procedimientos e intervenciones que no tengan por objeto contribuir al diagnóstico tratamiento o rehabilitación de la patología derivada del siniestro o los servicios considerados como experimentales cosméticos y suntuarios.","2022-02-24",2,"2024-02-24",24.333333333333332,"Invitación directa","CargoAReserva",0,0,"NO",null,"Gerencia de Abastecimiento Estratégico\ncontratacion@positiva.gov.co\nPBX: (1)6502200 Ext: 10641","SI","SI","NO","SI","Pública clasificada","C66632022-Tipo de información Pública clasificada-Prestación de servicios: El CONTRATISTA se obliga con POSITIVA a la prestación de los servicios de salud para los asegurados y o afiliados a POSITIVA que accedan a los servicios habilitados del CONTRATISTA en calidad de asegurados a los ramos Administración de Riesgos Laborales ARL por causa exclusiva de un accidente de trabajo una enfermedad profesional) Accidentes Personales AP Educativo Generación Positiva AP Colectivos APCorto Plazo AP Individual y demás Ramos de Seguros autorizados a Positiva encontrándose excluidos del presente contrato los servicios y todas aquellas actividades procedimientos e intervenciones que no tengan por objeto contribuir al diagnóstico tratamiento o rehabilitación de la patología derivada del siniestro o los servicios considerados como experimentales cosméticos y suntuarios."]
["VICEPRESIDENCIA TÉCNICA","Gerencia Médica","NO","C66642022",85100000,"Prestación de servicios: El CONTRATISTA se obliga con POSITIVA a la prestación de los servicios de salud para los asegurados y o afiliados a POSITIVA que accedan a los servicios habilitados del CONTRATISTA en calidad de asegurados a los ramos Administración de Riesgos Laborales ARL por causa exclusiva de un accidente de trabajo una enfermedad profesional) Accidentes Personales AP Educativo Generación Positiva AP Colectivos APCorto Plazo AP Individual y demás Ramos de Seguros autorizados a Positiva encontrándose excluidos del presente contrato los servicios y todas aquellas actividades procedimientos e intervenciones que no tengan por objeto contribuir al diagnóstico tratamiento o rehabilitación de la patología derivada del siniestro o los servicios considerados como experimentales cosméticos y suntuarios.","2022-05-30",5,"2024-05-30",24.366666666666667,"Invitación directa","CargoAReserva",0,0,"NO",null,"Gerencia de Abastecimiento Estratégico\ncontratacion@positiva.gov.co\nPBX: (1)6502200 Ext: 10641","SI","SI","NO","SI","Pública clasificada","C66642022-Tipo de información Pública clasificada-Prestación de servicios: El CONTRATISTA se obliga con POSITIVA a la prestación de los servicios de salud para los asegurados y o afiliados a POSITIVA que accedan a los servicios habilitados del CONTRATISTA en calidad de asegurados a los ramos Administración de Riesgos Laborales ARL por causa exclusiva de un accidente de trabajo una enfermedad profesional) Accidentes Personales AP Educativo Generación Positiva AP Colectivos APCorto Plazo AP Individual y demás Ramos de Seguros autorizados a Positiva encontrándose excluidos del presente contrato los servicios y todas aquellas actividades procedimientos e intervenciones que no tengan por objeto contribuir al diagnóstico tratamiento o rehabilitación de la patología derivada del siniestro o los servicios considerados como experimentales cosméticos y suntuarios."]
["VICEPRESIDENCIA TÉCNICA","Gerencia Médica","NO","C66652022",85100000,"Prestación de servicios: El CONTRATISTA se obliga con POSITIVA a la prestación de los servicios de salud para los asegurados y o afiliados a POSITIVA que accedan a los servicios habilitados del CONTRATISTA en calidad de asegurados a los ramos Administración de Riesgos Laborales ARL por causa exclusiva de un accidente de trabajo una enfermedad profesional) Accidentes Personales AP Educativo Generación Positiva AP Colectivos APCorto Plazo AP Individual y demás Ramos de Seguros autorizados a Positiva encontrándose excluidos del presente contrato los servicios y todas aquellas actividades procedimientos e intervenciones que no tengan por objeto contribuir al diagnóstico tratamiento o rehabilitación de la patología derivada del siniestro o los servicios considerados como experimentales cosméticos y suntuarios.","2022-08-15",8,"2027-08-15",60.866666666666667,"Invitación directa","CargoAReserva",0,0,"NO",null,"Gerencia de Abastecimiento Estratégico\ncontratacion@positiva.gov.co\nPBX: (1)6502200 Ext: 10641","SI","SI","NO","SI","Pública clasificada","C66652022-Tipo de información Pública clasificada-Prestación de servicios: El CONTRATISTA se obliga con POSITIVA a la prestación de los servicios de salud para los asegurados y o afiliados a POSITIVA que accedan a los servicios habilitados del CONTRATISTA en calidad de asegurados a los ramos Administración de Riesgos Laborales ARL por causa exclusiva de un accidente de trabajo una enfermedad profesional) Accidentes Personales AP Educativo Generación Positiva AP Colectivos APCorto Plazo AP Individual y demás Ramos de Seguros autorizados a Positiva encontrándose excluidos del presente contrato los servicios y todas aquellas actividades procedimientos e intervenciones que no tengan por objeto contribuir al diagnóstico tratamiento o rehabilitación de la patología derivada del siniestro o los servicios considerados como experimentales cosméticos y suntuarios."]
["VICEPRESIDENCIA TÉCNICA","Gerencia Médica","NO","C66662022",85100000,"Prestación de servicios: El CONTRATISTA se obliga con POSITIVA a la prestación de los servicios de salud para los asegurados y o afiliados a POSITIVA que accedan a los servicios habilitados del CONTRATISTA en calidad de asegurados a los ramos Administración de Riesgos Laborales ARL por causa exclusiva de un accidente de trabajo una enfermedad profesional) Accidentes Personales AP Educativo Generación Positiva AP Colectivos APCorto Plazo AP Individual y demás Ramos de Seguros autorizados a Positiva encontrándose excluidos del presente contrato los servicios y todas aquellas actividades procedimientos e intervenciones que no tengan por objeto contribuir al diagnóstico tratamiento o rehabilitación de la patología derivada del siniestro o los servicios considerados como experimentales cosméticos y suntuarios.","2022-12-28",12,"2024-12-28",24.366666666666667,"Invitación directa","CargoAReserva",0,0,"NO",null,"Gerencia de Abastecimiento Estratégico\ncontratacion@positiva.gov.co\nPBX: (1)6502200 Ext: 10641","SI","SI","NO","SI","Pública clasificada","C66662022-Tipo de información Pública clasificada-Prestación de servicios: El CONTRATISTA se obliga con POSITIVA a la prestación de los servicios de salud para los asegurados y o afiliados a POSITIVA que accedan a los servicios habilitados del CONTRATISTA en calidad de asegurados a los ramos Administración de Riesgos Laborales ARL por causa exclusiva de un accidente de trabajo una enfermedad profesional) Accidentes Personales AP Educativo Generación Positiva AP Colectivos APCorto Plazo AP Individual y demás Ramos de Seguros autorizados a Positiva encontrándose excluidos del presente contrato los servicios y todas aquellas actividades procedimientos e intervenciones que no tengan por objeto contribuir al diagnóstico tratamiento o rehabilitación de la patología derivada del siniestro o los servicios considerados como experimentales cosméticos y suntuarios."]
["VICEPRESIDENCIA TÉCNICA","Gerencia Médica","NO","C66682022",85100000,"Prestación de servicios: El CONTRATISTA se obliga con POSITIVA a la prestación de los servicios de salud para los asegurados y o afiliados a POSITIVA que accedan a los servicios habilitados del CONTRATISTA en calidad de asegurados a los ramos Administración de Riesgos Laborales ARL por causa exclusiva de un accidente de trabajo una enfermedad profesional) Accidentes Personales AP Educativo Generación Positiva AP Colectivos APCorto Plazo AP Individual y demás Ramos de Seguros autorizados a Positiva encontrándose excluidos del presente contrato los servicios y todas aquellas actividades procedimientos e intervenciones que no tengan por objeto contribuir al diagnóstico tratamiento o rehabilitación de la patología derivada del siniestro o los servicios considerados como experimentales cosméticos y suntuarios.","2022-10-09",10,"2024-10-09",24.366666666666667,"Invitación directa","CargoAReserva",0,0,"NO",null,"Gerencia de Abastecimiento Estratégico\ncontratacion@positiva.gov.co\nPBX: (1)6502200 Ext: 10641","SI","SI","NO","SI","Pública clasificada","C66682022-Tipo de información Pública clasificada-Prestación de servicios: El CONTRATISTA se obliga con POSITIVA a la prestación de los servicios de salud para los asegurados y o afiliados a POSITIVA que accedan a los servicios habilitados del CONTRATISTA en calidad de asegurados a los ramos Administración de Riesgos Laborales ARL por causa exclusiva de un accidente de trabajo una enfermedad profesional) Accidentes Personales AP Educativo Generación Positiva AP Colectivos APCorto Plazo AP Individual y demás Ramos de Seguros autorizados a Positiva encontrándose excluidos del presente contrato los servicios y todas aquellas actividades procedimientos e intervenciones que no tengan por objeto contribuir al diagnóstico tratamiento o rehabilitación de la patología derivada del siniestro o los servicios considerados como experimentales cosméticos y suntuarios."]
["VICEPRESIDENCIA TÉCNICA","Gerencia Médica","NO","C66692022",85100000,"Prestación de servicios: El CONTRATISTA se obliga con POSITIVA a la prestación de los servicios de salud para los asegurados y o afiliados a POSITIVA que accedan a los servicios habilitados del CONTRATISTA en calidad de asegurados a los ramos Administración de Riesgos Laborales ARL por causa exclusiva de un accidente de trabajo una enfermedad profesional) Accidentes Personales AP Educativo Generación Positiva AP Colectivos APCorto Plazo AP Individual y demás Ramos de Seguros autorizados a Positiva encontrándose excluidos del presente contrato los servicios y todas aquellas actividades procedimientos e intervenciones que no tengan por objeto contribuir al diagnóstico tratamiento o rehabilitación de la patología derivada del siniestro o los servicios considerados como experimentales cosméticos y suntuarios.","2022-05-28",5,"2024-05-28",24.366666666666667,"Invitación directa","CargoAReserva",0,0,"NO",null,"Gerencia de Abastecimiento Estratégico\ncontratacion@positiva.gov.co\nPBX: (1)6502200 Ext: 10641","SI","SI","NO","SI","Pública clasificada","C66692022-Tipo de información Pública clasificada-Prestación de servicios: El CONTRATISTA se obliga con POSITIVA a la prestación de los servicios de salud para los asegurados y o afiliados a POSITIVA que accedan a los servicios habilitados del CONTRATISTA en calidad de asegurados a los ramos Administración de Riesgos Laborales ARL por causa exclusiva de un accidente de trabajo una enfermedad profesional) Accidentes Personales AP Educativo Generación Positiva AP Colectivos APCorto Plazo AP Individual y demás Ramos de Seguros autorizados a Positiva encontrándose excluidos del presente contrato los servicios y todas aquellas actividades procedimientos e intervenciones que no tengan por objeto contribuir al diagnóstico tratamiento o rehabilitación de la patología derivada del siniestro o los servicios considerados como experimentales cosméticos y suntuarios."]
["VICEPRESIDENCIA TÉCNICA","Gerencia Médica","NO","C66702022",85100000,"Prestación de servicios: El CONTRATISTA se obliga con POSITIVA a la prestación de los servicios de salud para los asegurados y o afiliados a POSITIVA que accedan a los servicios habilitados del CONTRATISTA en calidad de asegurados a los ramos Administración de Riesgos Laborales ARL por causa exclusiva de un accidente de trabajo una enfermedad profesional) Accidentes Personales AP Educativo Generación Positiva AP Colectivos APCorto Plazo AP Individual y demás Ramos de Seguros autorizados a Positiva encontrándose excluidos del presente contrato los servicios y todas aquellas actividades procedimientos e intervenciones que no tengan por objeto contribuir al diagnóstico tratamiento o rehabilitación de la patología derivada del siniestro o los servicios considerados como experimentales cosméticos y suntuarios.","2022-10-01",10,"2024-10-30",25.333333333333332,"Invitación directa","CargoAReserva",0,0,"NO",null,"Gerencia de Abastecimiento Estratégico\ncontratacion@positiva.gov.co\nPBX: (1)6502200 Ext: 10641","SI","SI","NO","SI","Pública clasificada","C66702022-Tipo de información Pública clasificada-Prestación de servicios: El CONTRATISTA se obliga con POSITIVA a la prestación de los servicios de salud para los asegurados y o afiliados a POSITIVA que accedan a los servicios habilitados del CONTRATISTA en calidad de asegurados a los ramos Administración de Riesgos Laborales ARL por causa exclusiva de un accidente de trabajo una enfermedad profesional) Accidentes Personales AP Educativo Generación Positiva AP Colectivos APCorto Plazo AP Individual y demás Ramos de Seguros autorizados a Positiva encontrándose excluidos del presente contrato los servicios y todas aquellas actividades procedimientos e intervenciones que no tengan por objeto contribuir al diagnóstico tratamiento o rehabilitación de la patología derivada del siniestro o los servicios considerados como experimentales cosméticos y suntuarios."]
["VICEPRESIDENCIA TÉCNICA","Gerencia Médica","NO","C66712022",85100000,"Prestación de servicios: El CONTRATISTA se obliga con POSITIVA a la prestación de los servicios de salud para los asegurados y o afiliados a POSITIVA que accedan a los servicios habilitados del CONTRATISTA en calidad de asegurados a los ramos Administración de Riesgos Laborales ARL por causa exclusiva de un accidente de trabajo una enfermedad profesional) Accidentes Personales AP Educativo Generación Positiva AP Colectivos APCorto Plazo AP Individual y demás Ramos de Seguros autorizados a Positiva encontrándose excluidos del presente contrato los servicios y todas aquellas actividades procedimientos e intervenciones que no tengan por objeto contribuir al diagnóstico tratamiento o rehabilitación de la patología derivada del siniestro o los servicios considerados como experimentales cosméticos y suntuarios.","2022-08-01",8,"2027-08-01",60.866666666666667,"Invitación directa","CargoAReserva",0,0,"NO",null,"Gerencia de Abastecimiento Estratégico\ncontratacion@positiva.gov.co\nPBX: (1)6502200 Ext: 10641","SI","SI","NO","SI","Pública clasificada","C66712022-Tipo de información Pública clasificada-Prestación de servicios: El CONTRATISTA se obliga con POSITIVA a la prestación de los servicios de salud para los asegurados y o afiliados a POSITIVA que accedan a los servicios habilitados del CONTRATISTA en calidad de asegurados a los ramos Administración de Riesgos Laborales ARL por causa exclusiva de un accidente de trabajo una enfermedad profesional) Accidentes Personales AP Educativo Generación Positiva AP Colectivos APCorto Plazo AP Individual y demás Ramos de Seguros autorizados a Positiva encontrándose excluidos del presente contrato los servicios y todas aquellas actividades procedimientos e intervenciones que no tengan por objeto contribuir al diagnóstico tratamiento o rehabilitación de la patología derivada del siniestro o los servicios considerados como experimentales cosméticos y suntuarios."]
["VICEPRESIDENCIA TÉCNICA","Gerencia Médica","NO","C66722022",85100000,"Prestación de servicios: El CONTRATISTA se obliga con POSITIVA a la prestación de los servicios de salud para los asegurados y o afiliados a POSITIVA que accedan a los servicios habilitados del CONTRATISTA en calidad de asegurados a los ramos Administración de Riesgos Laborales ARL por causa exclusiva de un accidente de trabajo una enfermedad profesional) Accidentes Personales AP Educativo Generación Positiva AP Colectivos APCorto Plazo AP Individual y demás Ramos de Seguros autorizados a Positiva encontrándose excluidos del presente contrato los servicios y todas aquellas actividades procedimientos e intervenciones que no tengan por objeto contribuir al diagnóstico tratamiento o rehabilitación de la patología derivada del siniestro o los servicios considerados como experimentales cosméticos y suntuarios.","2022-07-01",7,"2024-07-01",24.366666666666667,"Invitación directa","CargoAReserva",0,0,"NO",null,"Gerencia de Abastecimiento Estratégico\ncontratacion@positiva.gov.co\nPBX: (1)6502200 Ext: 10641","SI","SI","NO","SI","Pública clasificada","C66722022-Tipo de información Pública clasificada-Prestación de servicios: El CONTRATISTA se obliga con POSITIVA a la prestación de los servicios de salud para los asegurados y o afiliados a POSITIVA que accedan a los servicios habilitados del CONTRATISTA en calidad de asegurados a los ramos Administración de Riesgos Laborales ARL por causa exclusiva de un accidente de trabajo una enfermedad profesional) Accidentes Personales AP Educativo Generación Positiva AP Colectivos APCorto Plazo AP Individual y demás Ramos de Seguros autorizados a Positiva encontrándose excluidos del presente contrato los servicios y todas aquellas actividades procedimientos e intervenciones que no tengan por objeto contribuir al diagnóstico tratamiento o rehabilitación de la patología derivada del siniestro o los servicios considerados como experimentales cosméticos y suntuarios."]
["VICEPRESIDENCIA TÉCNICA","Gerencia Médica","NO","C66732022",85100000,"Prestación de servicios: El CONTRATISTA se obliga con POSITIVA a la prestación de los servicios de salud para los asegurados y o afiliados a POSITIVA que accedan a los servicios habilitados del CONTRATISTA en calidad de asegurados a los ramos Administración de Riesgos Laborales ARL por causa exclusiva de un accidente de trabajo una enfermedad profesional) Accidentes Personales AP Educativo Generación Positiva AP Colectivos APCorto Plazo AP Individual y demás Ramos de Seguros autorizados a Positiva encontrándose excluidos del presente contrato los servicios y todas aquellas actividades procedimientos e intervenciones que no tengan por objeto contribuir al diagnóstico tratamiento o rehabilitación de la patología derivada del siniestro o los servicios considerados como experimentales cosméticos y suntuarios.","2022-09-01",9,"2027-09-01",60.866666666666667,"Invitación directa","CargoAReserva",0,0,"NO",null,"Gerencia de Abastecimiento Estratégico\ncontratacion@positiva.gov.co\nPBX: (1)6502200 Ext: 10641","SI","SI","NO","SI","Pública clasificada","C66732022-Tipo de información Pública clasificada-Prestación de servicios: El CONTRATISTA se obliga con POSITIVA a la prestación de los servicios de salud para los asegurados y o afiliados a POSITIVA que accedan a los servicios habilitados del CONTRATISTA en calidad de asegurados a los ramos Administración de Riesgos Laborales ARL por causa exclusiva de un accidente de trabajo una enfermedad profesional) Accidentes Personales AP Educativo Generación Positiva AP Colectivos APCorto Plazo AP Individual y demás Ramos de Seguros autorizados a Positiva encontrándose excluidos del presente contrato los servicios y todas aquellas actividades procedimientos e intervenciones que no tengan por objeto contribuir al diagnóstico tratamiento o rehabilitación de la patología derivada del siniestro o los servicios considerados como experimentales cosméticos y suntuarios."]
["VICEPRESIDENCIA TÉCNICA","Gerencia Médica","NO","C66742022",85100000,"Prestación de servicios: El CONTRATISTA se obliga con POSITIVA a la prestación de los servicios de salud para los asegurados y o afiliados a POSITIVA que accedan a los servicios habilitados del CONTRATISTA en calidad de asegurados a los ramos Administración de Riesgos Laborales ARL por causa exclusiva de un accidente de trabajo una enfermedad profesional) Accidentes Personales AP Educativo Generación Positiva AP Colectivos APCorto Plazo AP Individual y demás Ramos de Seguros autorizados a Positiva encontrándose excluidos del presente contrato los servicios y todas aquellas actividades procedimientos e intervenciones que no tengan por objeto contribuir al diagnóstico tratamiento o rehabilitación de la patología derivada del siniestro o los servicios considerados como experimentales cosméticos y suntuarios.","2022-10-01",10,"2027-10-01",60.866666666666667,"Invitación directa","CargoAReserva",0,0,"NO",null,"Gerencia de Abastecimiento Estratégico\ncontratacion@positiva.gov.co\nPBX: (1)6502200 Ext: 10641","SI","SI","NO","SI","Pública clasificada","C66742022-Tipo de información Pública clasificada-Prestación de servicios: El CONTRATISTA se obliga con POSITIVA a la prestación de los servicios de salud para los asegurados y o afiliados a POSITIVA que accedan a los servicios habilitados del CONTRATISTA en calidad de asegurados a los ramos Administración de Riesgos Laborales ARL por causa exclusiva de un accidente de trabajo una enfermedad profesional) Accidentes Personales AP Educativo Generación Positiva AP Colectivos APCorto Plazo AP Individual y demás Ramos de Seguros autorizados a Positiva encontrándose excluidos del presente contrato los servicios y todas aquellas actividades procedimientos e intervenciones que no tengan por objeto contribuir al diagnóstico tratamiento o rehabilitación de la patología derivada del siniestro o los servicios considerados como experimentales cosméticos y suntuarios."]
["VICEPRESIDENCIA TÉCNICA","Gerencia Médica","NO","C66752022",85100000,"Prestación de servicios: El CONTRATISTA se obliga con POSITIVA a la prestación de los servicios de salud para los asegurados y o afiliados a POSITIVA que accedan a los servicios habilitados del CONTRATISTA en calidad de asegurados a los ramos Administración de Riesgos Laborales ARL por causa exclusiva de un accidente de trabajo una enfermedad profesional) Accidentes Personales AP Educativo Generación Positiva AP Colectivos APCorto Plazo AP Individual y demás Ramos de Seguros autorizados a Positiva encontrándose excluidos del presente contrato los servicios y todas aquellas actividades procedimientos e intervenciones que no tengan por objeto contribuir al diagnóstico tratamiento o rehabilitación de la patología derivada del siniestro o los servicios considerados como experimentales cosméticos y suntuarios.","2022-11-01",11,"2027-11-01",60.866666666666667,"Invitación directa","CargoAReserva",0,0,"NO",null,"Gerencia de Abastecimiento Estratégico\ncontratacion@positiva.gov.co\nPBX: (1)6502200 Ext: 10641","SI","SI","NO","SI","Pública clasificada","C66752022-Tipo de información Pública clasificada-Prestación de servicios: El CONTRATISTA se obliga con POSITIVA a la prestación de los servicios de salud para los asegurados y o afiliados a POSITIVA que accedan a los servicios habilitados del CONTRATISTA en calidad de asegurados a los ramos Administración de Riesgos Laborales ARL por causa exclusiva de un accidente de trabajo una enfermedad profesional) Accidentes Personales AP Educativo Generación Positiva AP Colectivos APCorto Plazo AP Individual y demás Ramos de Seguros autorizados a Positiva encontrándose excluidos del presente contrato los servicios y todas aquellas actividades procedimientos e intervenciones que no tengan por objeto contribuir al diagnóstico tratamiento o rehabilitación de la patología derivada del siniestro o los servicios considerados como experimentales cosméticos y suntuarios."]
["VICEPRESIDENCIA TÉCNICA","Gerencia Médica","NO","C66762022",85100000,"Prestación de servicios: El CONTRATISTA se obliga con POSITIVA a la prestación de los servicios de salud para los asegurados y o afiliados a POSITIVA que accedan a los servicios habilitados del CONTRATISTA en calidad de asegurados a los ramos Administración de Riesgos Laborales ARL por causa exclusiva de un accidente de trabajo una enfermedad profesional) Accidentes Personales AP Educativo Generación Positiva AP Colectivos APCorto Plazo AP Individual y demás Ramos de Seguros autorizados a Positiva encontrándose excluidos del presente contrato los servicios y todas aquellas actividades procedimientos e intervenciones que no tengan por objeto contribuir al diagnóstico tratamiento o rehabilitación de la patología derivada del siniestro o los servicios considerados como experimentales cosméticos y suntuarios.","2022-08-01",8,"2024-08-01",24.366666666666667,"Invitación directa","CargoAReserva",0,0,"NO",null,"Gerencia de Abastecimiento Estratégico\ncontratacion@positiva.gov.co\nPBX: (1)6502200 Ext: 10641","SI","SI","NO","SI","Pública clasificada","C66762022-Tipo de información Pública clasificada-Prestación de servicios: El CONTRATISTA se obliga con POSITIVA a la prestación de los servicios de salud para los asegurados y o afiliados a POSITIVA que accedan a los servicios habilitados del CONTRATISTA en calidad de asegurados a los ramos Administración de Riesgos Laborales ARL por causa exclusiva de un accidente de trabajo una enfermedad profesional) Accidentes Personales AP Educativo Generación Positiva AP Colectivos APCorto Plazo AP Individual y demás Ramos de Seguros autorizados a Positiva encontrándose excluidos del presente contrato los servicios y todas aquellas actividades procedimientos e intervenciones que no tengan por objeto contribuir al diagnóstico tratamiento o rehabilitación de la patología derivada del siniestro o los servicios considerados como experimentales cosméticos y suntuarios."]
["VICEPRESIDENCIA TÉCNICA","Gerencia Médica","NO","C66772022",85100000,"Prestación de servicios: El CONTRATISTA se obliga con POSITIVA a la prestación de los servicios de salud para los asegurados y o afiliados a POSITIVA que accedan a los servicios habilitados del CONTRATISTA en calidad de asegurados a los ramos Administración de Riesgos Laborales ARL por causa exclusiva de un accidente de trabajo una enfermedad profesional) Accidentes Personales AP Educativo Generación Positiva AP Colectivos APCorto Plazo AP Individual y demás Ramos de Seguros autorizados a Positiva encontrándose excluidos del presente contrato los servicios y todas aquellas actividades procedimientos e intervenciones que no tengan por objeto contribuir al diagnóstico tratamiento o rehabilitación de la patología derivada del siniestro o los servicios considerados como experimentales cosméticos y suntuarios.","2022-09-01",9,"2024-09-01",24.366666666666667,"Invitación directa","CargoAReserva",0,0,"NO",null,"Gerencia de Abastecimiento Estratégico\ncontratacion@positiva.gov.co\nPBX: (1)6502200 Ext: 10641","SI","SI","NO","SI","Pública clasificada","C66772022-Tipo de información Pública clasificada-Prestación de servicios: El CONTRATISTA se obliga con POSITIVA a la prestación de los servicios de salud para los asegurados y o afiliados a POSITIVA que accedan a los servicios habilitados del CONTRATISTA en calidad de asegurados a los ramos Administración de Riesgos Laborales ARL por causa exclusiva de un accidente de trabajo una enfermedad profesional) Accidentes Personales AP Educativo Generación Positiva AP Colectivos APCorto Plazo AP Individual y demás Ramos de Seguros autorizados a Positiva encontrándose excluidos del presente contrato los servicios y todas aquellas actividades procedimientos e intervenciones que no tengan por objeto contribuir al diagnóstico tratamiento o rehabilitación de la patología derivada del siniestro o los servicios considerados como experimentales cosméticos y suntuarios."]
["VICEPRESIDENCIA TÉCNICA","Gerencia Médica","NO","C66782022",85100000,"Prestación de servicios: El CONTRATISTA se obliga con POSITIVA a la prestación de los servicios de salud para los asegurados y o afiliados a POSITIVA que accedan a los servicios habilitados del CONTRATISTA en calidad de asegurados a los ramos Administración de Riesgos Laborales ARL por causa exclusiva de un accidente de trabajo una enfermedad profesional) Accidentes Personales AP Educativo Generación Positiva AP Colectivos APCorto Plazo AP Individual y demás Ramos de Seguros autorizados a Positiva encontrándose excluidos del presente contrato los servicios y todas aquellas actividades procedimientos e intervenciones que no tengan por objeto contribuir al diagnóstico tratamiento o rehabilitación de la patología derivada del siniestro o los servicios considerados como experimentales cosméticos y suntuarios.","2022-02-01",2,"2027-02-01",60.866666666666667,"Invitación directa","CargoAReserva",0,0,"NO",null,"Gerencia de Abastecimiento Estratégico\ncontratacion@positiva.gov.co\nPBX: (1)6502200 Ext: 10641","SI","SI","NO","SI","Pública clasificada","C66782022-Tipo de información Pública clasificada-Prestación de servicios: El CONTRATISTA se obliga con POSITIVA a la prestación de los servicios de salud para los asegurados y o afiliados a POSITIVA que accedan a los servicios habilitados del CONTRATISTA en calidad de asegurados a los ramos Administración de Riesgos Laborales ARL por causa exclusiva de un accidente de trabajo una enfermedad profesional) Accidentes Personales AP Educativo Generación Positiva AP Colectivos APCorto Plazo AP Individual y demás Ramos de Seguros autorizados a Positiva encontrándose excluidos del presente contrato los servicios y todas aquellas actividades procedimientos e intervenciones que no tengan por objeto contribuir al diagnóstico tratamiento o rehabilitación de la patología derivada del siniestro o los servicios considerados como experimentales cosméticos y suntuarios."]
["VICEPRESIDENCIA TÉCNICA","Gerencia Médica","NO","C66792022",85100000,"Prestación de servicios: El CONTRATISTA se obliga con POSITIVA a la prestación de los servicios de salud para los asegurados y o afiliados a POSITIVA que accedan a los servicios habilitados del CONTRATISTA en calidad de asegurados a los ramos Administración de Riesgos Laborales ARL por causa exclusiva de un accidente de trabajo una enfermedad profesional) Accidentes Personales AP Educativo Generación Positiva AP Colectivos APCorto Plazo AP Individual y demás Ramos de Seguros autorizados a Positiva encontrándose excluidos del presente contrato los servicios y todas aquellas actividades procedimientos e intervenciones que no tengan por objeto contribuir al diagnóstico tratamiento o rehabilitación de la patología derivada del siniestro o los servicios considerados como experimentales cosméticos y suntuarios.","2022-03-01",3,"2027-03-01",60.866666666666667,"Invitación directa","CargoAReserva",0,0,"NO",null,"Gerencia de Abastecimiento Estratégico\ncontratacion@positiva.gov.co\nPBX: (1)6502200 Ext: 10641","SI","SI","NO","SI","Pública clasificada","C66792022-Tipo de información Pública clasificada-Prestación de servicios: El CONTRATISTA se obliga con POSITIVA a la prestación de los servicios de salud para los asegurados y o afiliados a POSITIVA que accedan a los servicios habilitados del CONTRATISTA en calidad de asegurados a los ramos Administración de Riesgos Laborales ARL por causa exclusiva de un accidente de trabajo una enfermedad profesional) Accidentes Personales AP Educativo Generación Positiva AP Colectivos APCorto Plazo AP Individual y demás Ramos de Seguros autorizados a Positiva encontrándose excluidos del presente contrato los servicios y todas aquellas actividades procedimientos e intervenciones que no tengan por objeto contribuir al diagnóstico tratamiento o rehabilitación de la patología derivada del siniestro o los servicios considerados como experimentales cosméticos y suntuarios."]
["VICEPRESIDENCIA TÉCNICA","Gerencia Médica","NO","C66802022",85100000,"Prestación de servicios: El CONTRATISTA se obliga con POSITIVA a la prestación de los servicios de salud para los asegurados y o afiliados a POSITIVA que accedan a los servicios habilitados del CONTRATISTA en calidad de asegurados a los ramos Administración de Riesgos Laborales ARL por causa exclusiva de un accidente de trabajo una enfermedad profesional) Accidentes Personales AP Educativo Generación Positiva AP Colectivos APCorto Plazo AP Individual y demás Ramos de Seguros autorizados a Positiva encontrándose excluidos del presente contrato los servicios y todas aquellas actividades procedimientos e intervenciones que no tengan por objeto contribuir al diagnóstico tratamiento o rehabilitación de la patología derivada del siniestro o los servicios considerados como experimentales cosméticos y suntuarios.","2022-04-01",4,"2027-04-01",60.866666666666667,"Invitación directa","CargoAReserva",0,0,"NO",null,"Gerencia de Abastecimiento Estratégico\ncontratacion@positiva.gov.co\nPBX: (1)6502200 Ext: 10641","SI","SI","NO","SI","Pública clasificada","C66802022-Tipo de información Pública clasificada-Prestación de servicios: El CONTRATISTA se obliga con POSITIVA a la prestación de los servicios de salud para los asegurados y o afiliados a POSITIVA que accedan a los servicios habilitados del CONTRATISTA en calidad de asegurados a los ramos Administración de Riesgos Laborales ARL por causa exclusiva de un accidente de trabajo una enfermedad profesional) Accidentes Personales AP Educativo Generación Positiva AP Colectivos APCorto Plazo AP Individual y demás Ramos de Seguros autorizados a Positiva encontrándose excluidos del presente contrato los servicios y todas aquellas actividades procedimientos e intervenciones que no tengan por objeto contribuir al diagnóstico tratamiento o rehabilitación de la patología derivada del siniestro o los servicios considerados como experimentales cosméticos y suntuarios."]
["VICEPRESIDENCIA TÉCNICA","Gerencia Médica","NO","C66812022",85100000,"Prestación de servicios: El CONTRATISTA se obliga con POSITIVA a la prestación de los servicios de salud para los asegurados y o afiliados a POSITIVA que accedan a los servicios habilitados del CONTRATISTA en calidad de asegurados a los ramos Administración de Riesgos Laborales ARL por causa exclusiva de un accidente de trabajo una enfermedad profesional) Accidentes Personales AP Educativo Generación Positiva AP Colectivos APCorto Plazo AP Individual y demás Ramos de Seguros autorizados a Positiva encontrándose excluidos del presente contrato los servicios y todas aquellas actividades procedimientos e intervenciones que no tengan por objeto contribuir al diagnóstico tratamiento o rehabilitación de la patología derivada del siniestro o los servicios considerados como experimentales cosméticos y suntuarios.","2022-10-01",10,"2024-10-30",25.333333333333332,"Invitación directa","CargoAReserva",0,0,"NO",null,"Gerencia de Abastecimiento Estratégico\ncontratacion@positiva.gov.co\nPBX: (1)6502200 Ext: 10641","SI","SI","NO","SI","Pública clasificada","C66812022-Tipo de información Pública clasificada-Prestación de servicios: El CONTRATISTA se obliga con POSITIVA a la prestación de los servicios de salud para los asegurados y o afiliados a POSITIVA que accedan a los servicios habilitados del CONTRATISTA en calidad de asegurados a los ramos Administración de Riesgos Laborales ARL por causa exclusiva de un accidente de trabajo una enfermedad profesional) Accidentes Personales AP Educativo Generación Positiva AP Colectivos APCorto Plazo AP Individual y demás Ramos de Seguros autorizados a Positiva encontrándose excluidos del presente contrato los servicios y todas aquellas actividades procedimientos e intervenciones que no tengan por objeto contribuir al diagnóstico tratamiento o rehabilitación de la patología derivada del siniestro o los servicios considerados como experimentales cosméticos y suntuarios."]
["VICEPRESIDENCIA TÉCNICA","Gerencia Médica","NO","C66832022",85100000,"Prestación de servicios: El CONTRATISTA se obliga con POSITIVA a la prestación de los servicios de salud para los asegurados y o afiliados a POSITIVA que accedan a los servicios habilitados del CONTRATISTA en calidad de asegurados a los ramos Administración de Riesgos Laborales ARL por causa exclusiva de un accidente de trabajo una enfermedad profesional) Accidentes Personales AP Educativo Generación Positiva AP Colectivos APCorto Plazo AP Individual y demás Ramos de Seguros autorizados a Positiva encontrándose excluidos del presente contrato los servicios y todas aquellas actividades procedimientos e intervenciones que no tengan por objeto contribuir al diagnóstico tratamiento o rehabilitación de la patología derivada del siniestro o los servicios considerados como experimentales cosméticos y suntuarios.","2022-09-20",9,"2024-09-20",24.366666666666667,"Invitación directa","CargoAReserva",0,0,"NO",null,"Gerencia de Abastecimiento Estratégico\ncontratacion@positiva.gov.co\nPBX: (1)6502200 Ext: 10641","SI","SI","NO","SI","Pública clasificada","C66832022-Tipo de información Pública clasificada-Prestación de servicios: El CONTRATISTA se obliga con POSITIVA a la prestación de los servicios de salud para los asegurados y o afiliados a POSITIVA que accedan a los servicios habilitados del CONTRATISTA en calidad de asegurados a los ramos Administración de Riesgos Laborales ARL por causa exclusiva de un accidente de trabajo una enfermedad profesional) Accidentes Personales AP Educativo Generación Positiva AP Colectivos APCorto Plazo AP Individual y demás Ramos de Seguros autorizados a Positiva encontrándose excluidos del presente contrato los servicios y todas aquellas actividades procedimientos e intervenciones que no tengan por objeto contribuir al diagnóstico tratamiento o rehabilitación de la patología derivada del siniestro o los servicios considerados como experimentales cosméticos y suntuarios."]
["VICEPRESIDENCIA TÉCNICA","Gerencia Médica","NO","C66842022",85100000,"Prestación de servicios: El CONTRATISTA se obliga con POSITIVA a la prestación de los servicios de salud para los asegurados y o afiliados a POSITIVA que accedan a los servicios habilitados del CONTRATISTA en calidad de asegurados a los ramos Administración de Riesgos Laborales ARL por causa exclusiva de un accidente de trabajo una enfermedad profesional) Accidentes Personales AP Educativo Generación Positiva AP Colectivos APCorto Plazo AP Individual y demás Ramos de Seguros autorizados a Positiva encontrándose excluidos del presente contrato los servicios y todas aquellas actividades procedimientos e intervenciones que no tengan por objeto contribuir al diagnóstico tratamiento o rehabilitación de la patología derivada del siniestro o los servicios considerados como experimentales cosméticos y suntuarios.","2022-10-01",10,"2024-10-01",24.366666666666667,"Invitación directa","CargoAReserva",0,0,"NO",null,"Gerencia de Abastecimiento Estratégico\ncontratacion@positiva.gov.co\nPBX: (1)6502200 Ext: 10641","SI","SI","NO","SI",{"$f":"IF(U630=\"SI\",\"Pública clasificada\",\"Pública\")","v":"Pública clasificada"},{"$f":"CONCATENATE(D630,\"-\",\"Tipo de información\",\" \",V630,\"-\",F630)","v":"C66842022-Tipo de información Pública clasificada-Prestación de servicios: El CONTRATISTA se obliga con POSITIVA a la prestación de los servicios de salud para los asegurados y o afiliados a POSITIVA que accedan a los servicios habilitados del CONTRATISTA en calidad de asegurados a los ramos Administración de Riesgos Laborales ARL por causa exclusiva de un accidente de trabajo una enfermedad profesional) Accidentes Personales AP Educativo Generación Positiva AP Colectivos APCorto Plazo AP Individual y demás Ramos de Seguros autorizados a Positiva encontrándose excluidos del presente contrato los servicios y todas aquellas actividades procedimientos e intervenciones que no tengan por objeto contribuir al diagnóstico tratamiento o rehabilitación de la patología derivada del siniestro o los servicios considerados como experimentales cosméticos y suntuarios."}]
["VICEPRESIDENCIA TÉCNICA","Gerencia Médica","NO","C66862022",85100000,"Prestación de servicios: El CONTRATISTA se obliga con POSITIVA a la prestación de los servicios de salud para los asegurados y o afiliados a POSITIVA que accedan a los servicios habilitados del CONTRATISTA en calidad de asegurados a los ramos Administración de Riesgos Laborales ARL por causa exclusiva de un accidente de trabajo una enfermedad profesional) Accidentes Personales AP Educativo Generación Positiva AP Colectivos APCorto Plazo AP Individual y demás Ramos de Seguros autorizados a Positiva encontrándose excluidos del presente contrato los servicios y todas aquellas actividades procedimientos e intervenciones que no tengan por objeto contribuir al diagnóstico tratamiento o rehabilitación de la patología derivada del siniestro o los servicios considerados como experimentales cosméticos y suntuarios.","2022-08-29",8,"2024-08-29",24.366666666666667,"Invitación directa","CargoAReserva",0,0,"NO",null,"Gerencia de Abastecimiento Estratégico\ncontratacion@positiva.gov.co\nPBX: (1)6502200 Ext: 10641","SI","SI","NO","SI","Pública clasificada","C66862022-Tipo de información Pública clasificada-Prestación de servicios: El CONTRATISTA se obliga con POSITIVA a la prestación de los servicios de salud para los asegurados y o afiliados a POSITIVA que accedan a los servicios habilitados del CONTRATISTA en calidad de asegurados a los ramos Administración de Riesgos Laborales ARL por causa exclusiva de un accidente de trabajo una enfermedad profesional) Accidentes Personales AP Educativo Generación Positiva AP Colectivos APCorto Plazo AP Individual y demás Ramos de Seguros autorizados a Positiva encontrándose excluidos del presente contrato los servicios y todas aquellas actividades procedimientos e intervenciones que no tengan por objeto contribuir al diagnóstico tratamiento o rehabilitación de la patología derivada del siniestro o los servicios considerados como experimentales cosméticos y suntuarios."]
["VICEPRESIDENCIA TÉCNICA","Gerencia Médica","NO","C66872022",85100000,"Prestación de servicios: El CONTRATISTA se obliga con POSITIVA a la prestación de los servicios de salud para los asegurados y o afiliados a POSITIVA que accedan a los servicios habilitados del CONTRATISTA en calidad de asegurados a los ramos Administración de Riesgos Laborales ARL por causa exclusiva de un accidente de trabajo una enfermedad profesional) Accidentes Personales AP Educativo Generación Positiva AP Colectivos APCorto Plazo AP Individual y demás Ramos de Seguros autorizados a Positiva encontrándose excluidos del presente contrato los servicios y todas aquellas actividades procedimientos e intervenciones que no tengan por objeto contribuir al diagnóstico tratamiento o rehabilitación de la patología derivada del siniestro o los servicios considerados como experimentales cosméticos y suntuarios.","2022-08-29",8,"2024-08-29",24.366666666666667,"Invitación directa","CargoAReserva",0,0,"NO",null,"Gerencia de Abastecimiento Estratégico\ncontratacion@positiva.gov.co\nPBX: (1)6502200 Ext: 10641","SI","SI","NO","SI","Pública clasificada","C66872022-Tipo de información Pública clasificada-Prestación de servicios: El CONTRATISTA se obliga con POSITIVA a la prestación de los servicios de salud para los asegurados y o afiliados a POSITIVA que accedan a los servicios habilitados del CONTRATISTA en calidad de asegurados a los ramos Administración de Riesgos Laborales ARL por causa exclusiva de un accidente de trabajo una enfermedad profesional) Accidentes Personales AP Educativo Generación Positiva AP Colectivos APCorto Plazo AP Individual y demás Ramos de Seguros autorizados a Positiva encontrándose excluidos del presente contrato los servicios y todas aquellas actividades procedimientos e intervenciones que no tengan por objeto contribuir al diagnóstico tratamiento o rehabilitación de la patología derivada del siniestro o los servicios considerados como experimentales cosméticos y suntuarios."]
["VICEPRESIDENCIA TÉCNICA","Gerencia Médica","NO","C66882022",85100000,"Prestación de servicios: El CONTRATISTA se obliga con POSITIVA a la prestación de los servicios de salud para los asegurados y o afiliados a POSITIVA que accedan a los servicios habilitados del CONTRATISTA en calidad de asegurados a los ramos Administración de Riesgos Laborales ARL por causa exclusiva de un accidente de trabajo una enfermedad profesional) Accidentes Personales AP Educativo Generación Positiva AP Colectivos APCorto Plazo AP Individual y demás Ramos de Seguros autorizados a Positiva encontrándose excluidos del presente contrato los servicios y todas aquellas actividades procedimientos e intervenciones que no tengan por objeto contribuir al diagnóstico tratamiento o rehabilitación de la patología derivada del siniestro o los servicios considerados como experimentales cosméticos y suntuarios.","2022-02-01",2,"2024-02-01",24.333333333333332,"Invitación directa","CargoAReserva",0,0,"NO",null,"Gerencia de Abastecimiento Estratégico\ncontratacion@positiva.gov.co\nPBX: (1)6502200 Ext: 10641","SI","SI","NO","SI","Pública clasificada","C66882022-Tipo de información Pública clasificada-Prestación de servicios: El CONTRATISTA se obliga con POSITIVA a la prestación de los servicios de salud para los asegurados y o afiliados a POSITIVA que accedan a los servicios habilitados del CONTRATISTA en calidad de asegurados a los ramos Administración de Riesgos Laborales ARL por causa exclusiva de un accidente de trabajo una enfermedad profesional) Accidentes Personales AP Educativo Generación Positiva AP Colectivos APCorto Plazo AP Individual y demás Ramos de Seguros autorizados a Positiva encontrándose excluidos del presente contrato los servicios y todas aquellas actividades procedimientos e intervenciones que no tengan por objeto contribuir al diagnóstico tratamiento o rehabilitación de la patología derivada del siniestro o los servicios considerados como experimentales cosméticos y suntuarios."]
["VICEPRESIDENCIA TÉCNICA","Gerencia Médica","NO","C66892022",85100000,"Prestación de servicios: El CONTRATISTA se obliga con POSITIVA a la prestación de los servicios de salud para los asegurados y o afiliados a POSITIVA que accedan a los servicios habilitados del CONTRATISTA en calidad de asegurados a los ramos Administración de Riesgos Laborales ARL por causa exclusiva de un accidente de trabajo una enfermedad profesional) Accidentes Personales AP Educativo Generación Positiva AP Colectivos APCorto Plazo AP Individual y demás Ramos de Seguros autorizados a Positiva encontrándose excluidos del presente contrato los servicios y todas aquellas actividades procedimientos e intervenciones que no tengan por objeto contribuir al diagnóstico tratamiento o rehabilitación de la patología derivada del siniestro o los servicios considerados como experimentales cosméticos y suntuarios.","2022-03-01",3,"2024-03-01",24.366666666666667,"Invitación directa","CargoAReserva",0,0,"NO",null,"Gerencia de Abastecimiento Estratégico\ncontratacion@positiva.gov.co\nPBX: (1)6502200 Ext: 10641","SI","SI","NO","SI","Pública clasificada","C66892022-Tipo de información Pública clasificada-Prestación de servicios: El CONTRATISTA se obliga con POSITIVA a la prestación de los servicios de salud para los asegurados y o afiliados a POSITIVA que accedan a los servicios habilitados del CONTRATISTA en calidad de asegurados a los ramos Administración de Riesgos Laborales ARL por causa exclusiva de un accidente de trabajo una enfermedad profesional) Accidentes Personales AP Educativo Generación Positiva AP Colectivos APCorto Plazo AP Individual y demás Ramos de Seguros autorizados a Positiva encontrándose excluidos del presente contrato los servicios y todas aquellas actividades procedimientos e intervenciones que no tengan por objeto contribuir al diagnóstico tratamiento o rehabilitación de la patología derivada del siniestro o los servicios considerados como experimentales cosméticos y suntuarios."]
["VICEPRESIDENCIA TÉCNICA","Gerencia Médica","NO","C66902022",85100000,"Prestación de servicios: El CONTRATISTA se obliga con POSITIVA a la prestación de los servicios de salud para los asegurados y o afiliados a POSITIVA que accedan a los servicios habilitados del CONTRATISTA en calidad de asegurados a los ramos Administración de Riesgos Laborales ARL por causa exclusiva de un accidente de trabajo una enfermedad profesional) Accidentes Personales AP Educativo Generación Positiva AP Colectivos APCorto Plazo AP Individual y demás Ramos de Seguros autorizados a Positiva encontrándose excluidos del presente contrato los servicios y todas aquellas actividades procedimientos e intervenciones que no tengan por objeto contribuir al diagnóstico tratamiento o rehabilitación de la patología derivada del siniestro o los servicios considerados como experimentales cosméticos y suntuarios.","2022-04-01",4,"2024-04-01",24.366666666666667,"Invitación directa","CargoAReserva",0,0,"NO",null,"Gerencia de Abastecimiento Estratégico\ncontratacion@positiva.gov.co\nPBX: (1)6502200 Ext: 10641","SI","SI","NO","SI","Pública clasificada","C66902022-Tipo de información Pública clasificada-Prestación de servicios: El CONTRATISTA se obliga con POSITIVA a la prestación de los servicios de salud para los asegurados y o afiliados a POSITIVA que accedan a los servicios habilitados del CONTRATISTA en calidad de asegurados a los ramos Administración de Riesgos Laborales ARL por causa exclusiva de un accidente de trabajo una enfermedad profesional) Accidentes Personales AP Educativo Generación Positiva AP Colectivos APCorto Plazo AP Individual y demás Ramos de Seguros autorizados a Positiva encontrándose excluidos del presente contrato los servicios y todas aquellas actividades procedimientos e intervenciones que no tengan por objeto contribuir al diagnóstico tratamiento o rehabilitación de la patología derivada del siniestro o los servicios considerados como experimentales cosméticos y suntuarios."]
["VICEPRESIDENCIA TÉCNICA","Gerencia Médica","NO","C66912022",85100000,"Prestación de servicios: El CONTRATISTA se obliga con POSITIVA a la prestación de los servicios de salud para los asegurados y o afiliados a POSITIVA que accedan a los servicios habilitados del CONTRATISTA en calidad de asegurados a los ramos Administración de Riesgos Laborales ARL por causa exclusiva de un accidente de trabajo una enfermedad profesional) Accidentes Personales AP Educativo Generación Positiva AP Colectivos APCorto Plazo AP Individual y demás Ramos de Seguros autorizados a Positiva encontrándose excluidos del presente contrato los servicios y todas aquellas actividades procedimientos e intervenciones que no tengan por objeto contribuir al diagnóstico tratamiento o rehabilitación de la patología derivada del siniestro o los servicios considerados como experimentales cosméticos y suntuarios.","2022-10-01",10,"2024-10-30",25.333333333333332,"Invitación directa","CargoAReserva",0,0,"NO",null,"Gerencia de Abastecimiento Estratégico\ncontratacion@positiva.gov.co\nPBX: (1)6502200 Ext: 10641","SI","SI","NO","SI","Pública clasificada","C66912022-Tipo de información Pública clasificada-Prestación de servicios: El CONTRATISTA se obliga con POSITIVA a la prestación de los servicios de salud para los asegurados y o afiliados a POSITIVA que accedan a los servicios habilitados del CONTRATISTA en calidad de asegurados a los ramos Administración de Riesgos Laborales ARL por causa exclusiva de un accidente de trabajo una enfermedad profesional) Accidentes Personales AP Educativo Generación Positiva AP Colectivos APCorto Plazo AP Individual y demás Ramos de Seguros autorizados a Positiva encontrándose excluidos del presente contrato los servicios y todas aquellas actividades procedimientos e intervenciones que no tengan por objeto contribuir al diagnóstico tratamiento o rehabilitación de la patología derivada del siniestro o los servicios considerados como experimentales cosméticos y suntuarios."]
["VICEPRESIDENCIA TÉCNICA","Gerencia Médica","NO","C66922022",85100000,"Prestación de servicios: El CONTRATISTA se obliga con POSITIVA a la prestación de los servicios de salud para los asegurados y o afiliados a POSITIVA que accedan a los servicios habilitados del CONTRATISTA en calidad de asegurados a los ramos Administración de Riesgos Laborales ARL por causa exclusiva de un accidente de trabajo una enfermedad profesional) Accidentes Personales AP Educativo Generación Positiva AP Colectivos APCorto Plazo AP Individual y demás Ramos de Seguros autorizados a Positiva encontrándose excluidos del presente contrato los servicios y todas aquellas actividades procedimientos e intervenciones que no tengan por objeto contribuir al diagnóstico tratamiento o rehabilitación de la patología derivada del siniestro o los servicios considerados como experimentales cosméticos y suntuarios.","2022-02-01",2,"2024-02-01",24.333333333333332,"Invitación directa","CargoAReserva",0,0,"NO",null,"Gerencia de Abastecimiento Estratégico\ncontratacion@positiva.gov.co\nPBX: (1)6502200 Ext: 10641","SI","SI","NO","SI","Pública clasificada","C66922022-Tipo de información Pública clasificada-Prestación de servicios: El CONTRATISTA se obliga con POSITIVA a la prestación de los servicios de salud para los asegurados y o afiliados a POSITIVA que accedan a los servicios habilitados del CONTRATISTA en calidad de asegurados a los ramos Administración de Riesgos Laborales ARL por causa exclusiva de un accidente de trabajo una enfermedad profesional) Accidentes Personales AP Educativo Generación Positiva AP Colectivos APCorto Plazo AP Individual y demás Ramos de Seguros autorizados a Positiva encontrándose excluidos del presente contrato los servicios y todas aquellas actividades procedimientos e intervenciones que no tengan por objeto contribuir al diagnóstico tratamiento o rehabilitación de la patología derivada del siniestro o los servicios considerados como experimentales cosméticos y suntuarios."]
["VICEPRESIDENCIA TÉCNICA","Gerencia Médica","NO","C66932022",85100000,"Prestación de servicios: El CONTRATISTA se obliga con POSITIVA a la prestación de los servicios de salud para los asegurados y o afiliados a POSITIVA que accedan a los servicios habilitados del CONTRATISTA en calidad de asegurados a los ramos Administración de Riesgos Laborales ARL por causa exclusiva de un accidente de trabajo una enfermedad profesional) Accidentes Personales AP Educativo Generación Positiva AP Colectivos APCorto Plazo AP Individual y demás Ramos de Seguros autorizados a Positiva encontrándose excluidos del presente contrato los servicios y todas aquellas actividades procedimientos e intervenciones que no tengan por objeto contribuir al diagnóstico tratamiento o rehabilitación de la patología derivada del siniestro o los servicios considerados como experimentales cosméticos y suntuarios.","2022-02-01",2,"2024-02-01",24.333333333333332,"Invitación directa","CargoAReserva",0,0,"NO",null,"Gerencia de Abastecimiento Estratégico\ncontratacion@positiva.gov.co\nPBX: (1)6502200 Ext: 10641","SI","SI","NO","SI","Pública clasificada","C66932022-Tipo de información Pública clasificada-Prestación de servicios: El CONTRATISTA se obliga con POSITIVA a la prestación de los servicios de salud para los asegurados y o afiliados a POSITIVA que accedan a los servicios habilitados del CONTRATISTA en calidad de asegurados a los ramos Administración de Riesgos Laborales ARL por causa exclusiva de un accidente de trabajo una enfermedad profesional) Accidentes Personales AP Educativo Generación Positiva AP Colectivos APCorto Plazo AP Individual y demás Ramos de Seguros autorizados a Positiva encontrándose excluidos del presente contrato los servicios y todas aquellas actividades procedimientos e intervenciones que no tengan por objeto contribuir al diagnóstico tratamiento o rehabilitación de la patología derivada del siniestro o los servicios considerados como experimentales cosméticos y suntuarios."]
["VICEPRESIDENCIA TÉCNICA","Gerencia Médica","NO","C66942022",85100000,"Prestación de servicios: El CONTRATISTA se obliga con POSITIVA a la prestación de los servicios de salud para los asegurados y o afiliados a POSITIVA que accedan a los servicios habilitados del CONTRATISTA en calidad de asegurados a los ramos Administración de Riesgos Laborales ARL por causa exclusiva de un accidente de trabajo una enfermedad profesional) Accidentes Personales AP Educativo Generación Positiva AP Colectivos APCorto Plazo AP Individual y demás Ramos de Seguros autorizados a Positiva encontrándose excluidos del presente contrato los servicios y todas aquellas actividades procedimientos e intervenciones que no tengan por objeto contribuir al diagnóstico tratamiento o rehabilitación de la patología derivada del siniestro o los servicios considerados como experimentales cosméticos y suntuarios.","2022-02-01",2,"2024-02-01",24.333333333333332,"Invitación directa","CargoAReserva",0,0,"NO",null,"Gerencia de Abastecimiento Estratégico\ncontratacion@positiva.gov.co\nPBX: (1)6502200 Ext: 10641","SI","SI","NO","SI","Pública clasificada","C66942022-Tipo de información Pública clasificada-Prestación de servicios: El CONTRATISTA se obliga con POSITIVA a la prestación de los servicios de salud para los asegurados y o afiliados a POSITIVA que accedan a los servicios habilitados del CONTRATISTA en calidad de asegurados a los ramos Administración de Riesgos Laborales ARL por causa exclusiva de un accidente de trabajo una enfermedad profesional) Accidentes Personales AP Educativo Generación Positiva AP Colectivos APCorto Plazo AP Individual y demás Ramos de Seguros autorizados a Positiva encontrándose excluidos del presente contrato los servicios y todas aquellas actividades procedimientos e intervenciones que no tengan por objeto contribuir al diagnóstico tratamiento o rehabilitación de la patología derivada del siniestro o los servicios considerados como experimentales cosméticos y suntuarios."]
["VICEPRESIDENCIA TÉCNICA","Gerencia Médica","NO","C66952022",85100000,"Prestación de servicios: El CONTRATISTA se obliga con POSITIVA a la prestación de los servicios de salud para los asegurados y o afiliados a POSITIVA que accedan a los servicios habilitados del CONTRATISTA en calidad de asegurados a los ramos Administración de Riesgos Laborales ARL por causa exclusiva de un accidente de trabajo una enfermedad profesional) Accidentes Personales AP Educativo Generación Positiva AP Colectivos APCorto Plazo AP Individual y demás Ramos de Seguros autorizados a Positiva encontrándose excluidos del presente contrato los servicios y todas aquellas actividades procedimientos e intervenciones que no tengan por objeto contribuir al diagnóstico tratamiento o rehabilitación de la patología derivada del siniestro o los servicios considerados como experimentales cosméticos y suntuarios.","2022-02-01",2,"2024-02-01",24.333333333333332,"Invitación directa","CargoAReserva",0,0,"NO",null,"Gerencia de Abastecimiento Estratégico\ncontratacion@positiva.gov.co\nPBX: (1)6502200 Ext: 10641","SI","SI","NO","SI","Pública clasificada","C66952022-Tipo de información Pública clasificada-Prestación de servicios: El CONTRATISTA se obliga con POSITIVA a la prestación de los servicios de salud para los asegurados y o afiliados a POSITIVA que accedan a los servicios habilitados del CONTRATISTA en calidad de asegurados a los ramos Administración de Riesgos Laborales ARL por causa exclusiva de un accidente de trabajo una enfermedad profesional) Accidentes Personales AP Educativo Generación Positiva AP Colectivos APCorto Plazo AP Individual y demás Ramos de Seguros autorizados a Positiva encontrándose excluidos del presente contrato los servicios y todas aquellas actividades procedimientos e intervenciones que no tengan por objeto contribuir al diagnóstico tratamiento o rehabilitación de la patología derivada del siniestro o los servicios considerados como experimentales cosméticos y suntuarios."]
["VICEPRESIDENCIA TÉCNICA","Gerencia Médica","NO","C66962022",85100000,"Prestación de servicios: El CONTRATISTA se obliga con POSITIVA a la prestación de los servicios de salud para los asegurados y o afiliados a POSITIVA que accedan a los servicios habilitados del CONTRATISTA en calidad de asegurados a los ramos Administración de Riesgos Laborales ARL por causa exclusiva de un accidente de trabajo una enfermedad profesional) Accidentes Personales AP Educativo Generación Positiva AP Colectivos APCorto Plazo AP Individual y demás Ramos de Seguros autorizados a Positiva encontrándose excluidos del presente contrato los servicios y todas aquellas actividades procedimientos e intervenciones que no tengan por objeto contribuir al diagnóstico tratamiento o rehabilitación de la patología derivada del siniestro o los servicios considerados como experimentales cosméticos y suntuarios.","2022-02-01",2,"2024-02-01",24.333333333333332,"Invitación directa","CargoAReserva",0,0,"NO",null,"Gerencia de Abastecimiento Estratégico\ncontratacion@positiva.gov.co\nPBX: (1)6502200 Ext: 10641","SI","SI","NO","SI","Pública clasificada","C66962022-Tipo de información Pública clasificada-Prestación de servicios: El CONTRATISTA se obliga con POSITIVA a la prestación de los servicios de salud para los asegurados y o afiliados a POSITIVA que accedan a los servicios habilitados del CONTRATISTA en calidad de asegurados a los ramos Administración de Riesgos Laborales ARL por causa exclusiva de un accidente de trabajo una enfermedad profesional) Accidentes Personales AP Educativo Generación Positiva AP Colectivos APCorto Plazo AP Individual y demás Ramos de Seguros autorizados a Positiva encontrándose excluidos del presente contrato los servicios y todas aquellas actividades procedimientos e intervenciones que no tengan por objeto contribuir al diagnóstico tratamiento o rehabilitación de la patología derivada del siniestro o los servicios considerados como experimentales cosméticos y suntuarios."]
["VICEPRESIDENCIA TÉCNICA","Gerencia Médica","NO","C66972022",85100000,"Prestación de servicios: El CONTRATISTA se obliga con POSITIVA a la prestación de los servicios de salud para los asegurados y o afiliados a POSITIVA que accedan a los servicios habilitados del CONTRATISTA en calidad de asegurados a los ramos Administración de Riesgos Laborales ARL por causa exclusiva de un accidente de trabajo una enfermedad profesional) Accidentes Personales AP Educativo Generación Positiva AP Colectivos APCorto Plazo AP Individual y demás Ramos de Seguros autorizados a Positiva encontrándose excluidos del presente contrato los servicios y todas aquellas actividades procedimientos e intervenciones que no tengan por objeto contribuir al diagnóstico tratamiento o rehabilitación de la patología derivada del siniestro o los servicios considerados como experimentales cosméticos y suntuarios.","2022-06-15",6,"2024-06-15",24.366666666666667,"Invitación directa","CargoAReserva",0,0,"NO",null,"Gerencia de Abastecimiento Estratégico\ncontratacion@positiva.gov.co\nPBX: (1)6502200 Ext: 10641","SI","SI","NO","SI","Pública clasificada","C66972022-Tipo de información Pública clasificada-Prestación de servicios: El CONTRATISTA se obliga con POSITIVA a la prestación de los servicios de salud para los asegurados y o afiliados a POSITIVA que accedan a los servicios habilitados del CONTRATISTA en calidad de asegurados a los ramos Administración de Riesgos Laborales ARL por causa exclusiva de un accidente de trabajo una enfermedad profesional) Accidentes Personales AP Educativo Generación Positiva AP Colectivos APCorto Plazo AP Individual y demás Ramos de Seguros autorizados a Positiva encontrándose excluidos del presente contrato los servicios y todas aquellas actividades procedimientos e intervenciones que no tengan por objeto contribuir al diagnóstico tratamiento o rehabilitación de la patología derivada del siniestro o los servicios considerados como experimentales cosméticos y suntuarios."]
["VICEPRESIDENCIA TÉCNICA","Gerencia Médica","NO","C66982022",85100000,"Prestación de servicios: El CONTRATISTA se obliga con POSITIVA a la prestación de los servicios de salud para los asegurados y o afiliados a POSITIVA que accedan a los servicios habilitados del CONTRATISTA en calidad de asegurados a los ramos Administración de Riesgos Laborales ARL por causa exclusiva de un accidente de trabajo una enfermedad profesional) Accidentes Personales AP Educativo Generación Positiva AP Colectivos APCorto Plazo AP Individual y demás Ramos de Seguros autorizados a Positiva encontrándose excluidos del presente contrato los servicios y todas aquellas actividades procedimientos e intervenciones que no tengan por objeto contribuir al diagnóstico tratamiento o rehabilitación de la patología derivada del siniestro o los servicios considerados como experimentales cosméticos y suntuarios.","2022-09-20",9,"2024-09-20",24.366666666666667,"Invitación directa","CargoAReserva",0,0,"NO",null,"Gerencia de Abastecimiento Estratégico\ncontratacion@positiva.gov.co\nPBX: (1)6502200 Ext: 10641","SI","SI","NO","SI","Pública clasificada","C66982022-Tipo de información Pública clasificada-Prestación de servicios: El CONTRATISTA se obliga con POSITIVA a la prestación de los servicios de salud para los asegurados y o afiliados a POSITIVA que accedan a los servicios habilitados del CONTRATISTA en calidad de asegurados a los ramos Administración de Riesgos Laborales ARL por causa exclusiva de un accidente de trabajo una enfermedad profesional) Accidentes Personales AP Educativo Generación Positiva AP Colectivos APCorto Plazo AP Individual y demás Ramos de Seguros autorizados a Positiva encontrándose excluidos del presente contrato los servicios y todas aquellas actividades procedimientos e intervenciones que no tengan por objeto contribuir al diagnóstico tratamiento o rehabilitación de la patología derivada del siniestro o los servicios considerados como experimentales cosméticos y suntuarios."]
["VICEPRESIDENCIA TÉCNICA","Gerencia Médica","NO","C66992022",85100000,"Prestación de servicios: El CONTRATISTA se obliga con POSITIVA a la prestación de los servicios de salud para los asegurados y o afiliados a POSITIVA que accedan a los servicios habilitados del CONTRATISTA en calidad de asegurados a los ramos Administración de Riesgos Laborales ARL por causa exclusiva de un accidente de trabajo una enfermedad profesional) Accidentes Personales AP Educativo Generación Positiva AP Colectivos APCorto Plazo AP Individual y demás Ramos de Seguros autorizados a Positiva encontrándose excluidos del presente contrato los servicios y todas aquellas actividades procedimientos e intervenciones que no tengan por objeto contribuir al diagnóstico tratamiento o rehabilitación de la patología derivada del siniestro o los servicios considerados como experimentales cosméticos y suntuarios.","2022-12-27",12,"2024-12-27",24.366666666666667,"Invitación directa","CargoAReserva",0,0,"NO",null,"Gerencia de Abastecimiento Estratégico\ncontratacion@positiva.gov.co\nPBX: (1)6502200 Ext: 10641","SI","SI","NO","SI","Pública clasificada","C66992022-Tipo de información Pública clasificada-Prestación de servicios: El CONTRATISTA se obliga con POSITIVA a la prestación de los servicios de salud para los asegurados y o afiliados a POSITIVA que accedan a los servicios habilitados del CONTRATISTA en calidad de asegurados a los ramos Administración de Riesgos Laborales ARL por causa exclusiva de un accidente de trabajo una enfermedad profesional) Accidentes Personales AP Educativo Generación Positiva AP Colectivos APCorto Plazo AP Individual y demás Ramos de Seguros autorizados a Positiva encontrándose excluidos del presente contrato los servicios y todas aquellas actividades procedimientos e intervenciones que no tengan por objeto contribuir al diagnóstico tratamiento o rehabilitación de la patología derivada del siniestro o los servicios considerados como experimentales cosméticos y suntuarios."]
["VICEPRESIDENCIA TÉCNICA","Gerencia Médica","NO","C67002022",85100000,"Prestación de servicios: El CONTRATISTA se obliga con POSITIVA a la prestación de los servicios de salud para los asegurados y o afiliados a POSITIVA que accedan a los servicios habilitados del CONTRATISTA en calidad de asegurados a los ramos Administración de Riesgos Laborales ARL por causa exclusiva de un accidente de trabajo una enfermedad profesional) Accidentes Personales AP Educativo Generación Positiva AP Colectivos APCorto Plazo AP Individual y demás Ramos de Seguros autorizados a Positiva encontrándose excluidos del presente contrato los servicios y todas aquellas actividades procedimientos e intervenciones que no tengan por objeto contribuir al diagnóstico tratamiento o rehabilitación de la patología derivada del siniestro o los servicios considerados como experimentales cosméticos y suntuarios.","2022-03-15",3,"2024-03-15",24.366666666666667,"Invitación directa","CargoAReserva",0,0,"NO",null,"Gerencia de Abastecimiento Estratégico\ncontratacion@positiva.gov.co\nPBX: (1)6502200 Ext: 10641","SI","SI","NO","SI","Pública clasificada","C67002022-Tipo de información Pública clasificada-Prestación de servicios: El CONTRATISTA se obliga con POSITIVA a la prestación de los servicios de salud para los asegurados y o afiliados a POSITIVA que accedan a los servicios habilitados del CONTRATISTA en calidad de asegurados a los ramos Administración de Riesgos Laborales ARL por causa exclusiva de un accidente de trabajo una enfermedad profesional) Accidentes Personales AP Educativo Generación Positiva AP Colectivos APCorto Plazo AP Individual y demás Ramos de Seguros autorizados a Positiva encontrándose excluidos del presente contrato los servicios y todas aquellas actividades procedimientos e intervenciones que no tengan por objeto contribuir al diagnóstico tratamiento o rehabilitación de la patología derivada del siniestro o los servicios considerados como experimentales cosméticos y suntuarios."]
["VICEPRESIDENCIA TÉCNICA","Gerencia Médica","NO","C67012022",85100000,"Prestación de servicios: El CONTRATISTA se obliga con POSITIVA a la prestación de los servicios de salud para los asegurados y o afiliados a POSITIVA que accedan a los servicios habilitados del CONTRATISTA en calidad de asegurados a los ramos Administración de Riesgos Laborales ARL por causa exclusiva de un accidente de trabajo una enfermedad profesional) Accidentes Personales AP Educativo Generación Positiva AP Colectivos APCorto Plazo AP Individual y demás Ramos de Seguros autorizados a Positiva encontrándose excluidos del presente contrato los servicios y todas aquellas actividades procedimientos e intervenciones que no tengan por objeto contribuir al diagnóstico tratamiento o rehabilitación de la patología derivada del siniestro o los servicios considerados como experimentales cosméticos y suntuarios.","2022-04-21",4,"2024-04-21",24.366666666666667,"Invitación directa","CargoAReserva",0,0,"NO",null,"Gerencia de Abastecimiento Estratégico\ncontratacion@positiva.gov.co\nPBX: (1)6502200 Ext: 10641","SI","SI","NO","SI","Pública clasificada","C67012022-Tipo de información Pública clasificada-Prestación de servicios: El CONTRATISTA se obliga con POSITIVA a la prestación de los servicios de salud para los asegurados y o afiliados a POSITIVA que accedan a los servicios habilitados del CONTRATISTA en calidad de asegurados a los ramos Administración de Riesgos Laborales ARL por causa exclusiva de un accidente de trabajo una enfermedad profesional) Accidentes Personales AP Educativo Generación Positiva AP Colectivos APCorto Plazo AP Individual y demás Ramos de Seguros autorizados a Positiva encontrándose excluidos del presente contrato los servicios y todas aquellas actividades procedimientos e intervenciones que no tengan por objeto contribuir al diagnóstico tratamiento o rehabilitación de la patología derivada del siniestro o los servicios considerados como experimentales cosméticos y suntuarios."]
["VICEPRESIDENCIA TÉCNICA","Gerencia Médica","NO","C67022022",85100000,"Prestación de servicios: El CONTRATISTA se obliga con POSITIVA a la prestación de los servicios de salud para los asegurados y o afiliados a POSITIVA que accedan a los servicios habilitados del CONTRATISTA en calidad de asegurados a los ramos Administración de Riesgos Laborales ARL por causa exclusiva de un accidente de trabajo una enfermedad profesional) Accidentes Personales AP Educativo Generación Positiva AP Colectivos APCorto Plazo AP Individual y demás Ramos de Seguros autorizados a Positiva encontrándose excluidos del presente contrato los servicios y todas aquellas actividades procedimientos e intervenciones que no tengan por objeto contribuir al diagnóstico tratamiento o rehabilitación de la patología derivada del siniestro o los servicios considerados como experimentales cosméticos y suntuarios.","2022-05-24",5,"2024-05-24",24.366666666666667,"Invitación directa","CargoAReserva",0,0,"NO",null,"Gerencia de Abastecimiento Estratégico\ncontratacion@positiva.gov.co\nPBX: (1)6502200 Ext: 10641","SI","SI","NO","SI","Pública clasificada","C67022022-Tipo de información Pública clasificada-Prestación de servicios: El CONTRATISTA se obliga con POSITIVA a la prestación de los servicios de salud para los asegurados y o afiliados a POSITIVA que accedan a los servicios habilitados del CONTRATISTA en calidad de asegurados a los ramos Administración de Riesgos Laborales ARL por causa exclusiva de un accidente de trabajo una enfermedad profesional) Accidentes Personales AP Educativo Generación Positiva AP Colectivos APCorto Plazo AP Individual y demás Ramos de Seguros autorizados a Positiva encontrándose excluidos del presente contrato los servicios y todas aquellas actividades procedimientos e intervenciones que no tengan por objeto contribuir al diagnóstico tratamiento o rehabilitación de la patología derivada del siniestro o los servicios considerados como experimentales cosméticos y suntuarios."]
["VICEPRESIDENCIA TÉCNICA","Gerencia Médica","NO","C67032022",85100000,"Prestación de servicios: El CONTRATISTA se obliga con POSITIVA a la prestación de los servicios de salud para los asegurados y o afiliados a POSITIVA que accedan a los servicios habilitados del CONTRATISTA en calidad de asegurados a los ramos Administración de Riesgos Laborales ARL por causa exclusiva de un accidente de trabajo una enfermedad profesional) Accidentes Personales AP Educativo Generación Positiva AP Colectivos APCorto Plazo AP Individual y demás Ramos de Seguros autorizados a Positiva encontrándose excluidos del presente contrato los servicios y todas aquellas actividades procedimientos e intervenciones que no tengan por objeto contribuir al diagnóstico tratamiento o rehabilitación de la patología derivada del siniestro o los servicios considerados como experimentales cosméticos y suntuarios.","2022-06-15",6,"2024-06-15",24.366666666666667,"Invitación directa","CargoAReserva",0,0,"NO",null,"Gerencia de Abastecimiento Estratégico\ncontratacion@positiva.gov.co\nPBX: (1)6502200 Ext: 10641","SI","SI","NO","SI","Pública clasificada","C67032022-Tipo de información Pública clasificada-Prestación de servicios: El CONTRATISTA se obliga con POSITIVA a la prestación de los servicios de salud para los asegurados y o afiliados a POSITIVA que accedan a los servicios habilitados del CONTRATISTA en calidad de asegurados a los ramos Administración de Riesgos Laborales ARL por causa exclusiva de un accidente de trabajo una enfermedad profesional) Accidentes Personales AP Educativo Generación Positiva AP Colectivos APCorto Plazo AP Individual y demás Ramos de Seguros autorizados a Positiva encontrándose excluidos del presente contrato los servicios y todas aquellas actividades procedimientos e intervenciones que no tengan por objeto contribuir al diagnóstico tratamiento o rehabilitación de la patología derivada del siniestro o los servicios considerados como experimentales cosméticos y suntuarios."]
["VICEPRESIDENCIA TÉCNICA","Gerencia Médica","NO","C67042022",85100000,"Prestación de servicios: El CONTRATISTA se obliga con POSITIVA a la prestación de los servicios de salud para los asegurados y o afiliados a POSITIVA que accedan a los servicios habilitados del CONTRATISTA en calidad de asegurados a los ramos Administración de Riesgos Laborales ARL por causa exclusiva de un accidente de trabajo una enfermedad profesional) Accidentes Personales AP Educativo Generación Positiva AP Colectivos APCorto Plazo AP Individual y demás Ramos de Seguros autorizados a Positiva encontrándose excluidos del presente contrato los servicios y todas aquellas actividades procedimientos e intervenciones que no tengan por objeto contribuir al diagnóstico tratamiento o rehabilitación de la patología derivada del siniestro o los servicios considerados como experimentales cosméticos y suntuarios.","2022-06-15",6,"2024-06-15",24.366666666666667,"Invitación directa","CargoAReserva",0,0,"NO",null,"Gerencia de Abastecimiento Estratégico\ncontratacion@positiva.gov.co\nPBX: (1)6502200 Ext: 10641","SI","SI","NO","SI","Pública clasificada","C67042022-Tipo de información Pública clasificada-Prestación de servicios: El CONTRATISTA se obliga con POSITIVA a la prestación de los servicios de salud para los asegurados y o afiliados a POSITIVA que accedan a los servicios habilitados del CONTRATISTA en calidad de asegurados a los ramos Administración de Riesgos Laborales ARL por causa exclusiva de un accidente de trabajo una enfermedad profesional) Accidentes Personales AP Educativo Generación Positiva AP Colectivos APCorto Plazo AP Individual y demás Ramos de Seguros autorizados a Positiva encontrándose excluidos del presente contrato los servicios y todas aquellas actividades procedimientos e intervenciones que no tengan por objeto contribuir al diagnóstico tratamiento o rehabilitación de la patología derivada del siniestro o los servicios considerados como experimentales cosméticos y suntuarios."]
["VICEPRESIDENCIA TÉCNICA","Gerencia Médica","NO","C67052022",85100000,"Prestación de servicios: El CONTRATISTA se obliga con POSITIVA a la prestación de los servicios de salud para los asegurados y o afiliados a POSITIVA que accedan a los servicios habilitados del CONTRATISTA en calidad de asegurados a los ramos Administración de Riesgos Laborales ARL por causa exclusiva de un accidente de trabajo una enfermedad profesional) Accidentes Personales AP Educativo Generación Positiva AP Colectivos APCorto Plazo AP Individual y demás Ramos de Seguros autorizados a Positiva encontrándose excluidos del presente contrato los servicios y todas aquellas actividades procedimientos e intervenciones que no tengan por objeto contribuir al diagnóstico tratamiento o rehabilitación de la patología derivada del siniestro o los servicios considerados como experimentales cosméticos y suntuarios.","2022-09-20",9,"2024-09-20",24.366666666666667,"Invitación directa","CargoAReserva",0,0,"NO",null,"Gerencia de Abastecimiento Estratégico\ncontratacion@positiva.gov.co\nPBX: (1)6502200 Ext: 10641","SI","SI","NO","SI","Pública clasificada","C67052022-Tipo de información Pública clasificada-Prestación de servicios: El CONTRATISTA se obliga con POSITIVA a la prestación de los servicios de salud para los asegurados y o afiliados a POSITIVA que accedan a los servicios habilitados del CONTRATISTA en calidad de asegurados a los ramos Administración de Riesgos Laborales ARL por causa exclusiva de un accidente de trabajo una enfermedad profesional) Accidentes Personales AP Educativo Generación Positiva AP Colectivos APCorto Plazo AP Individual y demás Ramos de Seguros autorizados a Positiva encontrándose excluidos del presente contrato los servicios y todas aquellas actividades procedimientos e intervenciones que no tengan por objeto contribuir al diagnóstico tratamiento o rehabilitación de la patología derivada del siniestro o los servicios considerados como experimentales cosméticos y suntuarios."]
["VICEPRESIDENCIA TÉCNICA","Gerencia Médica","NO","C67062022",85100000,"Prestación de servicios: El CONTRATISTA se obliga con POSITIVA a la prestación de los servicios de salud para los asegurados y o afiliados a POSITIVA que accedan a los servicios habilitados del CONTRATISTA en calidad de asegurados a los ramos Administración de Riesgos Laborales ARL por causa exclusiva de un accidente de trabajo una enfermedad profesional) Accidentes Personales AP Educativo Generación Positiva AP Colectivos APCorto Plazo AP Individual y demás Ramos de Seguros autorizados a Positiva encontrándose excluidos del presente contrato los servicios y todas aquellas actividades procedimientos e intervenciones que no tengan por objeto contribuir al diagnóstico tratamiento o rehabilitación de la patología derivada del siniestro o los servicios considerados como experimentales cosméticos y suntuarios.","2022-12-27",12,"2024-12-27",24.366666666666667,"Invitación directa","CargoAReserva",0,0,"NO",null,"Gerencia de Abastecimiento Estratégico\ncontratacion@positiva.gov.co\nPBX: (1)6502200 Ext: 10641","SI","SI","NO","SI","Pública clasificada","C67062022-Tipo de información Pública clasificada-Prestación de servicios: El CONTRATISTA se obliga con POSITIVA a la prestación de los servicios de salud para los asegurados y o afiliados a POSITIVA que accedan a los servicios habilitados del CONTRATISTA en calidad de asegurados a los ramos Administración de Riesgos Laborales ARL por causa exclusiva de un accidente de trabajo una enfermedad profesional) Accidentes Personales AP Educativo Generación Positiva AP Colectivos APCorto Plazo AP Individual y demás Ramos de Seguros autorizados a Positiva encontrándose excluidos del presente contrato los servicios y todas aquellas actividades procedimientos e intervenciones que no tengan por objeto contribuir al diagnóstico tratamiento o rehabilitación de la patología derivada del siniestro o los servicios considerados como experimentales cosméticos y suntuarios."]
["VICEPRESIDENCIA TÉCNICA","Gerencia Médica","NO","C67072022",85100000,"Prestación de servicios: El CONTRATISTA se obliga con POSITIVA a la prestación de los servicios de salud para los asegurados y o afiliados a POSITIVA que accedan a los servicios habilitados del CONTRATISTA en calidad de asegurados a los ramos Administración de Riesgos Laborales ARL por causa exclusiva de un accidente de trabajo una enfermedad profesional) Accidentes Personales AP Educativo Generación Positiva AP Colectivos APCorto Plazo AP Individual y demás Ramos de Seguros autorizados a Positiva encontrándose excluidos del presente contrato los servicios y todas aquellas actividades procedimientos e intervenciones que no tengan por objeto contribuir al diagnóstico tratamiento o rehabilitación de la patología derivada del siniestro o los servicios considerados como experimentales cosméticos y suntuarios.","2022-03-15",3,"2024-03-15",24.366666666666667,"Invitación directa","CargoAReserva",0,0,"NO",null,"Gerencia de Abastecimiento Estratégico\ncontratacion@positiva.gov.co\nPBX: (1)6502200 Ext: 10641","SI","SI","NO","SI","Pública clasificada","C67072022-Tipo de información Pública clasificada-Prestación de servicios: El CONTRATISTA se obliga con POSITIVA a la prestación de los servicios de salud para los asegurados y o afiliados a POSITIVA que accedan a los servicios habilitados del CONTRATISTA en calidad de asegurados a los ramos Administración de Riesgos Laborales ARL por causa exclusiva de un accidente de trabajo una enfermedad profesional) Accidentes Personales AP Educativo Generación Positiva AP Colectivos APCorto Plazo AP Individual y demás Ramos de Seguros autorizados a Positiva encontrándose excluidos del presente contrato los servicios y todas aquellas actividades procedimientos e intervenciones que no tengan por objeto contribuir al diagnóstico tratamiento o rehabilitación de la patología derivada del siniestro o los servicios considerados como experimentales cosméticos y suntuarios."]
["VICEPRESIDENCIA TÉCNICA","Gerencia Médica","NO","C67082022",85100000,"Prestación de servicios: El CONTRATISTA se obliga con POSITIVA a la prestación de los servicios de salud para los asegurados y o afiliados a POSITIVA que accedan a los servicios habilitados del CONTRATISTA en calidad de asegurados a los ramos Administración de Riesgos Laborales ARL por causa exclusiva de un accidente de trabajo una enfermedad profesional) Accidentes Personales AP Educativo Generación Positiva AP Colectivos APCorto Plazo AP Individual y demás Ramos de Seguros autorizados a Positiva encontrándose excluidos del presente contrato los servicios y todas aquellas actividades procedimientos e intervenciones que no tengan por objeto contribuir al diagnóstico tratamiento o rehabilitación de la patología derivada del siniestro o los servicios considerados como experimentales cosméticos y suntuarios.","2022-04-21",4,"2024-04-21",24.366666666666667,"Invitación directa","CargoAReserva",0,0,"NO",null,"Gerencia de Abastecimiento Estratégico\ncontratacion@positiva.gov.co\nPBX: (1)6502200 Ext: 10641","SI","SI","NO","SI","Pública clasificada","C67082022-Tipo de información Pública clasificada-Prestación de servicios: El CONTRATISTA se obliga con POSITIVA a la prestación de los servicios de salud para los asegurados y o afiliados a POSITIVA que accedan a los servicios habilitados del CONTRATISTA en calidad de asegurados a los ramos Administración de Riesgos Laborales ARL por causa exclusiva de un accidente de trabajo una enfermedad profesional) Accidentes Personales AP Educativo Generación Positiva AP Colectivos APCorto Plazo AP Individual y demás Ramos de Seguros autorizados a Positiva encontrándose excluidos del presente contrato los servicios y todas aquellas actividades procedimientos e intervenciones que no tengan por objeto contribuir al diagnóstico tratamiento o rehabilitación de la patología derivada del siniestro o los servicios considerados como experimentales cosméticos y suntuarios."]
["VICEPRESIDENCIA TÉCNICA","Gerencia Médica","NO","C67092022",85100000,"Prestación de servicios: El CONTRATISTA se obliga con POSITIVA a la prestación de los servicios de salud para los asegurados y o afiliados a POSITIVA que accedan a los servicios habilitados del CONTRATISTA en calidad de asegurados a los ramos Administración de Riesgos Laborales ARL por causa exclusiva de un accidente de trabajo una enfermedad profesional) Accidentes Personales AP Educativo Generación Positiva AP Colectivos APCorto Plazo AP Individual y demás Ramos de Seguros autorizados a Positiva encontrándose excluidos del presente contrato los servicios y todas aquellas actividades procedimientos e intervenciones que no tengan por objeto contribuir al diagnóstico tratamiento o rehabilitación de la patología derivada del siniestro o los servicios considerados como experimentales cosméticos y suntuarios.","2022-05-24",5,"2024-05-24",24.366666666666667,"Invitación directa","CargoAReserva",0,0,"NO",null,"Gerencia de Abastecimiento Estratégico\ncontratacion@positiva.gov.co\nPBX: (1)6502200 Ext: 10641","SI","SI","NO","SI","Pública clasificada","C67092022-Tipo de información Pública clasificada-Prestación de servicios: El CONTRATISTA se obliga con POSITIVA a la prestación de los servicios de salud para los asegurados y o afiliados a POSITIVA que accedan a los servicios habilitados del CONTRATISTA en calidad de asegurados a los ramos Administración de Riesgos Laborales ARL por causa exclusiva de un accidente de trabajo una enfermedad profesional) Accidentes Personales AP Educativo Generación Positiva AP Colectivos APCorto Plazo AP Individual y demás Ramos de Seguros autorizados a Positiva encontrándose excluidos del presente contrato los servicios y todas aquellas actividades procedimientos e intervenciones que no tengan por objeto contribuir al diagnóstico tratamiento o rehabilitación de la patología derivada del siniestro o los servicios considerados como experimentales cosméticos y suntuarios."]
["VICEPRESIDENCIA TÉCNICA","Gerencia Médica","NO","C67102022",85100000,"Prestación de servicios: El CONTRATISTA se obliga con POSITIVA a la prestación de los servicios de salud para los asegurados y o afiliados a POSITIVA que accedan a los servicios habilitados del CONTRATISTA en calidad de asegurados a los ramos Administración de Riesgos Laborales ARL por causa exclusiva de un accidente de trabajo una enfermedad profesional) Accidentes Personales AP Educativo Generación Positiva AP Colectivos APCorto Plazo AP Individual y demás Ramos de Seguros autorizados a Positiva encontrándose excluidos del presente contrato los servicios y todas aquellas actividades procedimientos e intervenciones que no tengan por objeto contribuir al diagnóstico tratamiento o rehabilitación de la patología derivada del siniestro o los servicios considerados como experimentales cosméticos y suntuarios.","2022-06-15",6,"2024-06-15",24.366666666666667,"Invitación directa","CargoAReserva",0,0,"NO",null,"Gerencia de Abastecimiento Estratégico\ncontratacion@positiva.gov.co\nPBX: (1)6502200 Ext: 10641","SI","SI","NO","SI","Pública clasificada","C67102022-Tipo de información Pública clasificada-Prestación de servicios: El CONTRATISTA se obliga con POSITIVA a la prestación de los servicios de salud para los asegurados y o afiliados a POSITIVA que accedan a los servicios habilitados del CONTRATISTA en calidad de asegurados a los ramos Administración de Riesgos Laborales ARL por causa exclusiva de un accidente de trabajo una enfermedad profesional) Accidentes Personales AP Educativo Generación Positiva AP Colectivos APCorto Plazo AP Individual y demás Ramos de Seguros autorizados a Positiva encontrándose excluidos del presente contrato los servicios y todas aquellas actividades procedimientos e intervenciones que no tengan por objeto contribuir al diagnóstico tratamiento o rehabilitación de la patología derivada del siniestro o los servicios considerados como experimentales cosméticos y suntuarios."]
["VICEPRESIDENCIA TÉCNICA","Gerencia Médica","NO","C67112022",85100000,"Prestación de servicios: El CONTRATISTA se obliga con POSITIVA a la prestación de los servicios de salud para los asegurados y o afiliados a POSITIVA que accedan a los servicios habilitados del CONTRATISTA en calidad de asegurados a los ramos Administración de Riesgos Laborales ARL por causa exclusiva de un accidente de trabajo una enfermedad profesional) Accidentes Personales AP Educativo Generación Positiva AP Colectivos APCorto Plazo AP Individual y demás Ramos de Seguros autorizados a Positiva encontrándose excluidos del presente contrato los servicios y todas aquellas actividades procedimientos e intervenciones que no tengan por objeto contribuir al diagnóstico tratamiento o rehabilitación de la patología derivada del siniestro o los servicios considerados como experimentales cosméticos y suntuarios.","2022-06-15",6,"2024-06-15",24.366666666666667,"Invitación directa","CargoAReserva",0,0,"NO",null,"Gerencia de Abastecimiento Estratégico\ncontratacion@positiva.gov.co\nPBX: (1)6502200 Ext: 10641","SI","SI","NO","SI","Pública clasificada","C67112022-Tipo de información Pública clasificada-Prestación de servicios: El CONTRATISTA se obliga con POSITIVA a la prestación de los servicios de salud para los asegurados y o afiliados a POSITIVA que accedan a los servicios habilitados del CONTRATISTA en calidad de asegurados a los ramos Administración de Riesgos Laborales ARL por causa exclusiva de un accidente de trabajo una enfermedad profesional) Accidentes Personales AP Educativo Generación Positiva AP Colectivos APCorto Plazo AP Individual y demás Ramos de Seguros autorizados a Positiva encontrándose excluidos del presente contrato los servicios y todas aquellas actividades procedimientos e intervenciones que no tengan por objeto contribuir al diagnóstico tratamiento o rehabilitación de la patología derivada del siniestro o los servicios considerados como experimentales cosméticos y suntuarios."]
["VICEPRESIDENCIA TÉCNICA","Gerencia Médica","NO","C67122022",85100000,"Prestación de servicios: El CONTRATISTA se obliga con POSITIVA a la prestación de los servicios de salud para los asegurados y o afiliados a POSITIVA que accedan a los servicios habilitados del CONTRATISTA en calidad de asegurados a los ramos Administración de Riesgos Laborales ARL por causa exclusiva de un accidente de trabajo una enfermedad profesional) Accidentes Personales AP Educativo Generación Positiva AP Colectivos APCorto Plazo AP Individual y demás Ramos de Seguros autorizados a Positiva encontrándose excluidos del presente contrato los servicios y todas aquellas actividades procedimientos e intervenciones que no tengan por objeto contribuir al diagnóstico tratamiento o rehabilitación de la patología derivada del siniestro o los servicios considerados como experimentales cosméticos y suntuarios.","2022-06-15",6,"2024-06-15",24.366666666666667,"Invitación directa","CargoAReserva",0,0,"NO",null,"Gerencia de Abastecimiento Estratégico\ncontratacion@positiva.gov.co\nPBX: (1)6502200 Ext: 10641","SI","SI","NO","SI","Pública clasificada","C67122022-Tipo de información Pública clasificada-Prestación de servicios: El CONTRATISTA se obliga con POSITIVA a la prestación de los servicios de salud para los asegurados y o afiliados a POSITIVA que accedan a los servicios habilitados del CONTRATISTA en calidad de asegurados a los ramos Administración de Riesgos Laborales ARL por causa exclusiva de un accidente de trabajo una enfermedad profesional) Accidentes Personales AP Educativo Generación Positiva AP Colectivos APCorto Plazo AP Individual y demás Ramos de Seguros autorizados a Positiva encontrándose excluidos del presente contrato los servicios y todas aquellas actividades procedimientos e intervenciones que no tengan por objeto contribuir al diagnóstico tratamiento o rehabilitación de la patología derivada del siniestro o los servicios considerados como experimentales cosméticos y suntuarios."]
["VICEPRESIDENCIA TÉCNICA","Gerencia Médica","NO","C67132022",85100000,"Prestación de servicios: El CONTRATISTA se obliga con POSITIVA a la prestación de los servicios de salud para los asegurados y o afiliados a POSITIVA que accedan a los servicios habilitados del CONTRATISTA en calidad de asegurados a los ramos Administración de Riesgos Laborales ARL por causa exclusiva de un accidente de trabajo una enfermedad profesional) Accidentes Personales AP Educativo Generación Positiva AP Colectivos APCorto Plazo AP Individual y demás Ramos de Seguros autorizados a Positiva encontrándose excluidos del presente contrato los servicios y todas aquellas actividades procedimientos e intervenciones que no tengan por objeto contribuir al diagnóstico tratamiento o rehabilitación de la patología derivada del siniestro o los servicios considerados como experimentales cosméticos y suntuarios.","2022-09-20",9,"2024-09-20",24.366666666666667,"Invitación directa","CargoAReserva",0,0,"NO",null,"Gerencia de Abastecimiento Estratégico\ncontratacion@positiva.gov.co\nPBX: (1)6502200 Ext: 10641","SI","SI","NO","SI","Pública clasificada","C67132022-Tipo de información Pública clasificada-Prestación de servicios: El CONTRATISTA se obliga con POSITIVA a la prestación de los servicios de salud para los asegurados y o afiliados a POSITIVA que accedan a los servicios habilitados del CONTRATISTA en calidad de asegurados a los ramos Administración de Riesgos Laborales ARL por causa exclusiva de un accidente de trabajo una enfermedad profesional) Accidentes Personales AP Educativo Generación Positiva AP Colectivos APCorto Plazo AP Individual y demás Ramos de Seguros autorizados a Positiva encontrándose excluidos del presente contrato los servicios y todas aquellas actividades procedimientos e intervenciones que no tengan por objeto contribuir al diagnóstico tratamiento o rehabilitación de la patología derivada del siniestro o los servicios considerados como experimentales cosméticos y suntuarios."]
["VICEPRESIDENCIA TÉCNICA","Gerencia Médica","NO","C67142022",85100000,"Prestación de servicios: El CONTRATISTA se obliga con POSITIVA a la prestación de los servicios de salud para los asegurados y o afiliados a POSITIVA que accedan a los servicios habilitados del CONTRATISTA en calidad de asegurados a los ramos Administración de Riesgos Laborales ARL por causa exclusiva de un accidente de trabajo una enfermedad profesional) Accidentes Personales AP Educativo Generación Positiva AP Colectivos APCorto Plazo AP Individual y demás Ramos de Seguros autorizados a Positiva encontrándose excluidos del presente contrato los servicios y todas aquellas actividades procedimientos e intervenciones que no tengan por objeto contribuir al diagnóstico tratamiento o rehabilitación de la patología derivada del siniestro o los servicios considerados como experimentales cosméticos y suntuarios.","2022-12-27",12,"2024-12-27",24.366666666666667,"Invitación directa","CargoAReserva",0,0,"NO",null,"Gerencia de Abastecimiento Estratégico\ncontratacion@positiva.gov.co\nPBX: (1)6502200 Ext: 10641","SI","SI","NO","SI","Pública clasificada","C67142022-Tipo de información Pública clasificada-Prestación de servicios: El CONTRATISTA se obliga con POSITIVA a la prestación de los servicios de salud para los asegurados y o afiliados a POSITIVA que accedan a los servicios habilitados del CONTRATISTA en calidad de asegurados a los ramos Administración de Riesgos Laborales ARL por causa exclusiva de un accidente de trabajo una enfermedad profesional) Accidentes Personales AP Educativo Generación Positiva AP Colectivos APCorto Plazo AP Individual y demás Ramos de Seguros autorizados a Positiva encontrándose excluidos del presente contrato los servicios y todas aquellas actividades procedimientos e intervenciones que no tengan por objeto contribuir al diagnóstico tratamiento o rehabilitación de la patología derivada del siniestro o los servicios considerados como experimentales cosméticos y suntuarios."]
["VICEPRESIDENCIA TÉCNICA","Gerencia Médica","NO","C67152022",85100000,"Prestación de servicios: El CONTRATISTA se obliga con POSITIVA a la prestación de los servicios de salud para los asegurados y o afiliados a POSITIVA que accedan a los servicios habilitados del CONTRATISTA en calidad de asegurados a los ramos Administración de Riesgos Laborales ARL por causa exclusiva de un accidente de trabajo una enfermedad profesional) Accidentes Personales AP Educativo Generación Positiva AP Colectivos APCorto Plazo AP Individual y demás Ramos de Seguros autorizados a Positiva encontrándose excluidos del presente contrato los servicios y todas aquellas actividades procedimientos e intervenciones que no tengan por objeto contribuir al diagnóstico tratamiento o rehabilitación de la patología derivada del siniestro o los servicios considerados como experimentales cosméticos y suntuarios.","2022-03-15",3,"2024-03-15",24.366666666666667,"Invitación directa","CargoAReserva",0,0,"NO",null,"Gerencia de Abastecimiento Estratégico\ncontratacion@positiva.gov.co\nPBX: (1)6502200 Ext: 10641","SI","SI","NO","SI","Pública clasificada","C67152022-Tipo de información Pública clasificada-Prestación de servicios: El CONTRATISTA se obliga con POSITIVA a la prestación de los servicios de salud para los asegurados y o afiliados a POSITIVA que accedan a los servicios habilitados del CONTRATISTA en calidad de asegurados a los ramos Administración de Riesgos Laborales ARL por causa exclusiva de un accidente de trabajo una enfermedad profesional) Accidentes Personales AP Educativo Generación Positiva AP Colectivos APCorto Plazo AP Individual y demás Ramos de Seguros autorizados a Positiva encontrándose excluidos del presente contrato los servicios y todas aquellas actividades procedimientos e intervenciones que no tengan por objeto contribuir al diagnóstico tratamiento o rehabilitación de la patología derivada del siniestro o los servicios considerados como experimentales cosméticos y suntuarios."]
["VICEPRESIDENCIA TÉCNICA","Gerencia Médica","NO","C67162022",85100000,"Prestación de servicios: El CONTRATISTA se obliga con POSITIVA a la prestación de los servicios de salud para los asegurados y o afiliados a POSITIVA que accedan a los servicios habilitados del CONTRATISTA en calidad de asegurados a los ramos Administración de Riesgos Laborales ARL por causa exclusiva de un accidente de trabajo una enfermedad profesional) Accidentes Personales AP Educativo Generación Positiva AP Colectivos APCorto Plazo AP Individual y demás Ramos de Seguros autorizados a Positiva encontrándose excluidos del presente contrato los servicios y todas aquellas actividades procedimientos e intervenciones que no tengan por objeto contribuir al diagnóstico tratamiento o rehabilitación de la patología derivada del siniestro o los servicios considerados como experimentales cosméticos y suntuarios.","2022-04-21",4,"2024-04-21",24.366666666666667,"Invitación directa","CargoAReserva",0,0,"NO",null,"Gerencia de Abastecimiento Estratégico\ncontratacion@positiva.gov.co\nPBX: (1)6502200 Ext: 10641","SI","SI","NO","SI","Pública clasificada","C67162022-Tipo de información Pública clasificada-Prestación de servicios: El CONTRATISTA se obliga con POSITIVA a la prestación de los servicios de salud para los asegurados y o afiliados a POSITIVA que accedan a los servicios habilitados del CONTRATISTA en calidad de asegurados a los ramos Administración de Riesgos Laborales ARL por causa exclusiva de un accidente de trabajo una enfermedad profesional) Accidentes Personales AP Educativo Generación Positiva AP Colectivos APCorto Plazo AP Individual y demás Ramos de Seguros autorizados a Positiva encontrándose excluidos del presente contrato los servicios y todas aquellas actividades procedimientos e intervenciones que no tengan por objeto contribuir al diagnóstico tratamiento o rehabilitación de la patología derivada del siniestro o los servicios considerados como experimentales cosméticos y suntuarios."]
["Financiera y Administrativa","Gcia. Logística",null,"C55072022 -  C55402022",80131502,"Arrendamiento inmueble Sucursal Meta","2021-09-01",9,"2023-09-30",25.3,"Invitación directa","GastosAdministrativos",227185083,117032733,"SI","Aprobadas",null,"NO","NO","NO","SI","Pública clasificada","C55072022 -  C55402022-Tipo de información Pública clasificada-Arrendamiento inmueble Sucursal Meta"]
["Financiera y Administrativa","Gcia. Logística",null,"C55062022",80131502,"Arrendamiento inmueble Sucursal Caquetá","2021-09-30",9,"2022-12-31",15.233333333333333,"Invitación directa","GastosAdministrativos",39000000,6337200,"SI","Aprobadas",null,"NO","NO","NO","SI","Pública clasificada","C55062022-Tipo de información Pública clasificada-Arrendamiento inmueble Sucursal Caquetá"]
["Financiera y Administrativa","Gcia. Logística",null,"C56592021-C55382022-C55032023-C55002024",80131502,"Arrendamiento inmueble Punto de Atención Antioquia","2021-10-01",10,"2024-11-30",38.533333333333331,"Invitación directa","GastosAdministrativos",574292568,182664745,"SI","Aprobada",null,"NO","NO","NO","SI","Pública clasificada","C56592021-C55382022-C55032023-C55002024-Tipo de información Pública clasificada-Arrendamiento inmueble Punto de Atención Antioquia"]
["Financiera y Administrativa","Gcia. Logística",null,"C55392022-C55042023-C55012024",80131502,"Arrendamiento inmueble Sede Administrativa Antioquia","2021-10-01",10,"2024-12-31",39.56666666666667,"Invitación directa","GastosAdministrativos",871512972,278460000,"SI","Aprobada",null,"NO","NO","NO","SI","Pública clasificada","C55392022-C55042023-C55012024-Tipo de información Pública clasificada-Arrendamiento inmueble Sede Administrativa Antioquia"]
["Financiera y Administrativa","Gcia. Logística",null,"C55042022",92101500,"Prestación de servicios de vigilancia y seguridad privada con monitoreo de alarmas para las coodirnadores sucursales y puntos de atencion de Positiva Compañía de Seguros  ","2021-09-15",9,"2022-12-31",15.733333333333333,"Invitación pública","GastosAdministrativos",1216838593,1216838593,"SI","Aprobadas",null,"NO","NO","NO","SI","Pública clasificada","C55042022-Tipo de información Pública clasificada-Prestación de servicios de vigilancia y seguridad privada con monitoreo de alarmas para las coodirnadores sucursales y puntos de atencion de Positiva Compañía de Seguros  "]
["Financiera y Administrativa","Gcia. Logística",null,"C55052022","76110000, 90101700","Prestación de servicios de Aseo y Cafeteria con el suministro de insumos y elementos para la atención a colaboradores y clientes ubicados en Casa Matriz y coodinadoras sucursales y puntos de atencion de Positiva Compañía de Seguros","2021-09-15",9,"2022-12-31",15.733333333333333,"Invitación pública","GastosAdministrativos",1539036287,1539036287,"SI","Aprobadas",null,"NO","NO","NO","SI","Pública clasificada","C55052022-Tipo de información Pública clasificada-Prestación de servicios de Aseo y Cafeteria con el suministro de insumos y elementos para la atención a colaboradores y clientes ubicados en Casa Matriz y coodinadoras sucursales y puntos de atencion de Positiva Compañía de Seguros"]
["Financiera y Administrativa","Gcia. Logística",null,"C56362022",80111612,"PRESTACIÓN DE SERVICIOS DE CONDUCTOR PARA EL APOYO A LA GESTION    PARA ATENDER TEMAS DE MOVILIDAD  EN EL EJERCICIO DE SU ACTIVIDAD ADMINISTRATIVA Y MISIONAL ASEGURADORA, PARA LAS GERENCIAS COORDINADORAS DE BOGOTÁ, MEDELLÍN, BARRANQUILLA, CALI Y BUCARAMANGA Y PARA ATENDER LAS GESTIONES PROPIAS DE LAS VICEPRESIDENCIAS, SECRETARIA GENERAL Y PRESIDENCIA DE LA COMPAÑÍA, QUE PERMITAN ATENDER DE MANERA EFECTIVA Y SEGURA LOS REQUERIMIENTOS DE LA ENTIDAD Y GARANTIZAR EL NORMAL FUNCIONAMIENTO DE POSITIVA COMPAÑÍA DE SEGUROS.    ","2022-07-15",7,"2022-12-31",5.6333333333333337,"Invitacion Directa","GastosAdministrativos",336662738,336662738,"NO",null,null,"NO","NO","NO","SI","Pública clasificada","C56362022-Tipo de información Pública clasificada-PRESTACIÓN DE SERVICIOS DE CONDUCTOR PARA EL APOYO A LA GESTION    PARA ATENDER TEMAS DE MOVILIDAD  EN EL EJERCICIO DE SU ACTIVIDAD ADMINISTRATIVA Y MISIONAL ASEGURADORA, PARA LAS GERENCIAS COORDINADORAS DE BOGOTÁ, MEDELLÍN, BARRANQUILLA, CALI Y BUCARAMANGA Y PARA ATENDER LAS GESTIONES PROPIAS DE LAS VICEPRESIDENCIAS, SECRETARIA GENERAL Y PRESIDENCIA DE LA COMPAÑÍA, QUE PERMITAN ATENDER DE MANERA EFECTIVA Y SEGURA LOS REQUERIMIENTOS DE LA ENTIDAD Y GARANTIZAR EL NORMAL FUNCIONAMIENTO DE POSITIVA COMPAÑÍA DE SEGUROS.    "]
["Financiera y Administrativa","Gcia. Logística",null,"C55032022","78131602-80161506","Prestación del servicio especializado en gestión documental de compañía para la administración y custodia del archivo físico tanto administrativo como misional de la compañía.","2022-08-09",8,"2023-10-31",{"$f":"(I669-G669)/30","v":14.933333333333334},"Invitación pública","GastosAdministrativos",2100616522,334439822,"SI",null,null,"NO","NO","NO","SI","Pública clasificada","C55032022-Tipo de información Pública clasificada-Prestación del servicio especializado en gestión documental de compañía para la administración y custodia del archivo físico tanto administrativo como misional de la compañía."]
["Financiera y Administrativa","Gcia. Logística",null,"C55872022",92121702,"Prestación de servicios para el mantenimiento preventivo del sistema de detección y alarma contra incendio del inmueble “El Limonar” de la Gerencia Sucursal Valle Tipo A ","2022-08-30",8,"2022-12-31",4.0999999999999996,"Invitación directa","GastosAdministrativos",7175700,7175700,"NO",null,null,null,null,null,null,"Pública clasificada","C55872022-Tipo de informacion Publica,  Prestación de servicios para el mantenimiento preventivo del sistema de detección y alarma contra incendio del inmueble “El Limonar” de la Gerencia Sucursal Valle Tipo A "]
["Financiera y Administrativa","Gcia. Logística",null,"C56392022",72101507,"Prestación de servicios de mantenimiento locativo sedes a Nivel Regional, Zona Norte","2022-07-01",7,"2022-12-31",6.1,"Invitación directa","GastosAdministrativos",130000000,130000000,"NO",null,null,"NO","NO","NO","SI","Pública clasificada","Tipo de información Pública clasificada-Prestacion de servicios de suministro y elementos / dispositivos para las sucursalesa nivel nacional"]
["Financiera y Administrativa","Gcia. Logística",null,"C56402022",72101507,"Prestación de servicios de mantenimiento locativo sedes a Nivel Regional, Zona Oriente","2022-07-01",7,"2022-12-31",6.1,"Invitación directa","GastosAdministrativos",45000000,45000000,"NO",null,null,"NO","NO","NO","SI","Pública clasificada","Tipo de información Pública clasificada-Prestacion de servicios de suministro y elementos / dispositivos para las sucursalesa nivel nacional"]
["Financiera y Administrativa","Gcia. Logística",null,"C56412022",72101507,"Prestación de servicios de mantenimiento locativo sedes a Nivel Regional, Zona Occidente","2022-07-01",7,"2022-12-31",6.1,"Invitación directa","GastosAdministrativos",97000000,97000000,"NO",null,null,"NO","NO","NO","SI","Pública clasificada","Tipo de información Pública clasificada-Prestacion de servicios de suministro y elementos / dispositivos para las sucursalesa nivel nacional"]
["Financiera y Administrativa","Gcia. Logística",null,"C56422022",72101507,"Prestación de servicios de mantenimiento locativo sedes a Nivel Regional, Zona Centro","2022-07-01",7,"2022-12-31",6.1,"Invitación directa","GastosAdministrativos",161000000,161000000,"NO",null,null,"NO","NO","NO","SI","Pública clasificada","Tipo de información Pública clasificada-Prestacion de servicios de suministro y elementos / dispositivos para las sucursalesa nivel nacional"]
["Financiera y Administrativa","Gcia. Logística",null,"C55842022",72101507,"Servicio de mantenimiento preventivo y correctivo eléctrico y mecánico de: A. equipo de presión constante compuesto por dos (2) motobombas y un (1) tablero de control; B. mantenimiento preventivo de equipo de presión red contra incendio, y C. lavado y desinfección del tanque de agua de reserva del inmueble “El Limonar” de la sucursal Valle Tipo A Coordinadora de POSITIVA COMPAÑÍA DE SEGUROS","2022-07-01",7,"2022-12-31",6.1,"Invitación directa","GastosAdministrativos",7551740,7551740,"NO",null,null,"NO","NO","NO","SI","Pública clasificada","Tipo de información Pública clasificada-Prestacion de servicios de suministro y elementos / dispositivos para las sucursalesa nivel nacional"]
["Financiera y Administrativa","Gcia. Logística",null,"C56352022",72101507,"Obra: sede casa matriz (sala de lactancia)","2022-06-20",6,"2022-07-08",0.6,"Invitación directa","GastosAdministrativos",4415672,4415672,"NO",null,null,"NO","NO","NO","SI","Pública clasificada","Tipo de información Pública clasificada-Prestacion de servicios de suministro y elementos / dispositivos para las sucursalesa nivel nacional"]
["Financiera y Administrativa","Gcia. Logística",null,"C56432022",80131502,"Vigencia 2022 (1/07/2022 al 31/12/2022) Nuevo contrato de arrendamiento  para la bodega de los activos de Positiva en proceso de remate.","2022-07-01",7,"2022-12-31",6.1,"Invitación directa","GastosAdministrativos",18207000,18207000,"NO",null,null,"NO","NO","NO","SI","Pública clasificada","Tipo de información Pública clasificada-Prestacion de servicios de suministro y elementos / dispositivos para las sucursalesa nivel nacional"]
["Financiera y Administrativa","Gcia. Logística",null,"C55932021",78181500,"PRESTACION DE SERVICIOS DE MANTENIMIENTO PREVENTIVO CORRECTIVO CON SUMINISTRO DE REPUESTOS INSUMOS Y ACCESORIOS PARA LOS VEHÍCULOS MARCA NISSAN DE PROPIEDAD DE LA COMPAÑÍA ASIGNADOS DE CASA MATRIZ, LAS COORDINADORAS BOGOTA, ANTIOQUIA, ATLANTICO, VALLE Y SANTANDER PARA SOPORTAR LA OPTIMA Y ADECUADA OPERACIÓN DE ESTOS.  ","2022-01-01",1,"2022-12-31",12.133333333333333,"Invitación directa","GastosAdministrativos",85261506,85261506,"SI","APROBADAS",null,"NO","NO","NO","SI","Pública clasificada","C55932021-Tipo de información Pública clasificada-PRESTACION DE SERVICIOS DE MANTENIMIENTO PREVENTIVO CORRECTIVO CON SUMINISTRO DE REPUESTOS INSUMOS Y ACCESORIOS PARA LOS VEHÍCULOS MARCA NISSAN DE PROPIEDAD DE LA COMPAÑÍA ASIGNADOS DE CASA MATRIZ, LAS COORDINADORAS BOGOTA, ANTIOQUIA, ATLANTICO, VALLE Y SANTANDER PARA SOPORTAR LA OPTIMA Y ADECUADA OPERACIÓN DE ESTOS.  "]
["Financiera y Administrativa","Gcia. Logística",null,"C55942021",78181500,"PRESTACION DE SERVICIOS DE MANTENIMIENTO PREVENTIVO CORRECTIVO CON SUMINISTRO DE REPUESTOS INSUMOS Y ACCESORIOS PARA EL VEHICULO DE PROPIEDAD DE LA COMPAÑÍA ASIGNADOS A LA PRESIDENCIA DE POSITIVA COMPAÑIA DE SEGUROS S.A.  PARA SOPORTAR LA OPTIMA Y ADECUADA OPERACIÓN DE ESTE.","2022-01-01",1,"2022-12-31",12.133333333333333,"Invitación directa","GastosAdministrativos",17000000,17000000,"SI","APROBADAS",null,"NO","NO","NO","SI","Pública clasificada","C55942021-Tipo de información Pública clasificada-PRESTACION DE SERVICIOS DE MANTENIMIENTO PREVENTIVO CORRECTIVO CON SUMINISTRO DE REPUESTOS INSUMOS Y ACCESORIOS PARA EL VEHICULO DE PROPIEDAD DE LA COMPAÑÍA ASIGNADOS A LA PRESIDENCIA DE POSITIVA COMPAÑIA DE SEGUROS S.A.  PARA SOPORTAR LA OPTIMA Y ADECUADA OPERACIÓN DE ESTE."]
["Financiera y Administrativa","Gcia. Logística",null,null,80131802,"Prestación de servicios de avalúos inmuebles","2022-10-01",10,"2022-12-31",3.0333333333333332,"Invitación directa","GastosAdministrativos",92799697.588200003,92799697.588200003,"NO",null,null,"NO","NO","NO","SI","Pública clasificada","-Tipo de información Pública clasificada-Prestación de servicios de avalúos inmuebles"]
["Financiera y Administrativa","Gcia. Logística",null,"C56372022",80101506,"Prestar servicios profesionales de Arquitecto, brindando apoyo y acompañamiento para la atención de los diferentes procesos, actividades y gestiones a cargo de la Gerencia de Logística de la Vicepresidencia Financiera y Administrativa de Positiva Compañía de Seguros.","2022-07-01",7,"2022-12-31",6.1,"Invitación directa","GastosAdministrativos",24000000,24000000,"NO",null,null,"SI","NO","NO","SI","Pública clasificada","Tipo de información Pública clasificada-Prestacion de servicios de suministro y elementos / dispositivos para las sucursalesa nivel nacional"]
["Financiera y Administrativa","Gcia. Logística",null,null,72101507,"Mantenimiento sede Florencia","2022-01-10",1,"2022-02-10",1.0333333333333334,"Invitación directa","GastosAdministrativos",20604329,20604329,"NO",null,null,"NO","NO","NO","NO","Pública","-Tipo de información Pública-Mantenimiento sede Florencia"]
["Financiera y Administrativa","Gcia. Logística",null,null,72101507,"Obra: punto de atención Medellin","2022-01-10",1,"2022-02-14",1.1666666666666667,"Invitación directa","GastosAdministrativos",120803118,120803118,"NO",null,null,"NO","NO","NO","NO","Pública","-Tipo de información Pública-Obra: punto de atención Medellin"]
["Financiera y Administrativa","Gcia. Logística",null,null,72101507,"Obra: sede administrativa Medellin","2022-01-17",1,"2022-02-21",1.1666666666666667,"Invitación directa","GastosAdministrativos",170079466,170079466,"NO",null,null,"NO","NO","NO","NO","Pública","-Tipo de información Pública-Obra: sede administrativa Medellin"]
["Financiera y Administrativa","Gcia. Logística",null,null,72151207,"Compraventa e instalación de aires acondicionados Medellin (sede administrativa y punto de atención)","2022-01-15",1,"2022-02-15",1.0333333333333334,"Invitación directa","GastosAdministrativos",200324235,200324235,"NO",null,null,"NO","NO","NO","NO","Pública","-Tipo de información Pública-Compraventa e instalación de aires acondicionados Medellin (sede administrativa y punto de atención)"]
["Financiera y Administrativa","Gcia. Logística",null,null,"14111828,44122003,44111515","Prestacion de servicios de suministro de papeleria utiles de oficina y elementos de archivo a nivel nacional","2022-07-01",7,"2022-12-15",5.5666666666666664,"Invitación directa","GastosAdministrativos",70000000,70000000,"NO",null,null,"NO","NO","NO","SI","Pública clasificada","-Tipo de información Pública clasificada-Prestacion de servicios de suministro de papeleria utiles de oficina y elementos de archivo a nivel nacional"]
["Financiera y Administrativa","Gcia. Logística",null,null,520000000,"suministro de elelmentos/ dispositivos sucursales","2022-02-01",2,"2022-02-15",0.46666666666666667,"Tienda virtual","GastosAdministrativos",30000000,30000000,"NO",null,null,"NO","NO","NO","SI","Pública clasificada","Tipo de información Pública clasificada-Prestacion de servicios de suministro y elementos / dispositivos para las sucursalesa nivel nacional"]
["Secretaria General y Jurídica","Ofic. Control Interno","NO","C10022022","43211500","Contrato de arrendamiento vigencia 2022 – 2023 de las licencias como administrador y usuarios de campo en la plataforma tecnológica RESOLVER:CORE, la cual soporta la trazabilidad del proceso de Auditoría Interna.","2022-10-01",{"$f":"MONTH(G688)","v":10},"2023-10-31",13.166666666666666,"Invitación directa","GastosAdministrativos",95300400,95300400,"NO","NA","Gerencia de Abastecimiento Estratégico\ncontratacion@positiva.gov.co\nPBX: (1)6502200 Ext: 10641","NO","NO","NO","NO",{"$f":"IF(U688=\"SI\",\"Pública clasificada\",\"Pública\")","v":"Pública"},{"$f":"CONCATENATE(D688,\"-\",\"Tipo de información\",\" \",V688,\"-\",F688)","v":"C10022022-Tipo de información Pública-Contrato de arrendamiento vigencia 2022 – 2023 de las licencias como administrador y usuarios de campo en la plataforma tecnológica RESOLVER:CORE, la cual soporta la trazabilidad del proceso de Auditoría Interna."}]
["SECRETARIA GENERAL Y JURÍDICA","Oficina de Tecnologías de la Información","NO","C05102022",81111506,"Prestación de servicios soporte técnico de fabricante DELL para 1 chasis y 4 cuchillas","2022-11-01",11,"2023-10-31",12.133333333333333,"Invitación directa","GastosAdministrativos",70400000,70400000,"NO","N/A","Gerencia de Abastecimiento Estratégico\ncontratacion@positiva.gov.co\nPBX: (1)6502200 Ext: 10641","NO","NO","NO","NO","Pública","C05102022-Tipo de información Pública-Prestación de servicios soporte técnico de fabricante DELL para 1 chasis y 4 cuchillas"]
["SECRETARIA GENERAL Y JURÍDICA","Oficina de Tecnologías de la Información","NO","C05132022",81112200,"Compraventa de plataforma de almacenamiento principal y switches de fibra para interconexión con servidores.","2022-07-15",{"$f":"MONTH(G690)","v":7},"2023-07-14",12.133333333333333,"Invitación cerrada","GastosAdministrativos",2715929585,2715929585,"NO","N/A","Gerencia de Abastecimiento Estratégico\ncontratacion@positiva.gov.co\nPBX: (1)6502200 Ext: 10641","NO","NO","NO","NO",{"$f":"IF(U690=\"SI\",\"Pública clasificada\",\"Pública\")","v":"Pública"},{"$f":"CONCATENATE(D690,\"-\",\"Tipo de información\",\" \",V690,\"-\",F690)","v":"C05132022-Tipo de información Pública-Compraventa de plataforma de almacenamiento principal y switches de fibra para interconexión con servidores."}]
["SECRETARIA GENERAL Y JURÍDICA","Oficina de Tecnologías de la Información","NO","C05142022",81112200,"Renovación del Software Assurance, y adquisición de licenciamiento Microsoft por un (1) año, bajo esquema  CSP y MPSA , con las características que se describen en las especificaciones técnicas.","2022-07-01",7,"2023-06-30",12.133333333333333,"Invitación directa","GastosAdministrativos",380800000,380800000,"NO","N/A","Gerencia de Abastecimiento Estratégico\ncontratacion@positiva.gov.co\nPBX: (1)6502200 Ext: 10641","NO","NO","NO","NO","Pública","C05142022-Tipo de información Pública-Renovación del Software Assurance, y adquisición de licenciamiento Microsoft por un (1) año, bajo esquema  CSP y MPSA , con las características que se describen en las especificaciones técnicas."]
["SECRETARIA GENERAL Y JURÍDICA","Oficina de Tecnologías de la Información","NO","C05152022",72151514,"Compraventa de plataforma de almacenamiento principal y switches de fibra para interconexión con servidores.","2022-10-01",10,"2023-09-30",12.133333333333333,"Invitación directa","GastosAdministrativos",31534845,31534845,"SI","N/A","Gerencia de Abastecimiento Estratégico\ncontratacion@positiva.gov.co\nPBX: (1)6502200 Ext: 10641","NO","NO","NO","NO","Pública","C05152022-Tipo de información Pública-Compraventa de plataforma de almacenamiento principal y switches de fibra para interconexión con servidores."]
["SECRETARIA GENERAL Y JURÍDICA","Oficina de Tecnologías de la Información","NO","C05162022",43212200,"Renovación del Software Assurance, y adquisición de licenciamiento Microsoft por un (1) año, bajo esquema  CSP y MPSA , con las características que se describen en las especificaciones técnicas.","2022-09-01",9,"2023-08-31",12.133333333333333,"Invitación directa","GastosAdministrativos",2612820960,2612820960,"SI","N/A","Gerencia de Abastecimiento Estratégico\ncontratacion@positiva.gov.co\nPBX: (1)6502200 Ext: 10641","NO","SI","SI","NO","Pública","C05162022-Tipo de información Pública-Renovación del Software Assurance, y adquisición de licenciamiento Microsoft por un (1) año, bajo esquema  CSP y MPSA , con las características que se describen en las especificaciones técnicas."]
["SECRETARIA GENERAL Y JURÍDICA","Oficina de Tecnologías de la Información","NO","C05172022",81112101,"Compraventa de plataforma de almacenamiento principal y switches de fibra para interconexión con servidores.","2022-09-01",9,"2023-08-31",12.133333333333333,"Invitación directa","GastosAdministrativos",839422232,839422232,"SI","N/A","Gerencia de Abastecimiento Estratégico\ncontratacion@positiva.gov.co\nPBX: (1)6502200 Ext: 10641","NO","SI","SI","NO","Pública","C05172022-Tipo de información Pública-Compraventa de plataforma de almacenamiento principal y switches de fibra para interconexión con servidores."]
["SECRETARIA GENERAL Y JURÍDICA","Oficina de Tecnologías de la Información","NO","C05182022",81112101,"Prestación de servicios de comunicaciones a través del canal dedicado de internet que funcionará como Canal de contingencia y Prestación de servicios de internet público inalámbrico y gratuito wifi","2022-07-01",7,"2023-06-30",12.133333333333333,"Invitación directa","GastosAdministrativos",538253660,177831220,"SI","N/A","Gerencia de Abastecimiento Estratégico\ncontratacion@positiva.gov.co\nPBX: (1)6502200 Ext: 10641","NO","NO","SI","NO","Pública","C05182022-Tipo de información Pública-Prestación de servicios de comunicaciones a través del canal dedicado de internet que funcionará como Canal de contingencia y Prestación de servicios de internet público inalámbrico y gratuito wifi"]
["SECRETARIA GENERAL Y JURÍDICA","Oficina de Tecnologías de la Información","NO","C05222022",81112501,"Compraventa de plataforma de almacenamiento principal y switches de fibra para interconexión con servidores.","2022-11-20",11,"2023-11-19",12.133333333333333,"Invitación directa","GastosAdministrativos",219872902,219872902,"NO","N/A","Gerencia de Abastecimiento Estratégico\ncontratacion@positiva.gov.co\nPBX: (1)6502200 Ext: 10641","NO","NO","NO","NO","Pública","C05222022-Tipo de información Pública-Compraventa de plataforma de almacenamiento principal y switches de fibra para interconexión con servidores."]
["SECRETARIA GENERAL Y JURÍDICA","Oficina de Tecnologías de la Información","NO","C05232022",81112500,"Renovación del Software Assurance, y adquisición de licenciamiento Microsoft por un (1) año, bajo esquema  CSP y MPSA , con las características que se describen en las especificaciones técnicas.","2022-07-01",7,"2023-06-30",12.133333333333333,"Invitación cerrada","GastosAdministrativos",2400120000,2400120000,"NO","N/A","Gerencia de Abastecimiento Estratégico\ncontratacion@positiva.gov.co\nPBX: (1)6502200 Ext: 10641","NO","NO","NO","NO","Pública","C05232022-Tipo de información Pública-Renovación del Software Assurance, y adquisición de licenciamiento Microsoft por un (1) año, bajo esquema  CSP y MPSA , con las características que se describen en las especificaciones técnicas."]
["SECRETARIA GENERAL Y JURÍDICA","Oficina de Tecnologías de la Información","NO","C05242022",43231512,"Licenciamiento Acrobat","2022-10-31",10,"2023-10-30",12.133333333333333,"Invitación directa","GastosAdministrativos",56628250,56628250,"NO","N/A","Gerencia de Abastecimiento Estratégico\ncontratacion@positiva.gov.co\nPBX: (1)6502200 Ext: 10641","NO","NO","NO","NO","Pública","C05242022-Tipo de información Pública-Licenciamiento Acrobat"]
["SECRETARIA GENERAL Y JURÍDICA","Oficina de Tecnologías de la Información","NO","C05302022",43233205,"Prestación de Servicios; renovación y mantenimiento de  la herramienta de  Cifrado  de  Información para todas   las  aplicaciones  que  transfieren  archivos  a  SAP. Cryptocenter","2022-12-14",12,"2023-12-13",12.133333333333333,"Invitación directa","GastosAdministrativos",109517856,109517856,"NO","N/A","Gerencia de Abastecimiento Estratégico\ncontratacion@positiva.gov.co\nPBX: (1)6502200 Ext: 10641","NO","NO","SI","NO","Pública","C05302022-Tipo de información Pública-Prestación de Servicios; renovación y mantenimiento de  la herramienta de  Cifrado  de  Información para todas   las  aplicaciones  que  transfieren  archivos  a  SAP. Cryptocenter"]
["SECRETARIA GENERAL Y JURÍDICA","Oficina de Tecnologías de la Información","NO","C05312022",43233205,"Prestación de Servicios; renovación y mantenimiento de  la herramienta de  Cifrado  de  Información para todas  las  aplicaciones  que  transfieren  archivos  a  SAP en contingencia.","2022-07-30",7,"2023-07-29",12.133333333333333,"Invitación directa","GastosAdministrativos",24097500,24097500,"NO","N/A","Gerencia de Abastecimiento Estratégico\ncontratacion@positiva.gov.co\nPBX: (1)6502200 Ext: 10641","NO","NO","SI","NO","Pública","C05312022-Tipo de información Pública-Prestación de Servicios; renovación y mantenimiento de  la herramienta de  Cifrado  de  Información para todas  las  aplicaciones  que  transfieren  archivos  a  SAP en contingencia."]
["SECRETARIA GENERAL Y JURÍDICA","Oficina de Tecnologías de la Información","NO","C05322022",43211507,"Suministrar el licenciamiento por subscripción tipo SaaS necesario para proveer el servicio de acceso remoto a PC y el servicio de escritorios y aplicaciones virtuales. ","2022-09-20",9,"2023-09-19",12.133333333333333,"Invitación directa","GastosAdministrativos",451500000,451500000,"NO","N/A","Gerencia de Abastecimiento Estratégico\ncontratacion@positiva.gov.co\nPBX: (1)6502200 Ext: 10641","NO","NO","NO","NO","Pública","C05322022-Tipo de información Pública-Suministrar el licenciamiento por subscripción tipo SaaS necesario para proveer el servicio de acceso remoto a PC y el servicio de escritorios y aplicaciones virtuales. "]
["SECRETARIA GENERAL Y JURÍDICA","Oficina de Tecnologías de la Información","NO","C05332022",32151802,"Prestación de Servicios; renovación mantenimiento Certificados Digitales SSL para sitios WEB de la Compañía.","2022-10-01",10,"2023-09-30",12.133333333333333,"Invitación directa","GastosAdministrativos",119124746,119124746,"NO","N/A","Gerencia de Abastecimiento Estratégico\ncontratacion@positiva.gov.co\nPBX: (1)6502200 Ext: 10641","NO","NO","NO","NO","Pública","C05332022-Tipo de información Pública-Prestación de Servicios; renovación mantenimiento Certificados Digitales SSL para sitios WEB de la Compañía."]
["SECRETARIA GENERAL Y JURÍDICA","Oficina de Tecnologías de la Información","NO","C05352022",81112501,"Soporte Técnico licenciamiento FIREWALL ","2022-11-01",11,"2023-10-31",12.133333333333333,"Invitación directa","GastosAdministrativos",55000000,55000000,"NO","N/A","Gerencia de Abastecimiento Estratégico\ncontratacion@positiva.gov.co\nPBX: (1)6502200 Ext: 10641","NO","SI","SI","NO","Pública","C05352022-Tipo de información Pública-Soporte Técnico licenciamiento FIREWALL "]
["SECRETARIA GENERAL Y JURÍDICA","Oficina de Tecnologías de la Información","NO","C05362022",81111801,"Renovación Licenciamiento FIREWALL de seguridad perimetral para garantizar la seguridad de la informacion","2022-11-01",11,"2023-10-31",12.133333333333333,"Invitación directa","GastosAdministrativos",70000000,70000000,"NO","N/A","Gerencia de Abastecimiento Estratégico\ncontratacion@positiva.gov.co\nPBX: (1)6502200 Ext: 10641","NO","SI","SI","NO","Pública","C05362022-Tipo de información Pública-Renovación Licenciamiento FIREWALL de seguridad perimetral para garantizar la seguridad de la informacion"]
["SECRETARIA GENERAL Y JURÍDICA","Oficina de Tecnologías de la Información","NO","C05442022",81111801,"Renovación del licenciamiento de Forcepoint para DLP en solución híbrida (nube privada fabricante y on premise), incluyendo soporte y garantía de fabricante para el licenciamiento Essential en modalidad 7x24.","2022-06-08",6,"2023-06-09",12.2,"Invitación directa","GastosAdministrativos",267851692,267851692,"NO","N/A","Gerencia de Abastecimiento Estratégico\ncontratacion@positiva.gov.co\nPBX: (1)6502200 Ext: 10641","NO","NO","NO","NO","Pública","C05442022-Tipo de información Pública-Renovación del licenciamiento de Forcepoint para DLP en solución híbrida (nube privada fabricante y on premise), incluyendo soporte y garantía de fabricante para el licenciamiento Essential en modalidad 7x24."]
["SECRETARIA GENERAL Y JURÍDICA","Oficina de Tecnologías de la Información","NO","C05452022",43233205,"Soporte Técnico licenciamiento SAINT para análisis de vulnerabilidades y pruebas de penetración de la infraestructura de Servidores y de las aplicaciones misionales","2022-09-08",9,"2023-09-07",12.133333333333333,"Invitación directa","GastosAdministrativos",18117750,18117750,"NO","N/A","Gerencia de Abastecimiento Estratégico\ncontratacion@positiva.gov.co\nPBX: (1)6502200 Ext: 10641","NO","NO","SI","NO","Pública","C05452022-Tipo de información Pública-Soporte Técnico licenciamiento SAINT para análisis de vulnerabilidades y pruebas de penetración de la infraestructura de Servidores y de las aplicaciones misionales"]
["SECRETARIA GENERAL Y JURÍDICA","Oficina de Tecnologías de la Información","NO","C05462022",43233205,"Licenciamiento; Renovación Licenciamiento SAINT para análisis de vulnerabilidades y pruebas de penetración de la infraestructura de Servidores y de las aplicaciones misionales","2022-09-08",9,"2023-09-07",12.133333333333333,"Invitación directa","GastosAdministrativos",30461810,30461810,"NO","N/A","Gerencia de Abastecimiento Estratégico\ncontratacion@positiva.gov.co\nPBX: (1)6502200 Ext: 10641","NO","NO","NO","NO","Pública","C05462022-Tipo de información Pública-Licenciamiento; Renovación Licenciamiento SAINT para análisis de vulnerabilidades y pruebas de penetración de la infraestructura de Servidores y de las aplicaciones misionales"]
["SECRETARIA GENERAL Y JURÍDICA","Oficina de Tecnologías de la Información","NO","C05522022",43231512,"Adquisicion de Licenciamiento Aruba","2022-07-18",7,"2023-07-17",12.133333333333333,"Invitación cerrada","GastosAdministrativos",60000000,60000000,"NO","N/A","Gerencia de Abastecimiento Estratégico\ncontratacion@positiva.gov.co\nPBX: (1)6502200 Ext: 10641","NO","NO","NO","NO","Pública","C05522022-Tipo de información Pública-Adquisicion de Licenciamiento Aruba"]
["SECRETARIA GENERAL Y JURÍDICA","Oficina de Tecnologías de la Información","NO","C05572022",81112000,"Adqusicion de licenciamiento Veritas netbackup 16 TB con soporte por 1 año","2022-07-15",7,"2023-03-28",8.5333333333333332,"Invitación directa","Código de Orden",180880000,180880000,"NO","N/A","Gerencia de Abastecimiento Estratégico\ncontratacion@positiva.gov.co\nPBX: (1)6502200 Ext: 10641","NO","NO","NO","NO","Pública","C05572022-Tipo de información Pública-Adqusicion de licenciamiento Veritas netbackup 16 TB con soporte por 1 año"]
["SECRETARIA GENERAL Y JURÍDICA","Oficina de Tecnologías de la Información","NO","C05582022",81112000,"Adquisicion librería de cintas 3 Drive LTO8 y 1 Drive LTO7 con tres años de garantia ","2022-07-15",7,"2023-07-30",12.666666666666666,"Invitación directa","Código de Orden",120428000,120428000,"NO","N/A","Gerencia de Abastecimiento Estratégico\ncontratacion@positiva.gov.co\nPBX: (1)6502200 Ext: 10641","NO","NO","NO","NO","Pública","C05582022-Tipo de información Pública-Adquisicion librería de cintas 3 Drive LTO8 y 1 Drive LTO7 con tres años de garantia "]
["SECRETARIA GENERAL Y JURÍDICA","Oficina de Tecnologías de la Información","NO","C05602022",81112501,"Adquisicion de licenciamiento aranda path ","2022-11-19",{"$f":"MONTH(G711)","v":11},"2023-11-18",12.133333333333333,"Invitación directa","GastosAdministrativos",129550621,129550621,"NO","N/A","Gerencia de Abastecimiento Estratégico\ncontratacion@positiva.gov.co\nPBX: (1)6502200 Ext: 10641","NO","NO","NO","NO","Pública","C05602022-Tipo de información Pública-Adquisicion de licenciamiento aranda path "]
["SECRETARIA GENERAL Y JURÍDICA","Oficina de Tecnologías de la Información","NO","C05612022",81112500,"Compra licencias  Oracle WebLogic Suite - Processor Perpetual PN L5900 y una licencia de Oracle DB Enterprise Enterprise Edition con sus respectivos Software Update License & Suppor","2022-07-01",7,"2022-12-31",6.1,"Invitación cerrada","GastosAdministrativos",768085044,768085044,"NO","N/A","Gerencia de Abastecimiento Estratégico\ncontratacion@positiva.gov.co\nPBX: (1)6502200 Ext: 10641","NO","NO","NO","NO","Pública","C05612022-Tipo de información Pública-Compra licencias  Oracle WebLogic Suite - Processor Perpetual PN L5900 y una licencia de Oracle DB Enterprise Enterprise Edition con sus respectivos Software Update License & Suppor"]
["SECRETARIA GENERAL Y JURÍDICA","Oficina de Tecnologías de la Información","NO","C05632022",81112200,"Suscripción de servicio de la herramienta RESOLVER CORE para la Oficina de Control Interno","2022-10-21",10,"2023-10-20",12.133333333333333,"Invitación directa","GastosAdministrativos",120640000,120640000,"NO","N/A","Gerencia de Abastecimiento Estratégico\ncontratacion@positiva.gov.co\nPBX: (1)6502200 Ext: 10641","NO","NO","NO","NO","Pública","C05632022-Tipo de información Pública-Suscripción de servicio de la herramienta RESOLVER CORE para la Oficina de Control Interno"]
["SECRETARIA GENERAL Y JURÍDICA","Oficina de Tecnologías de la Información","NO","C05642022",81112105,"Arrendamiento; PaaS (Plataforma como Servicio) Actualización de la plataforma tecnológica en la que está desarrollada el Portal Web de POSITIVA Compañía de Seguros S.A.","2022-08-05",8,"2023-08-04",12.133333333333333,"Invitación cerrada","GastosAdministrativos",1775812500,1775812500,"NO","N/A","Gerencia de Abastecimiento Estratégico\ncontratacion@positiva.gov.co\nPBX: (1)6502200 Ext: 10641","NO","NO","NO","NO","Pública","C05642022-Tipo de información Pública-Arrendamiento; PaaS (Plataforma como Servicio) Actualización de la plataforma tecnológica en la que está desarrollada el Portal Web de POSITIVA Compañía de Seguros S.A."]
["SECRETARIA GENERAL Y JURÍDICA","Oficina de Tecnologías de la Información","NO","C05692022",32150000,"Renovación mantenimiento de Licencias Anywhere Automation RPA","2022-12-15",12,"2023-12-14",12.133333333333333,"Invitación directa","GastosAdministrativos",87351048,87351048,"NO","N/A","Gerencia de Abastecimiento Estratégico\ncontratacion@positiva.gov.co\nPBX: (1)6502200 Ext: 10641","NO","NO","NO","NO","Pública","C05692022-Tipo de información Pública-Renovación mantenimiento de Licencias Anywhere Automation RPA"]
["SECRETARIA GENERAL Y JURÍDICA","Oficina de Tecnologías de la Información","NO","C05712022",43232202,"Prestación de Servicios mantenimiento de firma electrónica ADOBE SIGN","2022-11-22",11,"2023-11-21",12.133333333333333,"Invitación directa","GastosAdministrativos",106600000,106600000,"NO","N/A","Gerencia de Abastecimiento Estratégico\ncontratacion@positiva.gov.co\nPBX: (1)6502200 Ext: 10641","NO","NO","NO","NO","Pública","C05712022-Tipo de información Pública-Prestación de Servicios mantenimiento de firma electrónica ADOBE SIGN"]
["SECRETARIA GENERAL Y JURÍDICA","Oficina de Tecnologías de la Información","NO","C05732022",81000000,"Prestación de Servicio; desarrollo de nuevos productos sobre la plataforma IAXIS y web","2022-09-01",9,"2022-12-31",4.0333333333333332,"Invitación directa","GastosAdministrativos",600000000,600000000,"NO","N/A","Gerencia de Abastecimiento Estratégico\ncontratacion@positiva.gov.co\nPBX: (1)6502200 Ext: 10641","NO","NO","NO","NO","Pública","C05732022-Tipo de información Pública-Prestación de Servicio; desarrollo de nuevos productos sobre la plataforma IAXIS y web"]
["SECRETARIA GENERAL Y JURÍDICA","Oficina de Tecnologías de la Información","NO","C05742022",81000000,"Prestación de Servicios; ROADMAP - VIDA Productos FASE II","2022-09-01",9,"2022-12-31",4.0333333333333332,"Invitación directa","GastosAdministrativos",1016735482,1016735482,"NO","N/A","Gerencia de Abastecimiento Estratégico\ncontratacion@positiva.gov.co\nPBX: (1)6502200 Ext: 10641","NO","NO","NO","NO","Pública","C05742022-Tipo de información Pública-Prestación de Servicios; ROADMAP - VIDA Productos FASE II"]
["SECRETARIA GENERAL Y JURÍDICA","Oficina de Tecnologías de la Información","NO","C05762022",81000000,"Prestación de servicio, Implementación nuevas funcionalidades ERP (SAP) - S4HANA Licenciamiento","2022-08-15",8,"2022-12-31",4.5999999999999996,"Invitación directa","GastosAdministrativos",573247500,573247500,"NO","N/A","Gerencia de Abastecimiento Estratégico\ncontratacion@positiva.gov.co\nPBX: (1)6502200 Ext: 10641","NO","NO","NO","NO","Pública","C05762022-Tipo de información Pública-Prestación de servicio, Implementación nuevas funcionalidades ERP (SAP) - S4HANA Licenciamiento"]
["SECRETARIA GENERAL Y JURÍDICA","Oficina de Tecnologías de la Información","NO","C05772022",81000000,"Prestación de servicio, Implementación nuevas funcionalidades ERP (SAP) - S4HANA - Servicios","2022-08-15",8,"2022-12-31",4.5999999999999996,"Invitación directa","GastosAdministrativos",680000000,680000000,"NO","N/A","Gerencia de Abastecimiento Estratégico\ncontratacion@positiva.gov.co\nPBX: (1)6502200 Ext: 10641","NO","NO","NO","NO","Pública","C05772022-Tipo de información Pública-Prestación de servicio, Implementación nuevas funcionalidades ERP (SAP) - S4HANA - Servicios"]
["SECRETARIA GENERAL Y JURÍDICA","Oficina de Tecnologías de la Información","NO","C05922022",43231512,"Conversión de Licencias SAP ASE Base de Datos ALWAYS ON (SIARP-SISE)","2022-07-01",7,"2022-12-31",6.1,"Invitación directa","GastosAdministrativos",670800000,670800000,"NO","N/A","Gerencia de Abastecimiento Estratégico\ncontratacion@positiva.gov.co\nPBX: (1)6502200 Ext: 10641","NO","NO","NO","NO","Pública","C05922022-Tipo de información Pública-Conversión de Licencias SAP ASE Base de Datos ALWAYS ON (SIARP-SISE)"]
["SECRETARIA GENERAL Y JURÍDICA","Oficina de Tecnologías de la Información","NO","C05932022",43231512,"Implementación de JBPM - Red Hat OpenShift Container Platform with Middleware Portfolio, Premium, (2 Cores or 4 vCPUs) Cantidad: 8","2022-09-01",9,"2022-12-31",4.0333333333333332,"Invitación directa","GastosAdministrativos",433680000,433680000,"NO","N/A","Gerencia de Abastecimiento Estratégico\ncontratacion@positiva.gov.co\nPBX: (1)6502200 Ext: 10641","NO","NO","NO","NO","Pública","C05932022-Tipo de información Pública-Implementación de JBPM - Red Hat OpenShift Container Platform with Middleware Portfolio, Premium, (2 Cores or 4 vCPUs) Cantidad: 8"]
["SECRETARIA GENERAL Y JURÍDICA","Oficina de Tecnologías de la Información","NO","C05942022",43231512,"Servicios para migrar JBPM a PAM y entrenamiento para 6 personas","2022-09-01",9,"2022-12-31",4.0333333333333332,"Invitación directa","GastosAdministrativos",300000000,300000000,"NO","N/A","Gerencia de Abastecimiento Estratégico\ncontratacion@positiva.gov.co\nPBX: (1)6502200 Ext: 10641","NO","NO","NO","NO","Pública","C05942022-Tipo de información Pública-Servicios para migrar JBPM a PAM y entrenamiento para 6 personas"]
["SECRETARIA GENERAL Y JURÍDICA","Oficina de Tecnologías de la Información","NO","C05952022",81112200,"servicios profesionales para la modernización de Integración de aplicaciones y arquitectura ISARL utilizando y adoptando contenedores desde la perspectiva de Red Hat- Openshift y desarrollo de microservicios","2022-01-15",1,"2022-12-31",11.666666666666666,"Invitación directa","GastosAdministrativos",70320961,70320961,"NO","N/A","Gerencia de Abastecimiento Estratégico\ncontratacion@positiva.gov.co\nPBX: (1)6502200 Ext: 10641","NO","NO","NO","NO","Pública","C05952022-Tipo de información Pública-servicios profesionales para la modernización de Integración de aplicaciones y arquitectura ISARL utilizando y adoptando contenedores desde la perspectiva de Red Hat- Openshift y desarrollo de microservicios"]
["SECRETARIA GENERAL Y JURÍDICA","Oficina de Tecnologías de la Información","NO","C05992022",81112006,"Prestación de servicios de transporte, almacenamiento y custodia medios magnéticos","2022-11-30",11,"2022-12-31",1.0333333333333334,"Invitación directa","GastosAdministrativos",1620000,1620000,"NO","N/A","Gerencia de Abastecimiento Estratégico\ncontratacion@positiva.gov.co\nPBX: (1)6502200 Ext: 10641","NO","NO","NO","NO","Pública","C05992022-Tipo de información Pública-Prestación de servicios de transporte, almacenamiento y custodia medios magnéticos"]
["SECRETARIA GENERAL Y JURÍDICA","Oficina de Tecnologías de la Información","NO","C06002022",81111801,"Honorarios, servicio de Ethical Hacking","2022-11-30",11,"2023-07-30",8.0666666666666664,"Invitación directa","GastosAdministrativos",18785554,18785554,"NO","N/A","Gerencia de Abastecimiento Estratégico\ncontratacion@positiva.gov.co\nPBX: (1)6502200 Ext: 10641","NO","NO","NO","NO","Pública","C06002022-Tipo de información Pública-Honorarios, servicio de Ethical Hacking"]
["SECRETARIA GENERAL Y JURÍDICA","Oficina de Tecnologías de la Información","NO","C06012022",81112501,"Licenciamiento; Renovación de la Licencia","2022-11-30",11,"2022-12-31",1.0333333333333334,"Invitación directa","GastosAdministrativos",401467,401467,"NO","N/A","Gerencia de Abastecimiento Estratégico\ncontratacion@positiva.gov.co\nPBX: (1)6502200 Ext: 10641","NO","NO","NO","NO","Pública","C06012022-Tipo de información Pública-Licenciamiento; Renovación de la Licencia"]
["SECRETARIA GENERAL Y JURÍDICA","Oficina de Tecnologías de la Información","NO","C06022022",81112500,"Servicio arrendamiento licencias","1/09/2022",9,"31/12/2022",4.0333333333333332,"Invitación cerrada","GastosAdministrativos",1720573622,1720573622,"NO","N/A","Gerencia de Abastecimiento Estratégico\ncontratacion@positiva.gov.co\nPBX: (1)6502200 Ext: 10641","NO","NO","NO","NO","Pública","C06022022-Tipo de información Pública-Servicio arrendamiento licencias"]
["SECRETARIA GENERAL Y JURÍDICA","Oficina de Tecnologías de la Información","NO","C06032022",8100000,"Prestación de servicios, Desarrollo solución producto BEPS","2022-07-01",7,"2022-12-31",6.1,"Invitación directa","GastosAdministrativos",205000000,205000000,"NO","N/A","Gerencia de Abastecimiento Estratégico\ncontratacion@positiva.gov.co\nPBX: (1)6502200 Ext: 10641","NO","NO","NO","NO","Pública","C06032022-Tipo de información Pública-Prestación de servicios, Desarrollo solución producto BEPS"]
["SECRETARIA GENERAL Y JURÍDICA","Oficina de Tecnologías de la Información","NO","C06082022",81111801,"Soporte, configuración atención de requerimientos Equipos Switch Fase II en la infraestructura de la compañía (Hardware Refresh)","2022-07-01",7,"2022-12-31",6.1,"Invitación cerrada","GastosAdministrativos",260000000,260000000,"NO","N/A","Gerencia de Abastecimiento Estratégico\ncontratacion@positiva.gov.co\nPBX: (1)6502200 Ext: 10641","NO","NO","NO","NO","Pública","C06082022-Tipo de información Pública-Soporte, configuración atención de requerimientos Equipos Switch Fase II en la infraestructura de la compañía (Hardware Refresh)"]
["SECRETARIA GENERAL Y JURÍDICA","Oficina de Tecnologías de la Información","NO","C05472022",43222610,"Compraventa de servidores Dell, para virtualización","2022-08-15",7,"2022-12-31",4.5999999999999996,"Invitación cerrada","GastosAdministrativos",912920444,912920444,"NO","N/A","Gerencia de Abastecimiento Estratégico\ncontratacion@positiva.gov.co\nPBX: (1)6502200 Ext: 10641","NO","NO","NO","NO","Pública","C05472022-Tipo de información Pública-Equipos Switch Fase II en la infraestructura de la compañía (Hardware Refresh)"]
["SECRETARIA GENERAL Y JURÍDICA","Oficina de Tecnologías de la Información","NO","C06142022",81112200,"Servicio arrendamiento licencias","1/09/2022",9,"31/12/2022",4.0333333333333332,"Invitación directa","Código de Orden",319240985,319240985,"NO","N/A","Gerencia de Abastecimiento Estratégico\ncontratacion@positiva.gov.co\nPBX: (1)6502200 Ext: 10641","NO","NO","NO","NO","Pública","C06142022-Tipo de información Pública-Servicio arrendamiento licencias"]
["Promoción y Prevención","Gcia. Administración del Riesgo","NO","C84112022",93141808,"EL CONTRATISTA, se compromete a la Prestación de servicios de Promoción y Prevención para  implementar,  mejorar  y/o  mantener  actividades  de  asesoría,  asistencia  técnica  del Sistema de Gestión de la Seguridad y Salud en el Trabajo con base en los programas del PLAN  BÁSICO  LEGAL,  PLAN  AVANZADOY  PLAN  ESPECIALIZADO,  de  la  estrategia CREA  del  Modelo  de  Gestión  POSITIVA  SUMA,  así  como  también  la  elaboración  y actualización de la Matriz Legal del Sistema, de acuerdo con la actividad económica de las empresas, al igual que el acompañamiento para la investigación de presuntos accidentes de trabajo   graves,   mortales   o   leves   (que   por   concepto   técnico   lo   ameriten),   con   la implementación  de  estrategias  para  la  prevención  de  accidentes  laborales  buscando  el impacto  de  la  siniestralidad,  asesoría  técnica  especializada  para  cubrir  la  demanda  de solicitudes de reclasificación de empresas por requerimientos internos de la compañía y por entes de control y vigilancia, para fortalecer la intervención en las empresas Pymes afiliadas a  POSITIVA  COMPAÑÍA  DE  SEGUROS  S.A.,  bajo  el  lineamiento  de  intervención  del prototipo técnico, con un grupo de personal interdisciplinario para ser desarrolladas en las sucursales de las zonas de Atlántico, Antioquia, Valle, Santander, Bogotá y Cundinamarca, en la modalidad de atención GRAN MI PYME","2022-08-15","AGOSTO","2022-09-30",{"$f":"(I733-G733)/30","v":1.5333333333333334},"Invitación directa","PromociónyPrevención",486559500,{"$f":"+M733","v":486559500},"NO","NA","Gerencia de Abastecimiento Estratégico\ncontratacion@positiva.gov.co\nPBX: (1)6502200 Ext: 10819","NO","NO","NO","SI",{"$f":"IF(U733=\"SI\",\"Pública clasificada\",\"Pública\")","v":"Pública clasificada"},{"$f":"CONCATENATE(D733,\"-\",\"Tipo de información\",\" \",V733,\"-\",F733)","v":"C84112022-Tipo de información Pública clasificada-EL CONTRATISTA, se compromete a la Prestación de servicios de Promoción y Prevención para  implementar,  mejorar  y/o  mantener  actividades  de  asesoría,  asistencia  técnica  del Sistema de Gestión de la Seguridad y Salud en el Trabajo con base en los programas del PLAN  BÁSICO  LEGAL,  PLAN  AVANZADOY  PLAN  ESPECIALIZADO,  de  la  estrategia CREA  del  Modelo  de  Gestión  POSITIVA  SUMA,  así  como  también  la  elaboración  y actualización de la Matriz Legal del Sistema, de acuerdo con la actividad económica de las empresas, al igual que el acompañamiento para la investigación de presuntos accidentes de trabajo   graves,   mortales   o   leves   (que   por   concepto   técnico   lo   ameriten),   con   la implementación  de  estrategias  para  la  prevención  de  accidentes  laborales  buscando  el impacto  de  la  siniestralidad,  asesoría  técnica  especializada  para  cubrir  la  demanda  de solicitudes de reclasificación de empresas por requerimientos internos de la compañía y por entes de control y vigilancia, para fortalecer la intervención en las empresas Pymes afiliadas a  POSITIVA  COMPAÑÍA  DE  SEGUROS  S.A.,  bajo  el  lineamiento  de  intervención  del prototipo técnico, con un grupo de personal interdisciplinario para ser desarrolladas en las sucursales de las zonas de Atlántico, Antioquia, Valle, Santander, Bogotá y Cundinamarca, en la modalidad de atención GRAN MI PYME"}]
["Promoción y Prevención","Gcia. Administración del Riesgo","NO","C84122022",93141808,"ELCONTRATISTA, se  compromete  a la prestación  de  servicios  de  Promoción  y  Prevención  para implementar, mejorar y/o mantener actividades de asesoría, asistencia técnica del Sistema de Gestión de la  Seguridad  y  Salud  en  el  Trabajo  con  base  en  los  programas  del  PLAN  BÁSICO  LEGAL,  PLAN AVANZADO Y PLAN ESPECIALIZADO, de la estrategia CREA del Modelo de Gestión POSITIVA SUMA, al igual que el acompañamiento para la investigación de presuntos accidentes de trabajo graves, mortales o leves (que por concepto técnico lo ameriten), con la implementación de estrategias para la prevención de accidentes laborales buscando el impacto de la siniestralidad, asesoría técnica especializada para cubrir la demanda de solicitudes de reclasificación de empresas por requerimientos internos de la compañía y por entes  de  control  y  vigilancia,  para  fortalecer  la  intervención  en  las  empresas  afiliadas  a  POSITIVA COMPAÑÍA DE SEGUROS S.A., bajo el lineamiento de intervención del prototipo técnico, con un grupo de personal  interdisciplinario  para  ser  desarrolladas  en  las  sucursales  de  las  zonas  de  Atlántico,  Antioquia, Valle, Santander, Coordinadora Bogotá, en la modalidad de atención GRAN MI PYME y GRAN EMPRESA","2022-08-15","AGOSTO","2022-09-30",1.5333333333333334,"Invitación directa","PromociónyPrevención",487492500,{"$f":"+M734","v":487492500},"NO","NA","Gerencia de Abastecimiento Estratégico\ncontratacion@positiva.gov.co\nPBX: (1)6502200 Ext: 10819","NO","NO","NO","SI","Pública clasificada","C84122022-Tipo de información Pública clasificada-ELCONTRATISTA, se  compromete  a la prestación  de  servicios  de  Promoción  y  Prevención  para implementar, mejorar y/o mantener actividades de asesoría, asistencia técnica del Sistema de Gestión de la  Seguridad  y  Salud  en  el  Trabajo  con  base  en  los  programas  del  PLAN  BÁSICO  LEGAL,  PLAN AVANZADO Y PLAN ESPECIALIZADO, de la estrategia CREA del Modelo de Gestión POSITIVA SUMA, al igual que el acompañamiento para la investigación de presuntos accidentes de trabajo graves, mortales o leves (que por concepto técnico lo ameriten), con la implementación de estrategias para la prevención de accidentes laborales buscando el impacto de la siniestralidad, asesoría técnica especializada para cubrir la demanda de solicitudes de reclasificación de empresas por requerimientos internos de la compañía y por entes  de  control  y  vigilancia,  para  fortalecer  la  intervención  en  las  empresas  afiliadas  a  POSITIVA COMPAÑÍA DE SEGUROS S.A., bajo el lineamiento de intervención del prototipo técnico, con un grupo de personal  interdisciplinario  para  ser  desarrolladas  en  las  sucursales  de  las  zonas  de  Atlántico,  Antioquia, Valle, Santander, Coordinadora Bogotá, en la modalidad de atención GRAN MI PYME y GRAN EMPRESA"]
["Promoción y Prevención","Gcia. Administración del Riesgo","NO","C81432022",93141808,"EL  CONTRATISTA,se  compromete  a la Prestación  de  servicios  de  apoyo  logístico,  que permitan garantizar la adecuada ejecución de las actividades del Plan de Trabajo pactado con  Fiscalía  General  de  la  Nación  y  Rama  Judicial;  como  soporte  para  la  organización  y ejecución  de eventos,  programas  y  actividades  de  Seguridad  y  Salud  en  el  trabajo. Adicionalmente, se requiere contar con el desarrollo de campañas ATL, BTL, servicios de planeación  estratégica,  creativa  y  divulgación  para  el  apoyo  de  la  gestión  en  SST  de  las empresas afiliadas, enmarcado en nuestras líneas de acción estratégica Positiva Comunica y Positiva Educa a Nivel Nacional.","2022-08-15","AGOSTO","2022-09-30",1.5333333333333334,"Invitación directa","PromociónyPrevención",487000000,487000000,"NO","NA","Gerencia de Abastecimiento Estratégico\ncontratacion@positiva.gov.co\nPBX: (1)6502200 Ext: 10819","NO","NO","NO","SI","Pública clasificada","C81432022-Tipo de información Pública clasificada-EL  CONTRATISTA,se  compromete  a la Prestación  de  servicios  de  apoyo  logístico,  que permitan garantizar la adecuada ejecución de las actividades del Plan de Trabajo pactado con  Fiscalía  General  de  la  Nación  y  Rama  Judicial;  como  soporte  para  la  organización  y ejecución  de eventos,  programas  y  actividades  de  Seguridad  y  Salud  en  el  trabajo. Adicionalmente, se requiere contar con el desarrollo de campañas ATL, BTL, servicios de planeación  estratégica,  creativa  y  divulgación  para  el  apoyo  de  la  gestión  en  SST  de  las empresas afiliadas, enmarcado en nuestras líneas de acción estratégica Positiva Comunica y Positiva Educa a Nivel Nacional."]
["Promoción y Prevención","Gcia. Investigación y Control d","NO","C83192022",93141808,"Prestación de servicios de asesoría y acciones de educación en seguridad, salud en el trabajo, promoción de la salud y prevención de riesgos laborales, en modalidad: presencial, multimodal y virtual, participación en el Vigesimosegundo Congreso Internacional ORP 2022 acordes con el modelo y las políticas de gestión de promoción y prevención POSITIVA SUMA y la línea de acción POSITIVA EDUCA , con el fin de garantizar la atención de empresas afiliadas a POSITIVA Compañía de Seguros S.A. en el territorio nacional, asegurando el cumplimiento por parte de la compañía de las obligaciones comprendidas en el ordenamiento legal – Decreto Único Reglamentario del Sector Trabajo 1072 de 2015 y los Estándares Mínimos en Sistemas de Gestión de Seguridad y Salud en el Trabajo","2022-07-28","JULIO","2022-09-30",2.1333333333333333,"Invitación directa","PromociónyPrevención",490563940,{"$f":"+M736","v":490563940},"NO","NA","Gerencia de Abastecimiento Estratégico\ncontratacion@positiva.gov.co\nPBX: (1)6502200 Ext: 10819","NO","NO","NO","SI",{"$f":"IF(U736=\"SI\",\"Pública clasificada\",\"Pública\")","v":"Pública clasificada"},"C83192022-Tipo de información Pública clasificada-Prestación de servicios de asesoría y acciones de educación en seguridad, salud en el trabajo, promoción de la salud y prevención de riesgos laborales, en modalidad: presencial, multimodal y virtual, participación en el Vigesimosegundo Congreso Internacional ORP 2022 acordes con el modelo y las políticas de gestión de promoción y prevención POSITIVA SUMA y la línea de acción POSITIVA EDUCA , con el fin de garantizar la atención de empresas afiliadas a POSITIVA Compañía de Seguros S.A. en el territorio nacional, asegurando el cumplimiento por parte de la compañía de las obligaciones comprendidas en el ordenamiento legal – Decreto Único Reglamentario del Sector Trabajo 1072 de 2015 y los Estándares Mínimos en Sistemas de Gestión de Seguridad y Salud en el Trabajo"]
["Financiera y Administrativa","Gcia. Logística",null,"C56502022",72101507,"Prestación de servicios de mantenimiento locativo sedes a Nivel Regional, Zona Suroccidente","2022-08-15",{"$f":"MONTH(G737)","v":8},"2022-12-31",4.5999999999999996,"Invitación directa","GastosAdministrativos",60000000,60000000,"NO",null,"Gerencia de Abastecimiento Estratégico\ncontratacion@positiva.gov.co\nPBX: (1)6502200 Ext: 10819","NO","NO","NO","SI",{"$f":"IF(U737=\"SI\",\"Pública clasificada\",\"Pública\")","v":"Pública clasificada"},"C56502022-Tipo de información Pública clasificada-Prestación de servicios de mantenimiento locativo sedes a Nivel Regional, Zona Suroccidente"]
["Financiera y Administrativa","Gcia. Logística",null,"C56512022",78181701,"SUMINISTRO DE COMBUSTIBLE PARA LOS VEHICULOS DE DE POSITIVA COMPAÑÍA DE SEGUROS DE CASA MATRIZ, COORDINADORAS BOGOTA, ANTIOQUIA, VALLE Y ATLANTICO","2022-08-15",{"$f":"MONTH(G738)","v":8},"2022-12-31",4.5999999999999996,"Invitación directa","GastosAdministrativos",26000000,26000000,"NO",null,"Gerencia de Abastecimiento Estratégico\ncontratacion@positiva.gov.co\nPBX: (1)6502200 Ext: 10819","NO","NO","NO","SI",{"$f":"IF(U738=\"SI\",\"Pública clasificada\",\"Pública\")","v":"Pública clasificada"},"C56512022-Tipo de información Pública clasificada-SUMINISTRO DE COMBUSTIBLE PARA LOS VEHICULOS DE DE POSITIVA COMPAÑÍA DE SEGUROS DE CASA MATRIZ, COORDINADORAS BOGOTA, ANTIOQUIA, VALLE Y ATLANTICO"]
["Promoción y Prevención","Gcia. Investigación y Control d","NO","C83572022",93141808,"Arrendamiento de solución tecnológica de orientación especializada RenAPP (uso, capacitación y adecuación de la aplicación) para la atención de estrategias de riesgo psicosocial dentro del programa POSITIVAMENTE A TU LADO del modelo Psicosocial Positivamente Saludable para las empresas afiliadas a Positiva Compañía de Seguros","2022-09-01",{"$f":"MONTH(G739)","v":9},"2022-12-31",4.0333333333333332,"Invitación directa","PromociónyPrevención",37500000,{"$f":"+M739","v":37500000},"NO","NA","Gerencia de Abastecimiento Estratégico\ncontratacion@positiva.gov.co\nPBX: (1)6502200 Ext: 10819","NO","NO","NO","SI","Pública clasificada","C83572022-Tipo de información Pública clasificada-Arrendamiento de solución tecnológica de orientación especializada RenAPP (uso, capacitación y adecuación de la aplicación) para la atención de estrategias de riesgo psicosocial dentro del programa POSITIVAMENTE A TU LADO del modelo Psicosocial Positivamente Saludable para las empresas afiliadas a Positiva Compañía de Seguros"]
["Promoción y Prevención","Gcia. Administración del Riesgo","NO","C79442022",93141808,"EL CONTRATISTA se compromete a realizar la Prestación de servicios de promoción y prevención para implementar, mejorar y/o mantener actividades de asesoría técnica del sistema de gestión de seguridad y salud en trabajo, con base en los programas de la estrategia positiva crea del modelo de gestión positiva suma en el plan avanzado programa gestión para el control de incidentes y accidentes de trabajo y programa de gestión prevención de la enfermedad profesional, plan de gestión integral, (programa sistema de gestión en s&so-ohsas 18001) de las empresas afiliadas a positiva compañía de seguros, en la modalidad de atención de planes gran empresa para la sucursal tipo b - Boyacá de la sucursal coordinadora Santander.","2022-09-01",9,"2022-11-30",3,"Invitación directa","PromociónyPrevención",50000000,50000000,"NO","NA","Gerencia de Abastecimiento Estratégico\ncontratacion@positiva.gov.co\nPBX: (1)6502200 Ext: 10819","NO","NO","NO","SI","Pública clasificada","C79442022-Tipo de información Pública clasificada-EL CONTRATISTA se compromete a realizar la Prestación de servicios de promoción y prevención para implementar, mejorar y/o mantener actividades de asesoría técnica del sistema de gestión de seguridad y salud en trabajo, con base en los programas de la estrategia positiva crea del modelo de gestión positiva suma en el plan avanzado programa gestión para el control de incidentes y accidentes de trabajo y programa de gestión prevención de la enfermedad profesional, plan de gestión integral, (programa sistema de gestión en s&so-ohsas 18001) de las empresas afiliadas a positiva compañía de seguros, en la modalidad de atención de planes gran empresa para la sucursal tipo b - Boyacá de la sucursal coordinadora Santander."]
["Promoción y Prevención","Gcia. Administración del Riesgo","NO","C79452022",93141808,"EL CONTRATISTA se compromete a realizar la Prestación de servicios de Promoción y Prevención para implementar, mejorar y/o mantener actividades de asesoría, asistencia técnica y de formación en Seguridad y Salud en el Trabajo, según los programas de los Planes de la Estrategia CREA del Modelo de Gestión Positiva SUMA  del  PLAN BÁSICO - programa preparación y atención de emergencias, programa de promoción y prevención en salud  - PLAN AVANZADO -  Programa Gestión para la Prevención de la Enfermedad Laboral PLAN ESPECIALIZADO - Programas de Vigilancia Epidemiológica y PLAN GESTION INTEGRAL – Sistemas Integrados de Gestión para el acompañamiento de  POSITIVA COMPAÑÍA DE SEGUROS para las  empresas de la  Sucursal Norte de Santander de la Zona Santander.  ","2022-09-01",9,"2022-12-31",4.0333333333333332,"Invitación directa","PromociónyPrevención",250000000,250000000,"NO","NA","Gerencia de Abastecimiento Estratégico\ncontratacion@positiva.gov.co\nPBX: (1)6502200 Ext: 10819","NO","NO","NO","SI","Pública clasificada","C79452022-Tipo de información Pública clasificada-EL CONTRATISTA se compromete a realizar la Prestación de servicios de Promoción y Prevención para implementar, mejorar y/o mantener actividades de asesoría, asistencia técnica y de formación en Seguridad y Salud en el Trabajo, según los programas de los Planes de la Estrategia CREA del Modelo de Gestión Positiva SUMA  del  PLAN BÁSICO - programa preparación y atención de emergencias, programa de promoción y prevención en salud  - PLAN AVANZADO -  Programa Gestión para la Prevención de la Enfermedad Laboral PLAN ESPECIALIZADO - Programas de Vigilancia Epidemiológica y PLAN GESTION INTEGRAL – Sistemas Integrados de Gestión para el acompañamiento de  POSITIVA COMPAÑÍA DE SEGUROS para las  empresas de la  Sucursal Norte de Santander de la Zona Santander.  "]
["Promoción y Prevención","Gcia. Administración del Riesgo","NO","C76432022",93141808,"EL CONTRATISTA se compromete a realizar la Prestación de servicios de Promoción y Prevención para implementar, mejorar y/o mantener actividades de asesoría técnica del Sistema de Gestión de Seguridad y Salud en Trabajo, con base en los Programas de la Estrategia POSITIVA CREA del Modelo de Gestión POSITIVA SUMA, en PLAN BASICO Preparación y Atención de Emergencias, Protección colectiva e individual y PLAN AVANZADO, gestión para la prevención del accidente, para la atención de las empresas afiliadas a Positiva Compañía de Seguros, especialmente Oisnamed, Empresa de servicios temporales Talento dinámico y talento misional, en la modalidad de atención de planes GRAN EMPRESA en la sucursal Atlántico ","2022-09-01",9,"2022-11-30",3,"Invitación directa","PromociónyPrevención",10752800,10752800,"NO","NA","Gerencia de Abastecimiento Estratégico\ncontratacion@positiva.gov.co\nPBX: (1)6502200 Ext: 10819","NO","NO","NO","SI","Pública clasificada","C76432022-Tipo de información Pública clasificada-EL CONTRATISTA se compromete a realizar la Prestación de servicios de Promoción y Prevención para implementar, mejorar y/o mantener actividades de asesoría técnica del Sistema de Gestión de Seguridad y Salud en Trabajo, con base en los Programas de la Estrategia POSITIVA CREA del Modelo de Gestión POSITIVA SUMA, en PLAN BASICO Preparación y Atención de Emergencias, Protección colectiva e individual y PLAN AVANZADO, gestión para la prevención del accidente, para la atención de las empresas afiliadas a Positiva Compañía de Seguros, especialmente Oisnamed, Empresa de servicios temporales Talento dinámico y talento misional, en la modalidad de atención de planes GRAN EMPRESA en la sucursal Atlántico "]
["Promoción y Prevención","Gcia. Administración del Riesgo","NO","C77902022",93141808,"El contratista, se compromete a la prestación de servicios de promoción y prevención para implementar, mejorar y/o mantener actividades de asesoría técnica del Sistema de Gestión de Seguridad y Salud en Trabajo, con base en los programas de la estrategia Positiva CREA del modelo de gestión Positiva SUMA, Plan Básico (programa de estructura empresarial, programa de prevención y protección colectiva e individual) y Plan Gestión Integral (programa sistema de gestión en S&SO – OSHAS 18001) generando impacto en la disminución de la siniestralidad para el acompañamiento de las empresas afiliadas a Positiva Compañía de Seguros en la Sucursal Coordinadora Bogotá en la modalidad de atención Planes Gran Empresa.","2022-09-01",9,"2022-11-30",3,"Invitación directa","PromociónyPrevención",150000000,150000000,"NO","NA","Gerencia de Abastecimiento Estratégico\ncontratacion@positiva.gov.co\nPBX: (1)6502200 Ext: 10819","NO","NO","NO","SI","Pública clasificada","C77902022-Tipo de información Pública clasificada-El contratista, se compromete a la prestación de servicios de promoción y prevención para implementar, mejorar y/o mantener actividades de asesoría técnica del Sistema de Gestión de Seguridad y Salud en Trabajo, con base en los programas de la estrategia Positiva CREA del modelo de gestión Positiva SUMA, Plan Básico (programa de estructura empresarial, programa de prevención y protección colectiva e individual) y Plan Gestión Integral (programa sistema de gestión en S&SO – OSHAS 18001) generando impacto en la disminución de la siniestralidad para el acompañamiento de las empresas afiliadas a Positiva Compañía de Seguros en la Sucursal Coordinadora Bogotá en la modalidad de atención Planes Gran Empresa."]
["Promoción y Prevención","Gcia. Administración del Riesgo","NO","C77912022",93141808,"El contratista, se compromete a la prestación de servicios de promoción y prevención para implementar, mejorar y/o mantener actividades de asesoría técnica del Sistema de Gestión de Seguridad y Salud en Trabajo, con base en los programas de la estrategia Positiva CREA del modelo de gestión Positiva SUMA, Plan Básico (programa de prevención y protección colectiva e individual) y Plan Avanzado (programa gestión para el control de incidentes y accidentes de trabajo) generando impacto en la disminución de la siniestralidad para el acompañamiento de las empresas afiliadas a positiva compañía de seguros en la zona Bogotá; Sucursal Coordinadora Bogotá en la modalidad de atención Planes Gran Empresa. ","2022-09-01",9,"2022-11-30",3,"Invitación directa","PromociónyPrevención",40000000,40000000,"NO","NA","Gerencia de Abastecimiento Estratégico\ncontratacion@positiva.gov.co\nPBX: (1)6502200 Ext: 10819","NO","NO","NO","SI","Pública clasificada","C77912022-Tipo de información Pública clasificada-El contratista, se compromete a la prestación de servicios de promoción y prevención para implementar, mejorar y/o mantener actividades de asesoría técnica del Sistema de Gestión de Seguridad y Salud en Trabajo, con base en los programas de la estrategia Positiva CREA del modelo de gestión Positiva SUMA, Plan Básico (programa de prevención y protección colectiva e individual) y Plan Avanzado (programa gestión para el control de incidentes y accidentes de trabajo) generando impacto en la disminución de la siniestralidad para el acompañamiento de las empresas afiliadas a positiva compañía de seguros en la zona Bogotá; Sucursal Coordinadora Bogotá en la modalidad de atención Planes Gran Empresa. "]
["Promoción y Prevención","Gcia. Administración del Riesgo","NO","C77922022",93141808,"El contratista, se compromete a la prestación de servicios de promoción y prevención para implementar, mejorar y/o mantener actividades de asesoría técnica del sistema de gestión de seguridad y salud en trabajo, con base en los programas de la estrategia POSITIVA CREA del modelo de gestión POSITIVA SUMA, PLAN BÁSICO - Programa de Preparación y atención de emergencias, programa de prevención y protección colectiva e individual, programa de investigación de incidencia y accidentes de trabajo PLAN AVANZADO - programa de gestión para el control de incidentes y accidentes de trabajo, programa de gestión prevención de la enfermedad profesional, generando impacto en la disminución de la siniestralidad para el acompañamiento de las empresas afiliadas a positiva compañía de seguros en la Zona Bogotá; Sucursal Coordinadora Bogotá en la modalidad de atención planes GRAN EMPRESA. ","2022-09-01",9,"2022-11-30",3,"Invitación directa","PromociónyPrevención",200000000,200000000,"NO","NA","Gerencia de Abastecimiento Estratégico\ncontratacion@positiva.gov.co\nPBX: (1)6502200 Ext: 10819","NO","NO","NO","SI","Pública clasificada","C77922022-Tipo de información Pública clasificada-El contratista, se compromete a la prestación de servicios de promoción y prevención para implementar, mejorar y/o mantener actividades de asesoría técnica del sistema de gestión de seguridad y salud en trabajo, con base en los programas de la estrategia POSITIVA CREA del modelo de gestión POSITIVA SUMA, PLAN BÁSICO - Programa de Preparación y atención de emergencias, programa de prevención y protección colectiva e individual, programa de investigación de incidencia y accidentes de trabajo PLAN AVANZADO - programa de gestión para el control de incidentes y accidentes de trabajo, programa de gestión prevención de la enfermedad profesional, generando impacto en la disminución de la siniestralidad para el acompañamiento de las empresas afiliadas a positiva compañía de seguros en la Zona Bogotá; Sucursal Coordinadora Bogotá en la modalidad de atención planes GRAN EMPRESA. "]
["Promoción y Prevención","Gcia. Administración del Riesgo","NO","C77932022",93141808,"Prestación de servicios de Promoción y Prevención para implementar, mejorar y/o mantener actividades de asesoría técnica del Sistema de Gestión de Seguridad y Salud en Trabajo, con base en los Programas de la Estrategia POSITIVA CREA del Modelo de Gestión POSITIVA SUMA en PLAN BASICO - Programa de Prevención y Protección Colectiva e Individual, Promoción y Prevención en Salud y Programa de Investigación de Incidentes y Accidentes de Trabajo PLAN AVANZADO Programa de Gestión para el Control de Incidentes y Accidentes de Trabajo y Programa de Gestión para la Prevención de la Enfermedad Laboral para el acompañamiento de las empresas afiliadas a POSITIVA COMPAÑÍA DE SEGUROS en la Zona Bogotá; Sucursal Coordinadora Bogotá en la modalidad de atención Gran empresa","2022-09-01",9,"2022-11-30",3,"Invitación directa","PromociónyPrevención",70000000,70000000,"NO","NA","Gerencia de Abastecimiento Estratégico\ncontratacion@positiva.gov.co\nPBX: (1)6502200 Ext: 10819","NO","NO","NO","SI","Pública clasificada","C77932022-Tipo de información Pública clasificada-Prestación de servicios de Promoción y Prevención para implementar, mejorar y/o mantener actividades de asesoría técnica del Sistema de Gestión de Seguridad y Salud en Trabajo, con base en los Programas de la Estrategia POSITIVA CREA del Modelo de Gestión POSITIVA SUMA en PLAN BASICO - Programa de Prevención y Protección Colectiva e Individual, Promoción y Prevención en Salud y Programa de Investigación de Incidentes y Accidentes de Trabajo PLAN AVANZADO Programa de Gestión para el Control de Incidentes y Accidentes de Trabajo y Programa de Gestión para la Prevención de la Enfermedad Laboral para el acompañamiento de las empresas afiliadas a POSITIVA COMPAÑÍA DE SEGUROS en la Zona Bogotá; Sucursal Coordinadora Bogotá en la modalidad de atención Gran empresa"]
["Promoción y Prevención","Gcia. Administración del Riesgo","NO","C77942022",93141808,"EL CONTRATISTA se compromete a realizar la prestación de servicios de Promoción y Prevención para implementar, mejorar y/o mantener actividades de asesoría técnica del Sistema de Gestión de Seguridad y Salud en Trabajo, con base en los Programas de la Estrategia POSITIVA CREA del Modelo de Gestión POSITIVA SUMA en PLAN BASICO - Programa de Preparación y Atención de Emergencias, Programa de Prevención y Protección Colectiva e Individual e Investigación de Incidentes y Accidentes PLAN AVANZADO Gestión para el Control de Incidentes y Accidentes de Trabajo PLAN GESTION INTEGRAL – Sistemas Integrados de Gestión para el acompañamiento de las empresas afiliadas a POSITIVA COMPAÑÍA DE SEGUROS en la Zona Bogotá; Sucursal Coordinadora Bogotá, en la modalidad de atención Gran Empresas.","2022-09-01",9,"2022-11-30",3,"Invitación directa","PromociónyPrevención",40000000,40000000,"NO","NA","Gerencia de Abastecimiento Estratégico\ncontratacion@positiva.gov.co\nPBX: (1)6502200 Ext: 10819","NO","NO","NO","SI","Pública clasificada","C77942022-Tipo de información Pública clasificada-EL CONTRATISTA se compromete a realizar la prestación de servicios de Promoción y Prevención para implementar, mejorar y/o mantener actividades de asesoría técnica del Sistema de Gestión de Seguridad y Salud en Trabajo, con base en los Programas de la Estrategia POSITIVA CREA del Modelo de Gestión POSITIVA SUMA en PLAN BASICO - Programa de Preparación y Atención de Emergencias, Programa de Prevención y Protección Colectiva e Individual e Investigación de Incidentes y Accidentes PLAN AVANZADO Gestión para el Control de Incidentes y Accidentes de Trabajo PLAN GESTION INTEGRAL – Sistemas Integrados de Gestión para el acompañamiento de las empresas afiliadas a POSITIVA COMPAÑÍA DE SEGUROS en la Zona Bogotá; Sucursal Coordinadora Bogotá, en la modalidad de atención Gran Empresas."]
["Promoción y Prevención","Gcia. Administración del Riesgo","NO","C77952022",93141808,"EL CONTRATISTA se compromete a realizar la Prestación de servicios de Promoción y Prevención para implementar, mejorar y/o mantener actividades de asesoría técnica del Sistema de Gestión de Seguridad  y Salud en Trabajo, con  base en los Programas de la Estrategia POSITIVA CREA del Modelo de Gestión POSITIVA SUMA en PLAN BASICO - Programa de Prevención y Protección Colectiva e Individual, Programa de Promoción y Prevención en Salud y Programa de Investigación de Incidentes y Accidentes de Trabajo PLAN AVANZADO - Programa Gestión para la Prevención de la Enfermedad Laboral PLAN ESPECIALIZADO - Programas de Vigilancia Epidemiológica para el acompañamiento de las empresas afiliadas a POSITIVA COMPAÑÍA DE SEGUROS en la Zona Bogotá; Sucursal Coordinadora Bogotá, en la modalidad de atención Gran Empresa.","2022-09-01",9,"2022-11-30",3,"Invitación directa","PromociónyPrevención",33000000,33000000,"NO","NA","Gerencia de Abastecimiento Estratégico\ncontratacion@positiva.gov.co\nPBX: (1)6502200 Ext: 10819","NO","NO","NO","SI","Pública clasificada","C77952022-Tipo de información Pública clasificada-EL CONTRATISTA se compromete a realizar la Prestación de servicios de Promoción y Prevención para implementar, mejorar y/o mantener actividades de asesoría técnica del Sistema de Gestión de Seguridad  y Salud en Trabajo, con  base en los Programas de la Estrategia POSITIVA CREA del Modelo de Gestión POSITIVA SUMA en PLAN BASICO - Programa de Prevención y Protección Colectiva e Individual, Programa de Promoción y Prevención en Salud y Programa de Investigación de Incidentes y Accidentes de Trabajo PLAN AVANZADO - Programa Gestión para la Prevención de la Enfermedad Laboral PLAN ESPECIALIZADO - Programas de Vigilancia Epidemiológica para el acompañamiento de las empresas afiliadas a POSITIVA COMPAÑÍA DE SEGUROS en la Zona Bogotá; Sucursal Coordinadora Bogotá, en la modalidad de atención Gran Empresa."]
["Promoción y Prevención","Gcia. Administración del Riesgo","NO","C77962022",93141808,"El contratista, se compromete a la prestación de servicios de promoción y prevención para implementar, mejorar y/o mantener actividades de asesoría técnica del sistema de gestión de seguridad y salud en trabajo, con base en los programas de la estrategia Positiva CREA del modelo de gestión Positiva SUMA, PLAN BASICO - programa de preparación y atención de emergencias, programa de prevención y protección colectiva e individual, PLAN AVANZADO - programa de gestión prevención de la enfermedad profesional, PLAN ESPECIALIZADO- programas de vigilancia epidemiológico, PLAN GESTION INTEGRAL - sistemas de gestión integral generando impacto en la disminución de la siniestralidad para el acompañamiento de las empresas afiliadas a positiva compañía de seguros en la zona Bogotá; sucursal coordinadora Bogotá en la modalidad de atención planes Gran Empresa.","2022-09-01",9,"2022-11-30",3,"Invitación directa","PromociónyPrevención",33000000,33000000,"NO","NA","Gerencia de Abastecimiento Estratégico\ncontratacion@positiva.gov.co\nPBX: (1)6502200 Ext: 10819","NO","NO","NO","SI","Pública clasificada","C77962022-Tipo de información Pública clasificada-El contratista, se compromete a la prestación de servicios de promoción y prevención para implementar, mejorar y/o mantener actividades de asesoría técnica del sistema de gestión de seguridad y salud en trabajo, con base en los programas de la estrategia Positiva CREA del modelo de gestión Positiva SUMA, PLAN BASICO - programa de preparación y atención de emergencias, programa de prevención y protección colectiva e individual, PLAN AVANZADO - programa de gestión prevención de la enfermedad profesional, PLAN ESPECIALIZADO- programas de vigilancia epidemiológico, PLAN GESTION INTEGRAL - sistemas de gestión integral generando impacto en la disminución de la siniestralidad para el acompañamiento de las empresas afiliadas a positiva compañía de seguros en la zona Bogotá; sucursal coordinadora Bogotá en la modalidad de atención planes Gran Empresa."]
["Promoción y Prevención","Gcia. Administración del Riesgo","NO","C75452022",93141808,"EL CONTRATISTA se compromete a realizar la Prestación de servicios de Promoción y Prevención para implementar, mejorar y/o mantener actividades de asesoría técnica del Sistema de Gestión de Seguridad y Salud en Trabajo, con base en los Programas de la Estrategia POSITIVA CREA del Modelo de Gestión POSITIVA SUMA en PLAN AVANZADO - Programa Gestión para la Prevención de la Enfermedad Laboral PLAN ESPECIALIZADO - Programas de Vigilancia Epidemiológica para el acompañamiento de las empresas afiliadas a POSITIVA COMPAÑÍA DE SEGUROS en la Zona Antioquia; Gerencia Sucursal Antioquia Coordinadora en la modalidad de atención Planes Gran Empresa. ","2022-09-01",9,"2022-12-31",4.0333333333333332,"Invitación directa","PromociónyPrevención",427500000,427500000,"NO","NA","Gerencia de Abastecimiento Estratégico\ncontratacion@positiva.gov.co\nPBX: (1)6502200 Ext: 10819","NO","NO","NO","SI","Pública clasificada","C75452022-Tipo de información Pública clasificada-EL CONTRATISTA se compromete a realizar la Prestación de servicios de Promoción y Prevención para implementar, mejorar y/o mantener actividades de asesoría técnica del Sistema de Gestión de Seguridad y Salud en Trabajo, con base en los Programas de la Estrategia POSITIVA CREA del Modelo de Gestión POSITIVA SUMA en PLAN AVANZADO - Programa Gestión para la Prevención de la Enfermedad Laboral PLAN ESPECIALIZADO - Programas de Vigilancia Epidemiológica para el acompañamiento de las empresas afiliadas a POSITIVA COMPAÑÍA DE SEGUROS en la Zona Antioquia; Gerencia Sucursal Antioquia Coordinadora en la modalidad de atención Planes Gran Empresa. "]
["Promoción y Prevención","Gcia. Administración del Riesgo","NO","C79562022 ",93141808,"EL CONTRATISTA se compromete a realizar la prestación de servicios de Promoción y Prevención para implementar, mejorar y/o mantener actividades de asesoría, asistencia técnica y de formación en Seguridad y Salud en el Trabajo, según los programas de los Planes de la Estrategia CREA del Modelo de Gestión Positiva SUMA  de PLAN BASICO - Programa de Prevención y Protección Colectiva e Individual, Programa de Promoción y Prevención en Salud y Programa de Investigación de Incidentes y Accidentes de Trabajo PLAN AVANZADO - Programa Gestión para el control de Incidentes y Accidentes de Trabajo y Programa Gestión para la Prevención de la Enfermedad Laboral PLAN ESPECIALIZADO - Programas de Vigilancia Epidemiológica para el acompañamiento de las empresas afiliadas a POSITIVA COMPAÑÍA DE SEGUROS para empresas en la Sucursal Norte de Santander de la Zona Santander.","2022-09-01",9,"2022-12-31",4.0333333333333332,"Invitación directa","PromociónyPrevención",36000000,36000000,"NO","NA","Gerencia de Abastecimiento Estratégico\ncontratacion@positiva.gov.co\nPBX: (1)6502200 Ext: 10819","NO","NO","NO","SI","Pública clasificada","C79562022 -Tipo de información Pública clasificada-EL CONTRATISTA se compromete a realizar la prestación de servicios de Promoción y Prevención para implementar, mejorar y/o mantener actividades de asesoría, asistencia técnica y de formación en Seguridad y Salud en el Trabajo, según los programas de los Planes de la Estrategia CREA del Modelo de Gestión Positiva SUMA  de PLAN BASICO - Programa de Prevención y Protección Colectiva e Individual, Programa de Promoción y Prevención en Salud y Programa de Investigación de Incidentes y Accidentes de Trabajo PLAN AVANZADO - Programa Gestión para el control de Incidentes y Accidentes de Trabajo y Programa Gestión para la Prevención de la Enfermedad Laboral PLAN ESPECIALIZADO - Programas de Vigilancia Epidemiológica para el acompañamiento de las empresas afiliadas a POSITIVA COMPAÑÍA DE SEGUROS para empresas en la Sucursal Norte de Santander de la Zona Santander."]
["Promoción y Prevención","Vicepresidencia de Promoción y Prevención","NO","C86072022",93141808,"Prestación de servicios de asesoría y acciones de educación en seguridad, salud en el trabajo, promoción de la salud y prevención de riesgos laborales, en modalidad: presencial, multimodal y virtual, acordes con el modelo y las políticas de gestión de promoción y prevención POSITIVA SUMA y la línea de acción POSITIVA EDUCA , con el fin de garantizar la atención de empresas afiliadas a POSITIVA Compañía de Seguros S.A. en el territorio nacional, asegurando el cumplimiento por parte de la compañía de las obligaciones comprendidas en el ordenamiento legal – Decreto Único Reglamentario del Sector Trabajo 1072 de 2015 y los Estándares Mínimos en Sistemas de Gestión de Seguridad y Salud en el Trabajo","2022-09-01",9,"2022-12-31",4.0333333333333332,"Invitación directa","PromociónyPrevención",130000000,130000000,"NO","NA","Gerencia de Abastecimiento Estratégico\ncontratacion@positiva.gov.co\nPBX: (1)6502200 Ext: 10819","NO","NO","NO","SI","Pública clasificada","C86072022-Tipo de información Pública clasificada-Prestación de servicios de asesoría y acciones de educación en seguridad, salud en el trabajo, promoción de la salud y prevención de riesgos laborales, en modalidad: presencial, multimodal y virtual, acordes con el modelo y las políticas de gestión de promoción y prevención POSITIVA SUMA y la línea de acción POSITIVA EDUCA , con el fin de garantizar la atención de empresas afiliadas a POSITIVA Compañía de Seguros S.A. en el territorio nacional, asegurando el cumplimiento por parte de la compañía de las obligaciones comprendidas en el ordenamiento legal – Decreto Único Reglamentario del Sector Trabajo 1072 de 2015 y los Estándares Mínimos en Sistemas de Gestión de Seguridad y Salud en el Trabajo"]
["Promoción y Prevención","Vicepresidencia de Promoción y Prevención","NO","C86082022",93141808,"EL CONTRATISTA, se compromete para con POSITIVA COMPAÑÍA DE SEGUROS S.A., Prestación de servicios de asistencia técnica para desarrollar una estrategia en el manejo de la gestión del peligro y el control de los riesgos laborales, promoviendo la disminución en los accidentes de trabajo en el sector de la minería. Lo anterior en el marco del convenio interadministrativo entre el Ministerio del Trabajo y POSITIVA número 616 de 2021.","2022-09-01",9,"2022-12-31",4.0333333333333332,"Invitación directa","PromociónyPrevención",80000000,80000000,"NO","NA","Gerencia de Abastecimiento Estratégico\ncontratacion@positiva.gov.co\nPBX: (1)6502200 Ext: 10819","NO","NO","NO","SI","Pública clasificada","C86082022-Tipo de información Pública clasificada-EL CONTRATISTA, se compromete para con POSITIVA COMPAÑÍA DE SEGUROS S.A., Prestación de servicios de asistencia técnica para desarrollar una estrategia en el manejo de la gestión del peligro y el control de los riesgos laborales, promoviendo la disminución en los accidentes de trabajo en el sector de la minería. Lo anterior en el marco del convenio interadministrativo entre el Ministerio del Trabajo y POSITIVA número 616 de 2021."]
["Promoción y Prevención","Gcia. Administración del Riesgo","NO","C81442022",93141808,"EL CONTRATIST se  compromete  a realizarlaPrestación  de  servicios  de  Promoción  y Prevención  para  implementar,  mejorar  y/o  mantener  actividades  de  asesoría  técnica  del Sistema  de  Gestión  de  Seguridad  y  Salud  en  Trabajo,  con  base  en  los  Programas  de  la Estrategia  POSITIVA  CREA  del  Modelo  de  Gestión  POSITIVA  SUMA,  en  PLAN  BASICO Promoción  y  Prevención  en  Salud,  PLAN  AVANZADO -Programa Gestión  en  la  Prevención de   Enfermedades   Profesionales   y   PLAN   ESPECIALIZADO   Programas   de   Vigilancia Epidemiológica,  para  los  servidores  de  la  Fiscalía  General  de  la  Nación  en  la  Regional Noroccidental.","2022-09-01",9,"2022-11-30",3,"Invitación directa","PromociónyPrevención",84707761,84707761,"NO","NA","Gerencia de Abastecimiento Estratégico\ncontratacion@positiva.gov.co\nPBX: (1)6502200 Ext: 10819","NO","NO","NO","SI","Pública clasificada","C81442022-Tipo de información Pública clasificada-EL CONTRATIST se  compromete  a realizarlaPrestación  de  servicios  de  Promoción  y Prevención  para  implementar,  mejorar  y/o  mantener  actividades  de  asesoría  técnica  del Sistema  de  Gestión  de  Seguridad  y  Salud  en  Trabajo,  con  base  en  los  Programas  de  la Estrategia  POSITIVA  CREA  del  Modelo  de  Gestión  POSITIVA  SUMA,  en  PLAN  BASICO Promoción  y  Prevención  en  Salud,  PLAN  AVANZADO -Programa Gestión  en  la  Prevención de   Enfermedades   Profesionales   y   PLAN   ESPECIALIZADO   Programas   de   Vigilancia Epidemiológica,  para  los  servidores  de  la  Fiscalía  General  de  la  Nación  en  la  Regional Noroccidental."]
["Promoción y Prevención","Gcia. Administración del Riesgo","NO"," C81452022",93141808,"EL  CONTRATISTA se  compromete  a realizarlaprestación  de  servicios  de Promoción  y Prevención  para  implementar,  mejorar  y/o  mantener  actividades  de  asesoría  técnica  del Sistema  de  Gestión  de  Seguridad    y  Salud  en  Trabajo,  con    base  en  los  Programas  de  la Estrategia  POSITIVA  CREA  del  Modelo  de  Gestión  POSITIVA  SUMA,  en  PLAN  BASICO Promoción y Prevención en Salud, PLAN AVANZADO -Programa Gestión en la Prevención de  Enfermedades  Profesionales,  para  la  identificación  e  intervención  de  factores  de  riesgo psicosocial para los servidores de la Fiscalía General de la Nación a nivel nacional","2022-09-01",9,"2022-11-30",3,"Invitación directa","PromociónyPrevención",103480980,103480980,"NO","NA","Gerencia de Abastecimiento Estratégico\ncontratacion@positiva.gov.co\nPBX: (1)6502200 Ext: 10819","NO","NO","NO","SI","Pública clasificada"," C81452022-Tipo de información Pública clasificada-EL  CONTRATISTA se  compromete  a realizarlaprestación  de  servicios  de Promoción  y Prevención  para  implementar,  mejorar  y/o  mantener  actividades  de  asesoría  técnica  del Sistema  de  Gestión  de  Seguridad    y  Salud  en  Trabajo,  con    base  en  los  Programas  de  la Estrategia  POSITIVA  CREA  del  Modelo  de  Gestión  POSITIVA  SUMA,  en  PLAN  BASICO Promoción y Prevención en Salud, PLAN AVANZADO -Programa Gestión en la Prevención de  Enfermedades  Profesionales,  para  la  identificación  e  intervención  de  factores  de  riesgo psicosocial para los servidores de la Fiscalía General de la Nación a nivel nacional"]
["Promoción y Prevención","Gcia. Administración del Riesgo","NO"," C81462022",93141808,"EL  CONTRATISTA se compromete  a realizar la Prestación  de  servicios  de  Promoción  y Prevención  para  implementar,  mejorar  y/o  mantener  actividades  de  asesoría  técnica  del Sistema  de  Gestión  de  Seguridad    y  Salud  en  Trabajo,  con    base  en  los  Programas  de  la Estrategia  POSITIVA  CREA  del  Modelo  de  Gestión  POSITIVA  SUMA,  en  PLAN  BASICO Promoción  y  Prevención  en  Salud,  PLAN  AVANZADO -Programa Gestión  en  la  Prevención de  Enfermedades  Profesionales,  para  la  prevención  e  intervención  de  factores  de  riesgo psicosocial,  especialmente  en  la  identificación,  prevención  e  intervención  de  consumo  de sustancias psicoactivas y prevención de suicidio para los servidores de la Fiscalía General a nivel nacional.","2022-09-01",9,"2022-11-30",3,"Invitación directa","PromociónyPrevención",70000000,70000000,"NO","NA","Gerencia de Abastecimiento Estratégico\ncontratacion@positiva.gov.co\nPBX: (1)6502200 Ext: 10819","NO","NO","NO","SI","Pública clasificada"," C81462022-Tipo de información Pública clasificada-EL  CONTRATISTA se compromete  a realizar la Prestación  de  servicios  de  Promoción  y Prevención  para  implementar,  mejorar  y/o  mantener  actividades  de  asesoría  técnica  del Sistema  de  Gestión  de  Seguridad    y  Salud  en  Trabajo,  con    base  en  los  Programas  de  la Estrategia  POSITIVA  CREA  del  Modelo  de  Gestión  POSITIVA  SUMA,  en  PLAN  BASICO Promoción  y  Prevención  en  Salud,  PLAN  AVANZADO -Programa Gestión  en  la  Prevención de  Enfermedades  Profesionales,  para  la  prevención  e  intervención  de  factores  de  riesgo psicosocial,  especialmente  en  la  identificación,  prevención  e  intervención  de  consumo  de sustancias psicoactivas y prevención de suicidio para los servidores de la Fiscalía General a nivel nacional."]
["Promoción y Prevención","Gcia. Administración del Riesgo","NO"," C81472022",93141808,"EL  CONTRATISTA, se  compromete  a la Prestación  de  servicios  de  apoyo  logístico,  que permitan garantizar la adecuada ejecución de las actividades del Plan de Trabajo pactado con  Fiscalía  General  de  la  Nación  y  Rama  Judicial;  como  soporte  para  la  organización  y ejecución  de eventos,  programas  y  actividades  de  Seguridad  y  Salud  en  el  trabajo. Adicionalmente, se requiere contar con el desarrollo de campañas ATL, BTL, servicios de planeación  estratégica,  creativa  y  divulgación  para  el  apoyo  de  la  gestión  en  SST  de  las empresas afiliadas, enmarcado en nuestras líneas de acción estratégica Positiva Comunica y Positiva Educa a Nivel Nacional.","2022-09-01",9,"2022-12-31",4.0333333333333332,"Invitación directa","PromociónyPrevención",3200000000,3200000000,"NO","NA","Gerencia de Abastecimiento Estratégico\ncontratacion@positiva.gov.co\nPBX: (1)6502200 Ext: 10819","NO","NO","NO","SI","Pública clasificada"," C81472022-Tipo de información Pública clasificada-EL  CONTRATISTA, se  compromete  a la Prestación  de  servicios  de  apoyo  logístico,  que permitan garantizar la adecuada ejecución de las actividades del Plan de Trabajo pactado con  Fiscalía  General  de  la  Nación  y  Rama  Judicial;  como  soporte  para  la  organización  y ejecución  de eventos,  programas  y  actividades  de  Seguridad  y  Salud  en  el  trabajo. Adicionalmente, se requiere contar con el desarrollo de campañas ATL, BTL, servicios de planeación  estratégica,  creativa  y  divulgación  para  el  apoyo  de  la  gestión  en  SST  de  las empresas afiliadas, enmarcado en nuestras líneas de acción estratégica Positiva Comunica y Positiva Educa a Nivel Nacional."]
["Promoción y Prevención","Gcia. Administración del Riesgo","NO"," C81482022",93141808,"EL  CONTRATISTA se  compromete  a realizarlaPrestación  de  servicios  de  Promoción  y Prevención  para  implementar,  mejorar  y/o  mantener  actividades  de  asesoría  técnica  del Sistema  de  Gestión  de  Seguridad    y  Salud  en  Trabajo,  con    base  en  los  Programas  de  la Estrategia  POSITIVA  CREA  del  Modelo  de  Gestión  POSITIVA  SUMA,  en  PLAN  BASICO Promoción y Prevención en Salud, PLAN AVANZADO -Programa Gestión en la Prevención de   Enfermedades   Profesionales   y   PLAN   ESPECIALIZADO   Programas   de   Vigilancia Epidemiológica,  para  los  servidores  de  la  Fiscalía  General  de  la  Nación  en  las  Regionales Centro, Centro Sur y Pacifico","2022-09-01",9,"2022-11-30",3,"Invitación directa","PromociónyPrevención",350902686,350902686,"NO","NA","Gerencia de Abastecimiento Estratégico\ncontratacion@positiva.gov.co\nPBX: (1)6502200 Ext: 10819","NO","NO","NO","SI","Pública clasificada"," C81482022-Tipo de información Pública clasificada-EL  CONTRATISTA se  compromete  a realizarlaPrestación  de  servicios  de  Promoción  y Prevención  para  implementar,  mejorar  y/o  mantener  actividades  de  asesoría  técnica  del Sistema  de  Gestión  de  Seguridad    y  Salud  en  Trabajo,  con    base  en  los  Programas  de  la Estrategia  POSITIVA  CREA  del  Modelo  de  Gestión  POSITIVA  SUMA,  en  PLAN  BASICO Promoción y Prevención en Salud, PLAN AVANZADO -Programa Gestión en la Prevención de   Enfermedades   Profesionales   y   PLAN   ESPECIALIZADO   Programas   de   Vigilancia Epidemiológica,  para  los  servidores  de  la  Fiscalía  General  de  la  Nación  en  las  Regionales Centro, Centro Sur y Pacifico"]
["Promoción y Prevención","Gcia. Administración del Riesgo","NO"," C81492022",93141808,"EL  CONTRATISTA se  compromete  a realizarlaprestación  de  servicios  de Promoción  y Prevención  para  implementar,  mejorar  y/o  mantener  actividades  de  asesoría  técnica  del Sistema  de  Gestión  de  Seguridad    y  Salud  en  Trabajo,  con    base  en  los  Programas  de  la Estrategia  POSITIVA  CREA  del  Modelo  de  Gestión  POSITIVA  SUMA,  en  PLAN  BASICO Promoción y Prevención en Salud, PLAN AVANZADO -Programa Gestión en la Prevención de   Enfermedades   Profesionales  y   PLAN      ESPECIALIZADO   Programas  de   Vigilancia Epidemiológica,  para  los  servidores  de  la  Fiscalía  General  de  la  Nación  en  la  Regional  Noroccidente y Caribe","2022-09-01",9,"2022-11-30",3,"Invitación directa","PromociónyPrevención",17689049,17689049,"NO","NA","Gerencia de Abastecimiento Estratégico\ncontratacion@positiva.gov.co\nPBX: (1)6502200 Ext: 10819","NO","NO","NO","SI","Pública clasificada"," C81492022-Tipo de información Pública clasificada-EL  CONTRATISTA se  compromete  a realizarlaprestación  de  servicios  de Promoción  y Prevención  para  implementar,  mejorar  y/o  mantener  actividades  de  asesoría  técnica  del Sistema  de  Gestión  de  Seguridad    y  Salud  en  Trabajo,  con    base  en  los  Programas  de  la Estrategia  POSITIVA  CREA  del  Modelo  de  Gestión  POSITIVA  SUMA,  en  PLAN  BASICO Promoción y Prevención en Salud, PLAN AVANZADO -Programa Gestión en la Prevención de   Enfermedades   Profesionales  y   PLAN      ESPECIALIZADO   Programas  de   Vigilancia Epidemiológica,  para  los  servidores  de  la  Fiscalía  General  de  la  Nación  en  la  Regional  Noroccidente y Caribe"]
["Promoción y Prevención","Gcia. Administración del Riesgo","NO","C77972022",93141808,"EL  CONTRATISTA se  compromete  a realizarlaprestación  de  servicios  de  Promoción  y Prevención  para  implementar,  mejorar  y/o  mantener  actividades  de  asesoría  técnica  del Sistema  de  Gestión  de  Seguridad  y  Salud  en  Trabajo,  con  base  en  los  Programas  de  la Estrategia POSITIVA  CREAdel  Modelo  de  Gestión POSITIVA  SUMAenPLAN  BASICO-Programa  de  Prevención  y  Protección  Colectiva  e  Individual,  Programa  de  Promoción  y Prevención  en  Salud  y  Programa  de  Investigación  de  Incidentes  y  Accidentes  de  Trabajo PLAN AVANZADO -Programa Gestión para el control de Incidentes y Accidentes de Trabajo y Programa Gestión para la Prevención de la Enfermedad Laboral PLAN ESPECIALIZADO-Programas de Vigilancia Epidemiológica y PLAN GESTION INTEGRAL –Sistemas Integrados de Gestión para el acompañamiento de las empresas afiliadas a POSITIVA COMPAÑÍA DE SEGUROS en  la  Zona Bogotá;  Sucursal  coordinadora  Bogotá y la zona Santander sucursal Boyacá en  la  modalidad  de  atención Planes GRAN EMPRESA","2022-09-15",9,"2022-11-30",2.5333333333333332,"Invitación directa","PromociónyPrevención",50000000,{"$f":"+M760","v":50000000},"NO","NA","Gerencia de Abastecimiento Estratégico\ncontratacion@positiva.gov.co\nPBX: (1)6502200 Ext: 10819","NO","NO","NO","SI",{"$f":"IF(U760=\"SI\",\"Pública clasificada\",\"Pública\")","v":"Pública clasificada"},{"$f":"CONCATENATE(D760,\"-\",\"Tipo de información\",\" \",V760,\"-\",F760)","v":"C77972022-Tipo de información Pública clasificada-EL  CONTRATISTA se  compromete  a realizarlaprestación  de  servicios  de  Promoción  y Prevención  para  implementar,  mejorar  y/o  mantener  actividades  de  asesoría  técnica  del Sistema  de  Gestión  de  Seguridad  y  Salud  en  Trabajo,  con  base  en  los  Programas  de  la Estrategia POSITIVA  CREAdel  Modelo  de  Gestión POSITIVA  SUMAenPLAN  BASICO-Programa  de  Prevención  y  Protección  Colectiva  e  Individual,  Programa  de  Promoción  y Prevención  en  Salud  y  Programa  de  Investigación  de  Incidentes  y  Accidentes  de  Trabajo PLAN AVANZADO -Programa Gestión para el control de Incidentes y Accidentes de Trabajo y Programa Gestión para la Prevención de la Enfermedad Laboral PLAN ESPECIALIZADO-Programas de Vigilancia Epidemiológica y PLAN GESTION INTEGRAL –Sistemas Integrados de Gestión para el acompañamiento de las empresas afiliadas a POSITIVA COMPAÑÍA DE SEGUROS en  la  Zona Bogotá;  Sucursal  coordinadora  Bogotá y la zona Santander sucursal Boyacá en  la  modalidad  de  atención Planes GRAN EMPRESA"}]
["Promoción y Prevención","Gcia. Administración del Riesgo","NO","C79572022",93141808,"EL  CONTRATISTA se  compromete  a realizarlaprestación  de  servicios  de  Promoción  y Prevención  para  implementar,  mejorar  y/o  mantener  actividades  de  asesoría  técnica  del Sistema  de  Gestión  de  Seguridad  y  Salud  en  Trabajo,  con  base  en  los  Programas  de  la Estrategia POSITIVA  CREAdel  Modelo  de  Gestión POSITIVA  SUMAenPLAN  BASICO-Programa  de  Prevención  y  Protección  Colectiva  e  Individual,  Programa  de  Promoción  y Prevención  en  Salud  y  Programa  de  Investigación  de  Incidentes  y  Accidentes  de  Trabajo PLAN AVANZADO -Programa Gestión para el control de Incidentes y Accidentes de Trabajo y Programa Gestión para la Prevención de la Enfermedad Laboral PLAN ESPECIALIZADO-Programas de Vigilancia Epidemiológica y PLAN GESTION INTEGRAL –Sistemas Integrados de Gestión para el acompañamiento de las empresas afiliadas a POSITIVA COMPAÑÍA DE SEGUROS en  la  Zona Bogotá;  Sucursal  coordinadora  Bogotá y la zona Santander sucursal Boyacá en  la  modalidad  de  atención Planes GRAN EMPRESA","2022-09-15",9,"2022-11-30",2.5333333333333332,"Invitación directa","PromociónyPrevención",20000000,20000000,"NO","NA","Gerencia de Abastecimiento Estratégico\ncontratacion@positiva.gov.co\nPBX: (1)6502200 Ext: 10819","NO","NO","NO","SI","Pública clasificada","C79572022-Tipo de información Pública clasificada-EL  CONTRATISTA se  compromete  a realizarlaprestación  de  servicios  de  Promoción  y Prevención  para  implementar,  mejorar  y/o  mantener  actividades  de  asesoría  técnica  del Sistema  de  Gestión  de  Seguridad  y  Salud  en  Trabajo,  con  base  en  los  Programas  de  la Estrategia POSITIVA  CREAdel  Modelo  de  Gestión POSITIVA  SUMAenPLAN  BASICO-Programa  de  Prevención  y  Protección  Colectiva  e  Individual,  Programa  de  Promoción  y Prevención  en  Salud  y  Programa  de  Investigación  de  Incidentes  y  Accidentes  de  Trabajo PLAN AVANZADO -Programa Gestión para el control de Incidentes y Accidentes de Trabajo y Programa Gestión para la Prevención de la Enfermedad Laboral PLAN ESPECIALIZADO-Programas de Vigilancia Epidemiológica y PLAN GESTION INTEGRAL –Sistemas Integrados de Gestión para el acompañamiento de las empresas afiliadas a POSITIVA COMPAÑÍA DE SEGUROS en  la  Zona Bogotá;  Sucursal  coordinadora  Bogotá y la zona Santander sucursal Boyacá en  la  modalidad  de  atención Planes GRAN EMPRESA"]
["Promoción y Prevención","Gcia. Administración del Riesgo","NO","C79622022",93141808,"Prestación de servicios de Promoción y Prevención para implementar, mejorar y/o mantener actividades de asesoría, asistencia técnica y de formación en Seguridad y Salud en el Trabajo con base en los programas de la estrategia POSITIVA CREA del Modelo de Gestión POSITIVA SUMA de PLAN BASICO en los programas de Prevención y Protección Colectiva e Individual, PLAN AVANZADO en los programas de Gestión para el Control de Incidentes y Accidentes de Trabajo y Gestión para la Prevención de la Enfermedad Laboral de acuerdo a los Planes de Trabajo pactados con la empresas y cargados en el aplicativo GESTPOS, para empresas afiliadas a POSITIVA COMPAÑÍA DE SEGUROS en la modalidad de atención de GRAN EMPRESA de la Sucursal Tipo C - Arauca de la Sucursal Coordinadora Santander.","2022-09-15",9,"2022-12-31",3.5666666666666669,"Invitación directa","PromociónyPrevención",40000000,40000000,"NO","NA","Gerencia de Abastecimiento Estratégico\ncontratacion@positiva.gov.co\nPBX: (1)6502200 Ext: 10819","NO","NO","NO","SI",{"$f":"IF(U762=\"SI\",\"Pública clasificada\",\"Pública\")","v":"Pública clasificada"},{"$f":"CONCATENATE(D762,\"-\",\"Tipo de información\",\" \",V762,\"-\",F762)","v":"C79622022-Tipo de información Pública clasificada-Prestación de servicios de Promoción y Prevención para implementar, mejorar y/o mantener actividades de asesoría, asistencia técnica y de formación en Seguridad y Salud en el Trabajo con base en los programas de la estrategia POSITIVA CREA del Modelo de Gestión POSITIVA SUMA de PLAN BASICO en los programas de Prevención y Protección Colectiva e Individual, PLAN AVANZADO en los programas de Gestión para el Control de Incidentes y Accidentes de Trabajo y Gestión para la Prevención de la Enfermedad Laboral de acuerdo a los Planes de Trabajo pactados con la empresas y cargados en el aplicativo GESTPOS, para empresas afiliadas a POSITIVA COMPAÑÍA DE SEGUROS en la modalidad de atención de GRAN EMPRESA de la Sucursal Tipo C - Arauca de la Sucursal Coordinadora Santander."}]
["Promoción y Prevención","Gcia. Administración del Riesgo","NO","C80512022",93141808,"Prestación de servicios de Promoción y Prevención para implementar, mejorar y/o mantener las actividades de asesoría, asistencia técnica y de formación en Seguridad y Salud en el Trabajo, bajo el lineamiento de los programas de la Estrategia CREA del Modelo de Gestión Positiva SUMA, en PLAN BASICO: Programa Estructura Empresarial, Preparación y atención de emergencias, Programa Protección Colectiva e Individual, Programa Promoción y prevención en Salud, Programa de Investigación de incidentes y accidentes de trabajo; PLAN AVANZADO: Programa Gestión para el Control de incidentes y accidentes de trabajo, programa de Gestión en la Prevención de la Enfermedad Laboral; PLAN ESPECIALIZADO: Programas de Vigilancia Epidemiológica; PLAN GESTION INTEGRAL: Programa Sistema de Gestión, para la atención de las empresas de Planes Gran Empresa, afiliadas a POSITIVA COMPAÑÍA DE SEGUROS Sucursal Cauca Zona Valle.","2022-09-15",9,"2022-11-30",2.5333333333333332,"Invitación directa","PromociónyPrevención",79693628,79693628,"NO","NA","Gerencia de Abastecimiento Estratégico\ncontratacion@positiva.gov.co\nPBX: (1)6502200 Ext: 10819","NO","NO","NO","SI",{"$f":"IF(U763=\"SI\",\"Pública clasificada\",\"Pública\")","v":"Pública clasificada"},{"$f":"CONCATENATE(D763,\"-\",\"Tipo de información\",\" \",V763,\"-\",F763)","v":"C80512022-Tipo de información Pública clasificada-Prestación de servicios de Promoción y Prevención para implementar, mejorar y/o mantener las actividades de asesoría, asistencia técnica y de formación en Seguridad y Salud en el Trabajo, bajo el lineamiento de los programas de la Estrategia CREA del Modelo de Gestión Positiva SUMA, en PLAN BASICO: Programa Estructura Empresarial, Preparación y atención de emergencias, Programa Protección Colectiva e Individual, Programa Promoción y prevención en Salud, Programa de Investigación de incidentes y accidentes de trabajo; PLAN AVANZADO: Programa Gestión para el Control de incidentes y accidentes de trabajo, programa de Gestión en la Prevención de la Enfermedad Laboral; PLAN ESPECIALIZADO: Programas de Vigilancia Epidemiológica; PLAN GESTION INTEGRAL: Programa Sistema de Gestión, para la atención de las empresas de Planes Gran Empresa, afiliadas a POSITIVA COMPAÑÍA DE SEGUROS Sucursal Cauca Zona Valle."}]
["Promoción y Prevención","Gcia. Administración del Riesgo","NO","C84172022",93141808,"EL CONTRATISTA,se compromete a la Prestación de servicios de Promoción y Prevención para  implementar,  mejorar  y/o  mantener  actividades  de  asesoría,  asistencia  técnica  del Sistema de Gestión de la Seguridad y Salud en el Trabajo con base en los programas del PLAN BÁSICO, PLAN AVANZADO, PLANESPECIALIZADO y PLAN GESTIÓN INTEGRAL, de  la  estrategia  CREA  del  Modelo  de  Gestión  POSITIVA  SUMA,  al  igual  que  el acompañamiento para la investigación de presuntos accidentes de trabajo graves, mortales o leves (que por concepto técnico lo ameriten), con la implementación de estrategias para la  prevención  de  accidentes  laborales  buscando  el  impacto  de  la  siniestralidad,  asesoría técnica especializada para cubrir la demanda de solicitudes de reclasificación de empresas por requerimientos internos de la compañía y por entes de control y vigilancia, para fortalecer la intervención en las empresas Pymes afiliadas a POSITIVA COMPAÑÍA DE SEGUROS S.A.,  bajo  el  lineamiento  de  intervención  del  prototipo  técnico,  con  un  grupo  de  personal interdisciplinario  para  ser  desarrolladas  en  las  sucursales  de  las  zonas  de  Atlántico, Antioquia, Valle, Santander, Bogotá y Cundinamarca, en la modalidad de atención GRAN MI PYME","2022-09-15",9,"2022-11-30",2.5333333333333332,"Invitación directa","PromociónyPrevención",487800000,{"$f":"+M764","v":487800000},"NO","NA","Gerencia de Abastecimiento Estratégico\ncontratacion@positiva.gov.co\nPBX: (1)6502200 Ext: 10819","NO","NO","NO","SI",{"$f":"IF(U764=\"SI\",\"Pública clasificada\",\"Pública\")","v":"Pública clasificada"},{"$f":"CONCATENATE(D764,\"-\",\"Tipo de información\",\" \",V764,\"-\",F764)","v":"C84172022-Tipo de información Pública clasificada-EL CONTRATISTA,se compromete a la Prestación de servicios de Promoción y Prevención para  implementar,  mejorar  y/o  mantener  actividades  de  asesoría,  asistencia  técnica  del Sistema de Gestión de la Seguridad y Salud en el Trabajo con base en los programas del PLAN BÁSICO, PLAN AVANZADO, PLANESPECIALIZADO y PLAN GESTIÓN INTEGRAL, de  la  estrategia  CREA  del  Modelo  de  Gestión  POSITIVA  SUMA,  al  igual  que  el acompañamiento para la investigación de presuntos accidentes de trabajo graves, mortales o leves (que por concepto técnico lo ameriten), con la implementación de estrategias para la  prevención  de  accidentes  laborales  buscando  el  impacto  de  la  siniestralidad,  asesoría técnica especializada para cubrir la demanda de solicitudes de reclasificación de empresas por requerimientos internos de la compañía y por entes de control y vigilancia, para fortalecer la intervención en las empresas Pymes afiliadas a POSITIVA COMPAÑÍA DE SEGUROS S.A.,  bajo  el  lineamiento  de  intervención  del  prototipo  técnico,  con  un  grupo  de  personal interdisciplinario  para  ser  desarrolladas  en  las  sucursales  de  las  zonas  de  Atlántico, Antioquia, Valle, Santander, Bogotá y Cundinamarca, en la modalidad de atención GRAN MI PYME"}]
["Promoción y Prevención","Gcia. Administración del Riesgo","NO","C80522022",93141808,"Prestación de servicios de Promoción y Prevención para implementar, mejorar y/o mantener las actividades de asesoría, asistencia técnica y de formación en Seguridad y Salud en el Trabajo, bajo el lineamiento de los programas de la Estrategia CREA del Modelo de Gestión Positiva SUMA, en PLAN BASICO: Preparación y atención de emergencias, Programa Protección Colectiva e Individual; PLAN AVANZADO: Programa Gestión para el Control de incidentes y accidentes de trabajo, programa de Gestión en la Prevención de la Enfermedad Laboral; para la atención de las empresas de Planes Gran Empresa, afiliadas a POSITIVA COMPAÑÍA DE SEGUROS Sucursal Cauca Zona Valle.","2022-09-15",9,"2022-11-30",2.5333333333333332,"Invitación directa","PromociónyPrevención",79693628,79693628,"NO","NA","Gerencia de Abastecimiento Estratégico\ncontratacion@positiva.gov.co\nPBX: (1)6502200 Ext: 10819","NO","NO","NO","SI",{"$f":"IF(U765=\"SI\",\"Pública clasificada\",\"Pública\")","v":"Pública clasificada"},{"$f":"CONCATENATE(D765,\"-\",\"Tipo de información\",\" \",V765,\"-\",F765)","v":"C80522022-Tipo de información Pública clasificada-Prestación de servicios de Promoción y Prevención para implementar, mejorar y/o mantener las actividades de asesoría, asistencia técnica y de formación en Seguridad y Salud en el Trabajo, bajo el lineamiento de los programas de la Estrategia CREA del Modelo de Gestión Positiva SUMA, en PLAN BASICO: Preparación y atención de emergencias, Programa Protección Colectiva e Individual; PLAN AVANZADO: Programa Gestión para el Control de incidentes y accidentes de trabajo, programa de Gestión en la Prevención de la Enfermedad Laboral; para la atención de las empresas de Planes Gran Empresa, afiliadas a POSITIVA COMPAÑÍA DE SEGUROS Sucursal Cauca Zona Valle."}]
["Promoción y Prevención","Gcia. Administración del Riesgo","NO","C76492022",93141808,"Realizar actividades de Promoción y Prevención del Sistema de Gestión de Seguridad y Salud en el Trabajo, para la ejecución de actividades de asesoría y asistencia técnica para la revisión, ajuste y actualización de los profesiogramas por Grupos de Exposición Similar - GES, cargos, subgrupos y grupos según la información suministrada por la empresa, sustentado en el programa Gestión para la Prevención de la Enfermedad Laboral del PLAN AVANZADO de la Estrategia CREA del Modelo de Gestión de Positiva SUMA para la empresa CARBONES DEL CERREJON LIMITED, en la sucursal Guajira de la Zona Atlántico","2022-09-15",9,"2022-12-31",3.5666666666666669,"Invitación directa","PromociónyPrevención",41170000,41170000,"NO","NA","Gerencia de Abastecimiento Estratégico\ncontratacion@positiva.gov.co\nPBX: (1)6502200 Ext: 10819","NO","NO","NO","SI","Pública clasificada","C76492022-Tipo de información Pública clasificada-Realizar actividades de Promoción y Prevención del Sistema de Gestión de Seguridad y Salud en el Trabajo, para la ejecución de actividades de asesoría y asistencia técnica para la revisión, ajuste y actualización de los profesiogramas por Grupos de Exposición Similar - GES, cargos, subgrupos y grupos según la información suministrada por la empresa, sustentado en el programa Gestión para la Prevención de la Enfermedad Laboral del PLAN AVANZADO de la Estrategia CREA del Modelo de Gestión de Positiva SUMA para la empresa CARBONES DEL CERREJON LIMITED, en la sucursal Guajira de la Zona Atlántico"]
["Promoción y Prevención","Gcia. Administración del Riesgo","NO","C84202022",93141808,"EL CONTRATISTA,se compromete a la Prestación de servicios de Promoción y Prevención para implementar, mejorar y/o mantener actividades de asesoría, asistencia técnica del Sistema de Gestión de la Seguridad y Salud en el Trabajo con base en los programas del PLAN BÁSICO, PLAN AVANZADO, PLAN ESPECIALIZADO y PLAN GESTIÓN INTEGRAL, de la estrategia CREA del Modelo de Gestión POSITIVA SUMA, al igual que el acompañamiento para la investigación de presuntos accidentes de trabajo graves, mortales o leves (que por concepto técnico lo ameriten), con la implementación de estrategias transversales para la prevención de accidentes laborales buscando el impacto de la siniestralidad, para fortalecer la intervención en las empresas Pymes afiliadas a POSITIVA COMPAÑÍA DE SEGUROS S.A., bajo el lineamiento de intervención del prototipo técnico, con un grupo de personal interdisciplinario para ser desarrolladas en las sucursales de las zonas de Atlántico, Antioquia, Valle, Santander, Coordinadora Bogotá, en la modalidad de atención GRAN MI PYME y GRAN EMPRESA","2022-09-15",9,"2022-11-30",2.5333333333333332,"Invitación directa","PromociónyPrevención",227600000,{"$f":"+M767","v":227600000},"NO","NA","Gerencia de Abastecimiento Estratégico\ncontratacion@positiva.gov.co\nPBX: (1)6502200 Ext: 10819","NO","NO","NO","SI",{"$f":"IF(U767=\"SI\",\"Pública clasificada\",\"Pública\")","v":"Pública clasificada"},{"$f":"CONCATENATE(D767,\"-\",\"Tipo de información\",\" \",V767,\"-\",F767)","v":"C84202022-Tipo de información Pública clasificada-EL CONTRATISTA,se compromete a la Prestación de servicios de Promoción y Prevención para implementar, mejorar y/o mantener actividades de asesoría, asistencia técnica del Sistema de Gestión de la Seguridad y Salud en el Trabajo con base en los programas del PLAN BÁSICO, PLAN AVANZADO, PLAN ESPECIALIZADO y PLAN GESTIÓN INTEGRAL, de la estrategia CREA del Modelo de Gestión POSITIVA SUMA, al igual que el acompañamiento para la investigación de presuntos accidentes de trabajo graves, mortales o leves (que por concepto técnico lo ameriten), con la implementación de estrategias transversales para la prevención de accidentes laborales buscando el impacto de la siniestralidad, para fortalecer la intervención en las empresas Pymes afiliadas a POSITIVA COMPAÑÍA DE SEGUROS S.A., bajo el lineamiento de intervención del prototipo técnico, con un grupo de personal interdisciplinario para ser desarrolladas en las sucursales de las zonas de Atlántico, Antioquia, Valle, Santander, Coordinadora Bogotá, en la modalidad de atención GRAN MI PYME y GRAN EMPRESA"}]
["Promoción y Prevención","Gcia. Administración del Riesgo","NO","C76502022",93141808,"Realizar actividades de Promoción y Prevención del Sistema de Gestión de Seguridad y Salud en el Trabajo, para la ejecución de actividades de asesoría y asistencia técnica para el desarrollo de análisis de puestos de trabajo bajo metodología de APT Observacional con presentación de resultados en compilados en forma de tabla, incluyendo el análisis de los segmentos tanto axial como los miembros superiores, tomando en consideración el enfoque global, sustentado en el programa Gestión para la Prevención de la Enfermedad Laboral del PLAN AVANZADO de la Estrategia CREA del Modelo de Gestión de Positiva SUMA para los trabajadores de la empresa CARBONES DEL CERREJON LIMITED, en la sucursal Guajira de la Zona Atlántico.","2022-09-15",9,"2022-12-31",3.5666666666666669,"Invitación directa","PromociónyPrevención",60550000,60550000,"NO","NA","Gerencia de Abastecimiento Estratégico\ncontratacion@positiva.gov.co\nPBX: (1)6502200 Ext: 10819","NO","NO","NO","SI","Pública clasificada","C76502022-Tipo de información Pública clasificada-Realizar actividades de Promoción y Prevención del Sistema de Gestión de Seguridad y Salud en el Trabajo, para la ejecución de actividades de asesoría y asistencia técnica para el desarrollo de análisis de puestos de trabajo bajo metodología de APT Observacional con presentación de resultados en compilados en forma de tabla, incluyendo el análisis de los segmentos tanto axial como los miembros superiores, tomando en consideración el enfoque global, sustentado en el programa Gestión para la Prevención de la Enfermedad Laboral del PLAN AVANZADO de la Estrategia CREA del Modelo de Gestión de Positiva SUMA para los trabajadores de la empresa CARBONES DEL CERREJON LIMITED, en la sucursal Guajira de la Zona Atlántico."]
["Promoción y Prevención","Gcia. Administración del Riesgo","NO","C76512022",93141808,"Prestación del servicio de Consultoría consistente en la ejecución del “Programa de intervención acorde con las necesidades identificadas en los resultados de Riesgo Psicosocial” en los programas de prevención de la enfermedad laboral y programas de vigilancia epidemiológica dentro de los planes Avanzado y Especializado de la Estrategia Crea del modelo de Gestión de Positiva SUMA, para los trabajadores de Bienestar IPS afiliada a la compañía y que cuentan con un plan de trabajo anual concertado en la modalidad de Planes GRAN EMPRESA Sucursal Coordinadora Atlántico. El servicio se prestará bajo el alcance, términos y condiciones contractuales establecidos en la propuesta comercial presentada por ADECCO SERVICIOS COLOMBIA S.A a Positiva Compañía de Seguros S.A.","2022-09-15",9,"2022-12-31",3.5666666666666669,"Invitación directa","PromociónyPrevención",58500000,58500000,"NO","NA","Gerencia de Abastecimiento Estratégico\ncontratacion@positiva.gov.co\nPBX: (1)6502200 Ext: 10819","NO","NO","NO","SI","Pública clasificada","C76512022-Tipo de información Pública clasificada-Prestación del servicio de Consultoría consistente en la ejecución del “Programa de intervención acorde con las necesidades identificadas en los resultados de Riesgo Psicosocial” en los programas de prevención de la enfermedad laboral y programas de vigilancia epidemiológica dentro de los planes Avanzado y Especializado de la Estrategia Crea del modelo de Gestión de Positiva SUMA, para los trabajadores de Bienestar IPS afiliada a la compañía y que cuentan con un plan de trabajo anual concertado en la modalidad de Planes GRAN EMPRESA Sucursal Coordinadora Atlántico. El servicio se prestará bajo el alcance, términos y condiciones contractuales establecidos en la propuesta comercial presentada por ADECCO SERVICIOS COLOMBIA S.A a Positiva Compañía de Seguros S.A."]
["Promoción y Prevención","Gcia. Administración del Riesgo","NO","C84192022",93141808,"EL CONTRATISTA,se compromete a la Prestación de servicios de Promoción y Prevención para  implementar,  mejorar  y/o  mantener  actividades  de  asesoría,  asistencia  técnica  del Sistema de Gestión de la Seguridad y Salud en el Trabajo con base en los programas del PLAN  BÁSICO  LEGAL,  PLAN  AVANZADOY  PLAN  ESPECIALIZADO,  de  la  estrategia CREA  del  Modelo  de  Gestión  POSITIVA  SUMA,  así  como  también  la  elaboración  y actualización de la Matriz Legal del Sistema, de acuerdo con la actividad económica de las empresas, al igual que el acompañamiento para la investigación de presuntos accidentes de trabajo   graves,   mortales   o   leves   (que   por   concepto   técnico   lo   ameriten),   con   la implementación  de  estrategias  para  la  prevención  de  accidentes  laborales  buscando  el impacto  de  la  siniestralidad,  asesoría  técnica  especializada  para  cubrir  la  demanda  de solicitudes de reclasificación de empresas por requerimientos internos de la compañía y por entes de control y vigilancia, para fortalecer la intervención en las empresas Pymes afiliadas a  POSITIVA  COMPAÑÍA  DE  SEGUROS  S.A.,  bajo  el  lineamiento  de  intervención  del prototipo técnico, con un grupo de personal interdisciplinario para ser desarrolladas en las sucursales de las zonas de Atlántico, Antioquia, Valle, Santander, Bogotá y Cundinamarca, en la modalidad de atención GRAN MI PYME","2022-09-15",9,"2022-11-30",2.5333333333333332,"Invitación directa","PromociónyPrevención",270400000,270400000,"NO","NA","Gerencia de Abastecimiento Estratégico\ncontratacion@positiva.gov.co\nPBX: (1)6502200 Ext: 10819","NO","NO","NO","SI","Pública clasificada","C84192022-Tipo de información Pública clasificada-EL CONTRATISTA,se compromete a la Prestación de servicios de Promoción y Prevención para  implementar,  mejorar  y/o  mantener  actividades  de  asesoría,  asistencia  técnica  del Sistema de Gestión de la Seguridad y Salud en el Trabajo con base en los programas del PLAN  BÁSICO  LEGAL,  PLAN  AVANZADOY  PLAN  ESPECIALIZADO,  de  la  estrategia CREA  del  Modelo  de  Gestión  POSITIVA  SUMA,  así  como  también  la  elaboración  y actualización de la Matriz Legal del Sistema, de acuerdo con la actividad económica de las empresas, al igual que el acompañamiento para la investigación de presuntos accidentes de trabajo   graves,   mortales   o   leves   (que   por   concepto   técnico   lo   ameriten),   con   la implementación  de  estrategias  para  la  prevención  de  accidentes  laborales  buscando  el impacto  de  la  siniestralidad,  asesoría  técnica  especializada  para  cubrir  la  demanda  de solicitudes de reclasificación de empresas por requerimientos internos de la compañía y por entes de control y vigilancia, para fortalecer la intervención en las empresas Pymes afiliadas a  POSITIVA  COMPAÑÍA  DE  SEGUROS  S.A.,  bajo  el  lineamiento  de  intervención  del prototipo técnico, con un grupo de personal interdisciplinario para ser desarrolladas en las sucursales de las zonas de Atlántico, Antioquia, Valle, Santander, Bogotá y Cundinamarca, en la modalidad de atención GRAN MI PYME"]
["Promoción y Prevención","Gcia. Administración del Riesgo","NO","C84182022",93141808,"EL  CONTRATISTA,se  compromete  a la prestación  de  servicios  de  Promoción  y  Prevención  para implementar, mejorar y/o mantener actividades de asesoría, asistencia técnica del Sistema de Gestión de la  Seguridad  y  Salud  en  el  Trabajo  con  base  en  los  programas  del  PLAN  BÁSICO  LEGAL,  PLAN AVANZADO Y PLAN ESPECIALIZADO, de la estrategia CREA del Modelo de Gestión POSITIVA SUMA, al igual que el acompañamiento para la investigación de presuntos accidentes de trabajo graves, mortales o leves (que por concepto técnico lo ameriten), con la implementación de estrategias para la prevención de accidentes laborales buscando el impacto de la siniestralidad, asesoría técnica especializada para cubrir la demanda de solicitudes de reclasificación de empresas por requerimientos internos de la compañía y por entes  de  control  y  vigilancia,  para  fortalecer  la  intervención  en  las  empresas  afiliadas  a  POSITIVA COMPAÑÍA DE SEGUROS S.A., bajo el lineamiento de intervención del prototipo técnico, con un grupo de personal  interdisciplinario  para  ser  desarrolladas  en  las  sucursales  de  las  zonas  de  Atlántico,  Antioquia, Valle, Santander, Coordinadora Bogotá, en la modalidad de atención GRAN MI PYME y GRAN EMPRESA","2022-09-15",9,"2022-11-30",2.5333333333333332,"Invitación directa","PromociónyPrevención",461600000,461600000,"NO","NA","Gerencia de Abastecimiento Estratégico\ncontratacion@positiva.gov.co\nPBX: (1)6502200 Ext: 10819","NO","NO","NO","SI","Pública clasificada","C84182022-Tipo de información Pública clasificada-EL  CONTRATISTA,se  compromete  a la prestación  de  servicios  de  Promoción  y  Prevención  para implementar, mejorar y/o mantener actividades de asesoría, asistencia técnica del Sistema de Gestión de la  Seguridad  y  Salud  en  el  Trabajo  con  base  en  los  programas  del  PLAN  BÁSICO  LEGAL,  PLAN AVANZADO Y PLAN ESPECIALIZADO, de la estrategia CREA del Modelo de Gestión POSITIVA SUMA, al igual que el acompañamiento para la investigación de presuntos accidentes de trabajo graves, mortales o leves (que por concepto técnico lo ameriten), con la implementación de estrategias para la prevención de accidentes laborales buscando el impacto de la siniestralidad, asesoría técnica especializada para cubrir la demanda de solicitudes de reclasificación de empresas por requerimientos internos de la compañía y por entes  de  control  y  vigilancia,  para  fortalecer  la  intervención  en  las  empresas  afiliadas  a  POSITIVA COMPAÑÍA DE SEGUROS S.A., bajo el lineamiento de intervención del prototipo técnico, con un grupo de personal  interdisciplinario  para  ser  desarrolladas  en  las  sucursales  de  las  zonas  de  Atlántico,  Antioquia, Valle, Santander, Coordinadora Bogotá, en la modalidad de atención GRAN MI PYME y GRAN EMPRESA"]
["Promoción y Prevención","Gcia. Administración del Riesgo","NO","C84162022",93141808,"EL CONTRATISTA,se compromete a la realizar la prestación de servicios de Promoción y Prevención para implementar, mejorar y/o mantener actividades de asesoría, asistencia técnica del Sistema de Gestión de la  Seguridad  y  Salud  en  el  Trabajo  con  base  en  los  programas  del  PLAN  BÁSICO  LEGAL,  PLAN AVANZADO Y PLAN ESPECIALIZADO, de la estrategiaCREA del Modelo de Gestión POSITIVA SUMA, al igual que el acompañamiento para la investigación de presuntos accidentes de trabajo graves, mortales o leves (que por concepto técnico lo ameriten), con la implementación de estrategias para la prevención de accidentes laborales buscando el impacto de la siniestralidad, al igual las que presentan alta frecuencia y severidad,  mediante  la  Asesoría,  Investigación  por  parte  de  la  ARL  (cuando  aplique),  Inspección  / verificación,  Seguimiento  a  Recomendaciones,  y  la  intervención  de  las  Empresas  que  presenten Enfermedades Laborales y produzcan la muerte del trabajador, mediante la Investigación e identificación de las causas, asesoría técnica especializada para cubrir la demanda de solicitudes de reclasificación de empresas por requerimientos internos de la compañía y por entes de control y vigilancia, para fortalecer la intervención  en  las  empresas  Pymes  afiliadas  a  POSITIVA  COMPAÑÍA  DE  SEGUROS  S.A  bajo  el lineamiento  de  intervención  del  prototipo  técnico,  con  un  grupo de  personal  interdisciplinario  para  ser desarrolladas  en  las  sucursales  de  las  zonas  de  Atlántico,  Antioquia,  Valle,  Santander,  Coordinadora  Bogotá, en la modalidad de atención GRAN MI PYME","2022-09-15",9,"2022-11-30",2.5333333333333332,"Invitación directa","PromociónyPrevención",302400000,302400000,"NO","NA","Gerencia de Abastecimiento Estratégico\ncontratacion@positiva.gov.co\nPBX: (1)6502200 Ext: 10819","NO","NO","NO","SI","Pública clasificada","C84162022-Tipo de información Pública clasificada-EL CONTRATISTA,se compromete a la realizar la prestación de servicios de Promoción y Prevención para implementar, mejorar y/o mantener actividades de asesoría, asistencia técnica del Sistema de Gestión de la  Seguridad  y  Salud  en  el  Trabajo  con  base  en  los  programas  del  PLAN  BÁSICO  LEGAL,  PLAN AVANZADO Y PLAN ESPECIALIZADO, de la estrategiaCREA del Modelo de Gestión POSITIVA SUMA, al igual que el acompañamiento para la investigación de presuntos accidentes de trabajo graves, mortales o leves (que por concepto técnico lo ameriten), con la implementación de estrategias para la prevención de accidentes laborales buscando el impacto de la siniestralidad, al igual las que presentan alta frecuencia y severidad,  mediante  la  Asesoría,  Investigación  por  parte  de  la  ARL  (cuando  aplique),  Inspección  / verificación,  Seguimiento  a  Recomendaciones,  y  la  intervención  de  las  Empresas  que  presenten Enfermedades Laborales y produzcan la muerte del trabajador, mediante la Investigación e identificación de las causas, asesoría técnica especializada para cubrir la demanda de solicitudes de reclasificación de empresas por requerimientos internos de la compañía y por entes de control y vigilancia, para fortalecer la intervención  en  las  empresas  Pymes  afiliadas  a  POSITIVA  COMPAÑÍA  DE  SEGUROS  S.A  bajo  el lineamiento  de  intervención  del  prototipo  técnico,  con  un  grupo de  personal  interdisciplinario  para  ser desarrolladas  en  las  sucursales  de  las  zonas  de  Atlántico,  Antioquia,  Valle,  Santander,  Coordinadora  Bogotá, en la modalidad de atención GRAN MI PYME"]
["Promoción y Prevención","Gcia. Administración del Riesgo","NO","C78122022",93141808,"EL CONTRATISTA se compromete a realizar la Prestación de Servicios de Promoción y Prevención para implementar, mejorar y/o mantener actividades de, asesoría, asistencia técnica y de formación en Seguridad y Salud en el Trabajo del Plan Básico en los Programas: Programa Preparación y Atención de Emergencias, Programa de Prevención y Protección Colectiva e Individual, Programa Promoción y Prevención En Salud, Programa Investigación de Incidentes, Accidentes de Trabajo; Avanzado en los Programas de: Programa Gestión para el Control de Incidentes y Accidentes de Trabajo, Programa Gestión en la Prevención de Enfermedades Profesionales de la Estrategia CREA del Modelo de Gestión Positiva SUMA de acuerdo a los Planes de Trabajo pactados con la empresas y cargados en el aplicativo GESTPOS, para empresas afiliadas a Positiva Compañía de Seguros especialmente para empresas en la Sucursal Meta que incluye las zonas de Influencia Guainía, Vichada, Guaviare y Vaupés","2022-09-15",9,"2022-12-31",3.5666666666666669,"Invitación directa","PromociónyPrevención",36289920,36289920,"NO","NA","Gerencia de Abastecimiento Estratégico\ncontratacion@positiva.gov.co\nPBX: (1)6502200 Ext: 10819","NO","NO","NO","SI","Pública clasificada","C78122022-Tipo de información Pública clasificada-EL CONTRATISTA se compromete a realizar la Prestación de Servicios de Promoción y Prevención para implementar, mejorar y/o mantener actividades de, asesoría, asistencia técnica y de formación en Seguridad y Salud en el Trabajo del Plan Básico en los Programas: Programa Preparación y Atención de Emergencias, Programa de Prevención y Protección Colectiva e Individual, Programa Promoción y Prevención En Salud, Programa Investigación de Incidentes, Accidentes de Trabajo; Avanzado en los Programas de: Programa Gestión para el Control de Incidentes y Accidentes de Trabajo, Programa Gestión en la Prevención de Enfermedades Profesionales de la Estrategia CREA del Modelo de Gestión Positiva SUMA de acuerdo a los Planes de Trabajo pactados con la empresas y cargados en el aplicativo GESTPOS, para empresas afiliadas a Positiva Compañía de Seguros especialmente para empresas en la Sucursal Meta que incluye las zonas de Influencia Guainía, Vichada, Guaviare y Vaupés"]
["Promoción y Prevención","Gcia. Administración del Riesgo","NO","C76442022",93141808,"Realizar el “Estudio de Cultura Organizacional, de la Salud y la Seguridad y experiencia del empleado” dirigida a la población definida por el Cerrejón, haciendo una medición cuantitativa y cualitativa de los aspectos definidos, que permitan ver el impacto y mejora que ha tenido en estos últimos años el trabajo que se ha venido realizando de apalancamiento de los atributos culturales de la cultura definidos, y poder identificar el nivel de alineación de la organización y de las diferentes áreas en la Cultura de la Salud y Seguridad, sustentados en los programas de GESTIÓN PARA EL CONTROL DE INCIDENTES Y ACCIDENTES DE TRABAJO y GESTIÓN EN LA PREVENCIÓN DE LA ENFERMEDAD LABORAL del plan avanzado, el PROGRAMA DE VIGILANCIA EPIDEMIOLÓGICA del plan especializado de la Estrategia CREA del Modelo de Gestión Positiva SUMA para la empresa CARBONES DEL CERREJON LIMITED.","2022-09-15",9,"2022-12-31",3.5666666666666669,"Invitación directa","PromociónyPrevención",170000000,170000000,"NO","NA","Gerencia de Abastecimiento Estratégico\ncontratacion@positiva.gov.co\nPBX: (1)6502200 Ext: 10819","NO","NO","NO","SI","Pública clasificada","C76442022-Tipo de información Pública clasificada-Realizar el “Estudio de Cultura Organizacional, de la Salud y la Seguridad y experiencia del empleado” dirigida a la población definida por el Cerrejón, haciendo una medición cuantitativa y cualitativa de los aspectos definidos, que permitan ver el impacto y mejora que ha tenido en estos últimos años el trabajo que se ha venido realizando de apalancamiento de los atributos culturales de la cultura definidos, y poder identificar el nivel de alineación de la organización y de las diferentes áreas en la Cultura de la Salud y Seguridad, sustentados en los programas de GESTIÓN PARA EL CONTROL DE INCIDENTES Y ACCIDENTES DE TRABAJO y GESTIÓN EN LA PREVENCIÓN DE LA ENFERMEDAD LABORAL del plan avanzado, el PROGRAMA DE VIGILANCIA EPIDEMIOLÓGICA del plan especializado de la Estrategia CREA del Modelo de Gestión Positiva SUMA para la empresa CARBONES DEL CERREJON LIMITED."]
["NEGOCIOS","Grcia. Canales","NO","C35582022\nC35602022\nC35562022",80141600,"Prestación de servicios Outsorcing de personal","2022-12-01",12,"2022-12-31",1,"Invitación cerrada","Gasto Administrativo",776207209,776207209,"NO",null,"Gerencia de Abastecimiento Estratégico\ncontratacion@positiva.gov.co\nPBX: (1)6502200 Ext: 10641","SI","SI","NA","SI","Pública clasificada","C35582022\nC35602022\nC35562022-Tipo de información Pública clasificada-Prestación de servicios Outsorcing de personal"]
["PyP","Gerencia de administración del riesgo","No","C76522022",93141808,"Prestación de servicios de Promoción y Prevención para implementar, mejorar y/o mantener las actividades de asesoría, asistencia técnica y de formación en Seguridad y Salud en el Trabajo, bajo el lineamiento de los programas de los Planes, PLAN BASICO, PLAN AVANZADO, PLAN ESPECIALIZADO, Programas de Vigilancia Epidemiológica; programa de gestión prevención de la enfermedad profesional, énfasis Psicosocial y DME y PLAN GESTION INTEGRAL de la Estrategia CREA del Modelo de Gestión Positiva SUMA, para la atención de las empresas de Planes Regulares caracterizadas Grandes Empresas, afiliadas a POSITIVA COMPAÑÍA DE SEGUROS Sucursal Magdalena Coordinadora Zona Atlántico.","2022-10-01",10,"30/11/2022",2,"Invitación directa","PromociónyPrevención",60000000,60000000,"No","N/A","Gerencia de Abastecimiento Estratégico\ncontratacion@positiva.gov.co\nPBX: (1)6502200 Ext: 10641","SI","SI","NO","SI","Pública clasificada","C76522022-Tipo de información Pública clasificada-Prestación de servicios de Promoción y Prevención para implementar, mejorar y/o mantener las actividades de asesoría, asistencia técnica y de formación en Seguridad y Salud en el Trabajo, bajo el lineamiento de los programas de los Planes, PLAN BASICO, PLAN AVANZADO, PLAN ESPECIALIZADO, Programas de Vigilancia Epidemiológica; programa de gestión prevención de la enfermedad profesional, énfasis Psicosocial y DME y PLAN GESTION INTEGRAL de la Estrategia CREA del Modelo de Gestión Positiva SUMA, para la atención de las empresas de Planes Regulares caracterizadas Grandes Empresas, afiliadas a POSITIVA COMPAÑÍA DE SEGUROS Sucursal Magdalena Coordinadora Zona Atlántico."]
["PyP","Gerencia de administración del riesgo","No","C76532022",93141808,"EL CONTRATISTA se compromete a realizar la prestación de servicios de Promoción y Prevención, para realizar actividades de Seguridad y Salud en el Trabajo, bajo el lineamiento de los Programas del PLAN BASICO, Promoción y Prevención en Salud. PLAN AVANZADO, Gestión en la Prevención de la Enfermedad Laboral. PLAN ESPECIALIZADO; Programas de Vigilancia Epidemiológica, de la estrategia CREA, principalmente en los programas de prevención de riesgos sicosociales con intervención mediante actividades experienciales, en las empresas afiliadas a POSITIVA COMPAÑÍA DE SEGUROS, en la modalidad de atención de GRAN EMPRESA para la sucursal Tipo B - Bolívar de la Sucursal Coordinadora Atlántico.","2022-10-01",10,"30/11/2022",2,"Invitación directa","PromociónyPrevención",30000000,30000000,"No","N/A","Gerencia de Abastecimiento Estratégico\ncontratacion@positiva.gov.co\nPBX: (1)6502200 Ext: 10641","SI","SI","NO","SI","Pública clasificada","C76532022-Tipo de información Pública clasificada-EL CONTRATISTA se compromete a realizar la prestación de servicios de Promoción y Prevención, para realizar actividades de Seguridad y Salud en el Trabajo, bajo el lineamiento de los Programas del PLAN BASICO, Promoción y Prevención en Salud. PLAN AVANZADO, Gestión en la Prevención de la Enfermedad Laboral. PLAN ESPECIALIZADO; Programas de Vigilancia Epidemiológica, de la estrategia CREA, principalmente en los programas de prevención de riesgos sicosociales con intervención mediante actividades experienciales, en las empresas afiliadas a POSITIVA COMPAÑÍA DE SEGUROS, en la modalidad de atención de GRAN EMPRESA para la sucursal Tipo B - Bolívar de la Sucursal Coordinadora Atlántico."]

{"sheet":"Hoja5","index":5,"n_rows":4,"n_cols":2,"rows_kept":4,"cut":false,"hidden":true,"merged":[]}
[]
[]
["Suma de Valor total estimado","Total"]
["Total",192782729037.5542]