{"text_format":"1","workbook":"xlsx","n_sheets":6,"sheets":["Hoja4","Hoja3","Hoja1","REPARTO","PLAN","Hoja5"],"not_rendered":{"charts":1,"images":1,"macros":0,"external_links":1,"defined_names":3,"comments":0,"pivot_tables":5},"unopened":[],"bounds":{"document_bytes":16777216,"sheet_cells":100000,"rows_first":2000,"rows_last":500,"rows_between":2000,"halvings":0,"cell_chars":16384,"cell_head_chars":4096},"cells_cut":0,"cells_raw":0,"read":"whole","date_system":"1900"}

{"sheet":"Hoja4","index":0,"n_rows":25,"n_cols":3,"rows_kept":25,"cut":false,"hidden":true,"merged":[]}
["CLASIFICACIÓN DE LA INFORMACIÓN","(Varios elementos)"]
[]
[]
[]
[]
[]
[]
[]
[]
[]
[]
[]
[]
[]
[]
[]
["OTI",50,0.37313432835820898]
["SECRETARIA GENERAL Y JURIDICA",43,0.32089552238805968]
["FINANCIERA Y ADMON",25,0.18656716417910449]
["ESTRATEGIA",4,2.9850746268656716E-2]
["NEGOCIOS",4,2.9850746268656716E-2]
["TÉCNICA",4,2.9850746268656716E-2]
["OPERACIONES",3,2.2388059701492536E-2]
["RIESGOS",1,7.462686567164179E-3]
["TOTAL GENERAL",134,1]

{"sheet":"Hoja3","index":1,"n_rows":17,"n_cols":12,"rows_kept":17,"cut":false,"hidden":true,"merged":[]}
[null,null,null,null,null,null,null,null,"DEPENDENCIA","Planeado","Contratado","%"]
["DEPENDENCIA","VALOR","PRESUPUESTO CONTRATADO","%",null,null,null,null,"ESTRATEGIA",1172306306,1172306306,{"$f":"K2/J2","v":1}]
["OFICINA DE ESTRATEGIA Y DESARROLLO",694295625,null,null,null,null,null,null,"FINANCIERA Y ADMON",8752267945,5335356771,{"$f":"K3/J3","v":0.60959705581774215}]
["VICEPRESIDENCIA FINANCIERA Y ADMINISTRATIVA",8752267945,3088070598,{"$f":"C4/B4","v":0.35283090250500782},null,null,null,null,"NEGOCIOS",13360033182.975,12691995310,{"$f":"K4/J4","v":0.94999728939099515}]
["VICEPRESIDENCIA DE NEGOCIOS",7381429080.000001,12227414358,{"$f":"C5/B5","v":1.656510443367966},null,null,null,null,"OPERACIONES",38366883401,31119191770,{"$f":"K5/J5","v":0.81109511671174483}]
["VICEPRESIDENCIA DE OPERACIONES",38366883401,31119191770,0.81109511671174483,null,null,null,null,"OTI",16326122400.077499,9124308413,{"$f":"K6/J6","v":0.55887786391682859}]
["OFICINA DE TECNOLOGIAS DE LA INFORMACIÓN",16326122400.077499,201210990,1.2324481286447102E-2,null,null,null,null,"PYP",120411187909,99075259486,0.82280775737280742]
["VICEPRESIDENCIA DE PROMOCIÓN Y PREVENCIÓN",120411187909,81402850713,0.67604059163106744,null,null,null,null,"RIESGOS",68348301,68348301,1]
["OFICINA DE GESTIÓN INTEGRAL DE RIESGOS",68348301,null,0,null,null,null,null,"SECRETARIA GENERAL Y JURIDICA",5599124509.9749994,4399646576,0.78577402023511078]
["SECRETARIA GENERAL Y JURIDICA",6077135190.9749994,7043728834,1.1590541616484795,null,null,null,null,"TÉCNICA",1132517831,1125458561,0.99376674714801905]
["VICEPRESIDENCIA TÉCNICA",1132517831,725588815,0.64068643789856583,null,null,null,null,"Total general",{"$f":"SUM(J2:J10)","v":205188791786.0275},{"$f":"SUM(K2:K10)","v":164111871494},0.79980914193957131]
["PRESUPUESTOS COMPARTIDOS"]
["VP NEGOCIOS Y VP FINANCIERA Y ADMON",269479593]
["VP NEGOCIOS Y SECRETARIA GENERAL",110000000]
["VP NEGOCIOS, SECRETARIA GENERAL y VP PYP",6589650515]
["OFICINA DE ESTRATEGIA, G. TALENTO HUMANO y OFICINA DE RIESGOS",97086437]
["TOTAL PLAN ",206276404228.05252,135808056078]

{"sheet":"Hoja1","index":2,"n_rows":49,"n_cols":8,"rows_kept":49,"cut":false,"hidden":true,"merged":[]}
[]
[]
[null,"Datos",null,null,"VICEPRESIDENCIA/SECTREATARÍA GENERAL","CANTIDAD PREVISTA DE CONTRATOS","VALOR PLANEADO A CONTRATAR","% del valor estimado"]
["VICEPRESIDENCIA/SECTREATARÍA GENERAL","CANTIDAD PREVISTA DE CONTRATOS","VALOR PLANEADO A CONTRATAR",null,"Financiera y Administrativa",39,9198008297,{"$f":"G4/$G$10","v":4.6140842804290406E-2}]
["NEGOCIOS",26,10913533198,null,"Negocios",23,8440161697,4.2339184911486492E-2]
["Operaciones",11,16055336512,null,"Operaciones",14,30469448195,0.15284678748958133]
["SECRETARIA GENERAL Y JURÍDICA",77,26131635084.554203,null,"Promoción y Prevención",270,119824776984,0.60108841179031813]
["PyP",311,139682224243,null,"Secretaria General y Jurídica",128,29798454282.709999,0.14948081698488994]
["Total general",425,192782729037.5542,null,"Técnica",438,1615494000,8.1039560194337071E-3]
[null,null,null,null,"Total general",912,199346343455.70999]
[]
[]
[]
[]
[]
["CANTIDAD PREVISTA DE CONTRATOS"]
["MES","Total"]
["ENERO",320]
["FEBRERO",6]
["MARZO",1]
["ABRIL",1]
["JUNIO",9]
["JULIO",24]
["AGOSTO",6]
["SEPTIEMBRE",8]
["OCTUBRE",9]
["NOVIEMBRE",11]
["DICIEMBRE",30]
["Total general",425]
[]
[]
[]
[]
[]
[]
["MES","Total"]
["ENERO",254]
["FEBRERO",104]
["MARZO",89]
["ABRIL",83]
["MAYO",62]
["JUNIO",59]
["JULIO",58]
["AGOSTO",46]
["SEPTIEMBRE",34]
["OCTUBRE",41]
["NOVIEMBRE",55]
["DICIEMBRE",27]
["Total general",912]

{"sheet":"REPARTO","index":3,"n_rows":21,"n_cols":9,"rows_kept":21,"cut":false,"hidden":true,"merged":[]}
["¿YA SE CONTRATÓ?","(Todas)"]
["Modalidad de selección ","(Todas)"]
[null,null,null,null,null,null,250000,null,120000]
["Etiquetas de fila",null,null,null,null,null,{"$f":"G3/20","v":12500}]
["NEGOCIOS"]
["Riesgos laborales"]
["Mercadeo y Comunicaciones"]
["Canales"]
["Experiencia del cliente"]
["Vida"]
["Operaciones"]
["Gcia. Afiliaciones y Novedades"]
["Gcia. Recaudo y Cartera"]
["Vicepresidencia de operaciones"]
["SECRETARIA GENERAL Y JURÍDICA"]
["GERENCIA JURÍDICA"]
["Oficina de Tecnologías de la Información"]
["Oficina Gestión Integral de Riesgos "]
["PyP"]
["Gerencia de administración del riesgo"]
["Total general"]

{"sheet":"PLAN","index":4,"n_rows":724,"n_cols":26,"rows_kept":724,"cut":false,"hidden":false,"merged":[[4,10,8,13],[10,10,14,13],[16,4,19,4],[16,5,19,5]]}
[]
[null,null,null,null,"PLAN ANUAL DE ADQUISICIONES"]
[]
[null,null,null,null,"A. INFORMACIÓN GENERAL DE LA ENTIDAD"]
[null,null,null,null,"Nombre","POSITIVA COMPAÑÍA DE SEGUROS S.A.",null,null,null,null,"El principal objetivo del Plan Anual de Adquisiciones es permitir que la entidad estatal aumente la probabilidad de lograr mejores condiciones de competencia a través de la participación de un mayor número de operadores económicos interesados en los procesos de selección que se van a adelantar durante el año fiscal, y que el Estado cuente con información suficiente para realizar compras coordinadas. "]
[null,null,null,null,"Dirección","Avenida Carrera 45 No. 94-72"]
[null,null,null,null,"Teléfono","PBX:(57-1)6502200"]
[null,null,null,null,"Página web","www.positiva.gov.co"]
[null,null,null,null,"Misión y visión","MISION: Protegemos Integralmente la vida de las personas contribuyendo al bienestar de las familias, las empresas y la sociedad\nVISION: Ser la aseguradora que garantiza oportunamente la máxima protección a nuestros clientes"]
[null,null,null,null,"Perspectiva estratégica","POSITIVA COMPAÑÍA DE SEGUROS S.A., diseña e implementa un modelo de negocio de Responsabilidad Global que contribuya con la rentabilidad y el desarrollo sostenible de la empresa y que coadyude con el logro de sus objetivos específicos."]
[null,null,null,null,"Información de contacto","Gerencia de Abastecimiento Estratégico\ncontratacion@positiva.gov.co\nPBX: (1)6502200 Ext: 10641",null,null,null,null,"El Plan Anual de Adquisiciones es un documento de naturaleza informativa y las adquisiciones incluidas en el mismo pueden ser canceladas, revisadas o modificadas. Esta información no representa compromiso u obligación alguna por parte de la entidad estatal ni la compromete a adquirir los bienes, obras y servicios en él señalados. "]
[null,null,null,null,"Valor total del PAA",{"$f":"SUM(M:M)","v":233861371617.6875}]
[null,null,null,null,"Límite de contratación menor cuantía","Régimen Especial de Contratación",null,null,null,null,null,null,null,null,null,null,null,null,null,null,null,null,null,null,null,"SI"]
[null,null,null,null,"Límite de contratación mínima cuantía","Régimen Especial de Contratación",null,null,null,null,null,null,null,null,null,null,null,null,null,null,null,null,null,null,null,"NO"]
[null,null,null,null,"Fecha de última actualización del PAA","2022-05-03"]
[]
[null,null,null,null,"NOTA","Acorde con el Decreto 2973 de 2013 en relación con el régimen de las reservas técnicas de las entidades aseguradoras y se dictan otras disposiciones, los contratos para la atención del siniestro se pagan con los recursos destinados a la reserva técnica.\nEste tipo de contratos son de cuantía indeterminada y aunque es determinable, al momento de la planeación únicamente se refleja el valor asociado al control presupuestal. "]
[]
[]
[]
[null,null,null,null,"B. ADQUISICIONES PLANEADAS"]
["VICEPRESIDENCIA/SECTREATARÍA GENERAL","ÁREA","¿YA SE CONTRATÓ?","ORDEN","Códigos UNSPSC","Descripción","Fecha estimada de inicio de proceso de selección","MES","Fecha fin contrato","Duración estimada del contrato (Meses)","Modalidad de selección ","Fuente de los recursos","Valor total estimado","Valor estimado en la vigencia actual","¿Se requieren vigencias futuras?","Estado de solicitud de vigencias futuras","Datos de contacto del responsable","¿Su necesidad contiene información financiera y secretos comerciales?\nEjm: Tarifas comerciales, disminución de la siniestralidad, atención o servicio conexo al siniestro, know how del negocio, clasificación de empresas, estrategias comerciales.","¿Su necesidad y el proceso de contratación son catalogados como misionales?\nEjm: Gestión comercial, Gestión de clientes, Atención al siniestro, Estrategias de disminución de la siniestralidad, Gestión integral del portafolio, Gestión de reservas y reaseguros.","En caso de ser una necesidad tecnologica ¿Su necesidad contiene información sensible?\nEjm: Administración de bases de datos de clientes, información comercial de la Compañía, información relevante al know how del negocio. ","¿De publicarse esta información referente al proceso de contratación podrían vulnerarse los intereses de Positiva con relación a su competencia al revelar información misional?","CLASIFICACIÓN DE LA INFORMACIÓN","DESCRIPCIÓN AJUSTADA"]
["SECRETARIA GENERAL Y JURÍDICA","GERENCIA JURÍDICA","SI","C23132022","80111607","Prestar servicios profesionales de asesoría en la rama del derecho penal, a través de la generación de conceptos jurídicos relacionados con eventuales hechos que pueden derivar de actos contrarios al Ordenamiento Penal Colombiano, así como la elaboración, presentación y seguimiento de denuncias penales por hechos que constituyan delitos en contra de los intereses de Positiva Compañía de Seguros S.A., asesoría y representación judicial en calidad de apoderado dentro de las investigaciones penales. ","2021-12-01",{"$f":"MONTH(G23)","v":12},"2021-01-05",12,"Invitación directa","GastosAdministrativos",138000000,138000000,"NO","N/A","Gerencia de Abastecimiento Estratégico\ncontratacion@positiva.gov.co\nPBX: (1)6502200 Ext: 10641","NO","NO","NO","NO",{"$f":"IF(U23=\"SI\",\"Pública clasificada\",\"Pública\")","v":"Pública"},{"$f":"CONCATENATE(D23,\"-\",\"Tipo de información\",\" \",V23,\"-\",F23)","v":"C23132022-Tipo de información Pública-Prestar servicios profesionales de asesoría en la rama del derecho penal, a través de la generación de conceptos jurídicos relacionados con eventuales hechos que pueden derivar de actos contrarios al Ordenamiento Penal Colombiano, así como la elaboración, presentación y seguimiento de denuncias penales por hechos que constituyan delitos en contra de los intereses de Positiva Compañía de Seguros S.A., asesoría y representación judicial en calidad de apoderado dentro de las investigaciones penales. "}]
["SECRETARIA GENERAL Y JURÍDICA","GERENCIA JURÍDICA","SI","C23142021","80111607","Prestación de servicios profesionales como abogado especializado en derecho comercial, brindando atención en los diferentes procesos concursales de restructuración y reorganización empresarial, liquidación obligatoria y liquidación judicial conforme a las disposiciones establecidas en las leyes 550 de 1999 y 1116 de 2006 y, atendiendo a nivel nacional los procesos de liquidación forzosa, administrativa, liquidación de empresas afiliadas a Riegos Laborales y liquidación de entidades financieras, entre otros, en aras de cumplir con la debida defensa de los intereses de Positiva Compañía de Seguros S.A.","2021-12-01",{"$f":"MONTH(G24)","v":12},"2022-01-03",12,"Invitación directa","GastosAdministrativos",187200000,187200000,"NO","N/A","Gerencia de Abastecimiento Estratégico\ncontratacion@positiva.gov.co\nPBX: (1)6502200 Ext: 10641","NO","NO","NO","NO","Pública",{"$f":"CONCATENATE(D24,\"-\",\"Tipo de información\",\" \",V24,\"-\",F24)","v":"C23142021-Tipo de información Pública-Prestación de servicios profesionales como abogado especializado en derecho comercial, brindando atención en los diferentes procesos concursales de restructuración y reorganización empresarial, liquidación obligatoria y liquidación judicial conforme a las disposiciones establecidas en las leyes 550 de 1999 y 1116 de 2006 y, atendiendo a nivel nacional los procesos de liquidación forzosa, administrativa, liquidación de empresas afiliadas a Riegos Laborales y liquidación de entidades financieras, entre otros, en aras de cumplir con la debida defensa de los intereses de Positiva Compañía de Seguros S.A."}]
["SECRETARIA GENERAL Y JURÍDICA","GERENCIA JURÍDICA","SI","C23152022 ","80111607","Prestar servicios profesionales de una firma de Abogados especializados en derecho comercial, de seguros y seguridad social, para que asesore y represente judicialmente  a la Compañía en los procesos en que sea parte activa o pasiva, para que atienda audiencias de conciliación judicial, prejudicial y extrajudicial  en los procesos en que sea parte la entidad, igualmente para rendir conceptos jurídicos en las áreas mencionadas y capacitar al personal de la Compañía cuando se le solicite.","2021-12-01",{"$f":"MONTH(G25)","v":12},"2022-01-03",12,"Invitación directa","GastosAdministrativos",220000000,220000000,"NO","N/A","Gerencia de Abastecimiento Estratégico\ncontratacion@positiva.gov.co\nPBX: (1)6502200 Ext: 10641","NO","NO","NO","NO","Pública",{"$f":"CONCATENATE(D25,\"-\",\"Tipo de información\",\" \",V25,\"-\",F25)","v":"C23152022 -Tipo de información Pública-Prestar servicios profesionales de una firma de Abogados especializados en derecho comercial, de seguros y seguridad social, para que asesore y represente judicialmente  a la Compañía en los procesos en que sea parte activa o pasiva, para que atienda audiencias de conciliación judicial, prejudicial y extrajudicial  en los procesos en que sea parte la entidad, igualmente para rendir conceptos jurídicos en las áreas mencionadas y capacitar al personal de la Compañía cuando se le solicite."}]
["SECRETARIA GENERAL Y JURÍDICA","GERENCIA JURÍDICA","SI","C23162022","80111607","Prestación de servicios profesionales especializados en derecho corporativo, lo cual incluye: derecho de la propiedad industrial y derecho marcario, protección de datos personales (habeas data y financiero), derechos de autor, secreto empresarial, seguridad de la información y Transparencia y Derecho de Acceso; El asesor podrá además ser encargado de la atención de audiencias de conciliación; gestiones en reclamaciones administrativas ante el Ministerio del Trabajo y otros entes administrativos; y trámites de registro ante organismos como las cámaras de comercio, la Superintendencia de Industria y Comercio, y todos aquellos que resulten necesarios para el cabal desarrollo de las actividades asignadas en cumplimiento del objeto contractual.","2021-12-01",{"$f":"MONTH(G26)","v":12},"2022-01-03",12,"Invitación directa","GastosAdministrativos",138000000,138000000,"NO","N/A","Gerencia de Abastecimiento Estratégico\ncontratacion@positiva.gov.co\nPBX: (1)6502200 Ext: 10641","NO","NO","NO","NO","Pública",{"$f":"CONCATENATE(D26,\"-\",\"Tipo de información\",\" \",V26,\"-\",F26)","v":"C23162022-Tipo de información Pública-Prestación de servicios profesionales especializados en derecho corporativo, lo cual incluye: derecho de la propiedad industrial y derecho marcario, protección de datos personales (habeas data y financiero), derechos de autor, secreto empresarial, seguridad de la información y Transparencia y Derecho de Acceso; El asesor podrá además ser encargado de la atención de audiencias de conciliación; gestiones en reclamaciones administrativas ante el Ministerio del Trabajo y otros entes administrativos; y trámites de registro ante organismos como las cámaras de comercio, la Superintendencia de Industria y Comercio, y todos aquellos que resulten necesarios para el cabal desarrollo de las actividades asignadas en cumplimiento del objeto contractual."}]
["SECRETARIA GENERAL Y JURÍDICA","GERENCIA JURÍDICA","SI","C23192022","80111607","Prestar servicios profesionales en Derecho Público, Derecho Tributario, Derecho Civil y Derecho Comercial, para la representación judicial, audiencias de conciliación judicial y extrajudicial en los procesos en que sea parte la entidad, elaboración de conceptos y acompañamiento en todos los procesos en los que interviene la Gerencia Jurídica, adelantar trámites ante entidades administrativas y de inspección, vigilancia y control, en especial ante la Procuraduría General de la Nación y estructurar y dictar capacitaciones en temas jurídicos  específicos, requeridos por Positiva Compañía de Seguros S.A","2021-12-01",{"$f":"MONTH(G27)","v":12},"2022-01-03",12,"Invitación directa","GastosAdministrativos",80400000,80400000,"NO","N/A","Gerencia de Abastecimiento Estratégico\ncontratacion@positiva.gov.co\nPBX: (1)6502200 Ext: 10641","NO","NO","NO","NO","Pública",{"$f":"CONCATENATE(D27,\"-\",\"Tipo de información\",\" \",V27,\"-\",F27)","v":"C23192022-Tipo de información Pública-Prestar servicios profesionales en Derecho Público, Derecho Tributario, Derecho Civil y Derecho Comercial, para la representación judicial, audiencias de conciliación judicial y extrajudicial en los procesos en que sea parte la entidad, elaboración de conceptos y acompañamiento en todos los procesos en los que interviene la Gerencia Jurídica, adelantar trámites ante entidades administrativas y de inspección, vigilancia y control, en especial ante la Procuraduría General de la Nación y estructurar y dictar capacitaciones en temas jurídicos  específicos, requeridos por Positiva Compañía de Seguros S.A"}]
["SECRETARIA GENERAL Y JURÍDICA","GERENCIA JURÍDICA","SI","C23172022","80111607","Prestar servicios profesionales especializados en derecho corporativo, derecho de la propiedad industrial y derecho marcario; con el propósito de ejercer el mandato judicial en defensa de los intereses de Positiva Compañía de Seguros S.A, en la demanda interpuesta ante la Superintendencia de Industria y Comercio, por La Positiva Seguros y Reaseguros (PERU), con radicado 19-084346.","2021-12-01",{"$f":"MONTH(G28)","v":12},"2019-08-30","INDETERMINADO","Invitación directa","GastosAdministrativos",117852000,117852000,"NO","N/A","Gerencia de Abastecimiento Estratégico\ncontratacion@positiva.gov.co\nPBX: (1)6502200 Ext: 10641","NO","NO","NO","NO","Pública",{"$f":"CONCATENATE(D28,\"-\",\"Tipo de información\",\" \",V28,\"-\",F28)","v":"C23172022-Tipo de información Pública-Prestar servicios profesionales especializados en derecho corporativo, derecho de la propiedad industrial y derecho marcario; con el propósito de ejercer el mandato judicial en defensa de los intereses de Positiva Compañía de Seguros S.A, en la demanda interpuesta ante la Superintendencia de Industria y Comercio, por La Positiva Seguros y Reaseguros (PERU), con radicado 19-084346."}]
["SECRETARIA GENERAL Y JURÍDICA","GERENCIA JURÍDICA","SI","C23222022","80111607","Prestar servicios profesionales en derecho de Publico y Constitucional, para formular estrategias, modelo y Plan de Mejora, tendientes a la disminución de acciones de tutelas y procesos judiciales en contra de la compañía, efectuando una revisión de las tutelas y procesos judiciales con el fin de identificar las causas raíces (tipologías) generadoras de las demandas y mitigar el riesgo de la entidad en términos de fallos judiciales.  ","2021-12-01",{"$f":"MONTH(G29)","v":12},"2022-01-03",12,"Invitación directa","GastosAdministrativos",228000000,228000000,"NO","N/A","Gerencia de Abastecimiento Estratégico\ncontratacion@positiva.gov.co\nPBX: (1)6502200 Ext: 10641","NO","NO","NO","NO","Pública",{"$f":"CONCATENATE(D29,\"-\",\"Tipo de información\",\" \",V29,\"-\",F29)","v":"C23222022-Tipo de información Pública-Prestar servicios profesionales en derecho de Publico y Constitucional, para formular estrategias, modelo y Plan de Mejora, tendientes a la disminución de acciones de tutelas y procesos judiciales en contra de la compañía, efectuando una revisión de las tutelas y procesos judiciales con el fin de identificar las causas raíces (tipologías) generadoras de las demandas y mitigar el riesgo de la entidad en términos de fallos judiciales.  "}]
["SECRETARIA GENERAL Y JURÍDICA","GERENCIA JURÍDICA","SI","C23202022","80111607","Prestar de servicios de profesionales para apoyar y soportar asuntos de Derecho Financiero","2021-12-01",{"$f":"MONTH(G30)","v":12},"2022-01-03",12,"Invitación directa","GastosAdministrativos",43800000,43800000,"NO","N/A","Gerencia de Abastecimiento Estratégico\ncontratacion@positiva.gov.co\nPBX: (1)6502200 Ext: 10641","NO","NO","NO","NO","Pública",{"$f":"CONCATENATE(D30,\"-\",\"Tipo de información\",\" \",V30,\"-\",F30)","v":"C23202022-Tipo de información Pública-Prestar de servicios de profesionales para apoyar y soportar asuntos de Derecho Financiero"}]
["SECRETARIA GENERAL Y JURÍDICA","GERENCIA JURÍDICA","SI","C23242022","80111607","Prestar de servicios de profesionales para apoyar y soportar asuntos de contratación estatal, derecho económico, derecho administrativo, derecho contractual y hacienda pública.","2021-12-01",{"$f":"MONTH(G31)","v":12},"2022-01-03",12,"Invitación directa","GastosAdministrativos",50000000,50000000,"NO","N/A","Gerencia de Abastecimiento Estratégico\ncontratacion@positiva.gov.co\nPBX: (1)6502200 Ext: 10641","NO","NO","NO","NO","Pública",{"$f":"CONCATENATE(D31,\"-\",\"Tipo de información\",\" \",V31,\"-\",F31)","v":"C23242022-Tipo de información Pública-Prestar de servicios de profesionales para apoyar y soportar asuntos de contratación estatal, derecho económico, derecho administrativo, derecho contractual y hacienda pública."}]
["SECRETARIA GENERAL Y JURÍDICA","GERENCIA JURÍDICA","NO","C23262022","80111607","EL CONTRATISTA, se compromete con POSITIVA COMPAÑÍA DE SEGUROS S.A., a la prestación de servicios profesionales en materia penal especializada, representación judicial y defensa de los intereses económicos de POSITIVA COMPAÑÍA DE SEGUROS SA, dentro de los procesos judiciales relacionados con la apropiación de recursos de la extinta Junta Regional de Calificación de Invalidez del Cesar y contra todas las personas que resulten involucradas.","2021-12-01",{"$f":"MONTH(G32)","v":12},"2021-04-28","INDETERMINADO","Invitación directa","GastosAdministrativos",33320000,33320000,"NO","N/A","Gerencia de Abastecimiento Estratégico\ncontratacion@positiva.gov.co\nPBX: (1)6502200 Ext: 10641","NO","NO","NO","NO","Pública",{"$f":"CONCATENATE(D32,\"-\",\"Tipo de información\",\" \",V32,\"-\",F32)","v":"C23262022-Tipo de información Pública-EL CONTRATISTA, se compromete con POSITIVA COMPAÑÍA DE SEGUROS S.A., a la prestación de servicios profesionales en materia penal especializada, representación judicial y defensa de los intereses económicos de POSITIVA COMPAÑÍA DE SEGUROS SA, dentro de los procesos judiciales relacionados con la apropiación de recursos de la extinta Junta Regional de Calificación de Invalidez del Cesar y contra todas las personas que resulten involucradas."}]
["SECRETARIA GENERAL Y JURÍDICA","GERENCIA JURÍDICA","NO","C23272022","80111607","EL CONTRATISTA prestará a favor de POSITIVA sus servicios profesionales para Representar Judicial y extrajudicialmente los intereses de la Compañía en los dos litigios iniciados por el proveedor Belisario Velásquez & Asociados en contra de la Compañía","2021-12-01",{"$f":"MONTH(G33)","v":12},"2021-06-21","INDETERMINADO","Invitación directa","GastosAdministrativos",131000000,131000000,"NO","N/A","Gerencia de Abastecimiento Estratégico\ncontratacion@positiva.gov.co\nPBX: (1)6502200 Ext: 10641","NO","NO","NO","NO","Pública",{"$f":"CONCATENATE(D33,\"-\",\"Tipo de información\",\" \",V33,\"-\",F33)","v":"C23272022-Tipo de información Pública-EL CONTRATISTA prestará a favor de POSITIVA sus servicios profesionales para Representar Judicial y extrajudicialmente los intereses de la Compañía en los dos litigios iniciados por el proveedor Belisario Velásquez & Asociados en contra de la Compañía"}]
["SECRETARIA GENERAL Y JURÍDICA","GERENCIA JURÍDICA","SI","C23182022","80111607","EL CONTRATISTA, se compromete con POSITIVA COMPAÑÍA DE SEGUROS S.A., a la Prestación de servicios profesionales para el acompañamiento jurídico, preparación de la estrategia y representación judicial y extrajudicial de los intereses de POSITIVA en la formulación de acciones administrativas y judiciales necesarias para evitar un daño antijurídico por cuenta de la invitación pública No. 003 de 2020- FOMAG.","2021-12-01",{"$f":"MONTH(G34)","v":12},"2021-09-10","INDETERMINADO","Invitación directa","GastosAdministrativos",83800000,83800000,"NO","N/A","Gerencia de Abastecimiento Estratégico\ncontratacion@positiva.gov.co\nPBX: (1)6502200 Ext: 10641","NO","NO","NO","NO","Pública",{"$f":"CONCATENATE(D34,\"-\",\"Tipo de información\",\" \",V34,\"-\",F34)","v":"C23182022-Tipo de información Pública-EL CONTRATISTA, se compromete con POSITIVA COMPAÑÍA DE SEGUROS S.A., a la Prestación de servicios profesionales para el acompañamiento jurídico, preparación de la estrategia y representación judicial y extrajudicial de los intereses de POSITIVA en la formulación de acciones administrativas y judiciales necesarias para evitar un daño antijurídico por cuenta de la invitación pública No. 003 de 2020- FOMAG."}]
["SECRETARIA GENERAL Y JURÍDICA","GERENCIA JURÍDICA","SI",null,"80111607","El CONTRATISTA, se compromete con POSITIVA COMPAÑÍA DE SEGUROS S.A., a la prestación de servicios profesionales de abogado para representar los intereses de la Compañía en los procesos judiciales asignados, así como las audiencias de conciliación judicial, prejudicial, en los procesos en que sea parte la Entidad en calidad de demandante o demandado, en las Sucursales de Arauca, Casanare, Santander y Norte de Santander. Igualmente para rendir conceptos jurídicos en las áreas especializadas a contratar y prestar la asesoría jurídica que se le solicite.","2021-12-01",{"$f":"MONTH(G35)","v":12},"2022-01-11",12,"Invitación directa","SINIESTRO",270000000,270000000,"NO","N/A","Gerencia de Abastecimiento Estratégico\ncontratacion@positiva.gov.co\nPBX: (1)6502200 Ext: 10641","NO","NO","NO","NO","Pública",{"$f":"CONCATENATE(D35,\"-\",\"Tipo de información\",\" \",V35,\"-\",F35)","v":"-Tipo de información Pública-El CONTRATISTA, se compromete con POSITIVA COMPAÑÍA DE SEGUROS S.A., a la prestación de servicios profesionales de abogado para representar los intereses de la Compañía en los procesos judiciales asignados, así como las audiencias de conciliación judicial, prejudicial, en los procesos en que sea parte la Entidad en calidad de demandante o demandado, en las Sucursales de Arauca, Casanare, Santander y Norte de Santander. Igualmente para rendir conceptos jurídicos en las áreas especializadas a contratar y prestar la asesoría jurídica que se le solicite."}]
["SECRETARIA GENERAL Y JURÍDICA","GERENCIA JURÍDICA","SI",null,"80111607","EL Adjudicatario se compromete a la prestación de servicios profesionales para brindar asesoría en la elaboración y prestación de conceptos jurídicos con ocasión de hechos relevantes para la entidad que merezcan un análisis desde el punto de vista del drecho penal, asimismo la representación júridico penal de POSITIVA COMPAÑÍA DE SEGUROS S.A., dentro de las investigaciones penales que se inicien para poner en conocimiento de las autoridades competentes presuntas conductas delictivas perpretadas en su contra","2021-12-01",{"$f":"MONTH(G36)","v":12},"2019-01-25","INDETERMINADO","Invitación directa","SINIESTRO",50000000,50000000,"NO","N/A","Gerencia de Abastecimiento Estratégico\ncontratacion@positiva.gov.co\nPBX: (1)6502200 Ext: 10641","NO","NO","NO","NO","Pública",{"$f":"CONCATENATE(D36,\"-\",\"Tipo de información\",\" \",V36,\"-\",F36)","v":"-Tipo de información Pública-EL Adjudicatario se compromete a la prestación de servicios profesionales para brindar asesoría en la elaboración y prestación de conceptos jurídicos con ocasión de hechos relevantes para la entidad que merezcan un análisis desde el punto de vista del drecho penal, asimismo la representación júridico penal de POSITIVA COMPAÑÍA DE SEGUROS S.A., dentro de las investigaciones penales que se inicien para poner en conocimiento de las autoridades competentes presuntas conductas delictivas perpretadas en su contra"}]
["SECRETARIA GENERAL Y JURÍDICA","GERENCIA JURÍDICA","SI",null,"80111607","Prestar servicios profesionales de firma de Abogados Especializados en el área de Derecho Laboral con experiencia en el manejo de las Altas Cortes y en especial La Corte Suprema de Justicia, con el propósito de ejercer el mandato judicial en defensa de los intereses de Positiva Compañía de Seguros S.A, ante las autoridades judiciales, administrativas y/o ante particulares con funciones judiciales, a nivel de la etapa de casación.","2021-12-01",{"$f":"MONTH(G37)","v":12},"2022-01-11",12,"Invitación directa","SINIESTRO",295000000,295000000,"NO","N/A","Gerencia de Abastecimiento Estratégico\ncontratacion@positiva.gov.co\nPBX: (1)6502200 Ext: 10641","NO","NO","NO","NO","Pública",{"$f":"CONCATENATE(D37,\"-\",\"Tipo de información\",\" \",V37,\"-\",F37)","v":"-Tipo de información Pública-Prestar servicios profesionales de firma de Abogados Especializados en el área de Derecho Laboral con experiencia en el manejo de las Altas Cortes y en especial La Corte Suprema de Justicia, con el propósito de ejercer el mandato judicial en defensa de los intereses de Positiva Compañía de Seguros S.A, ante las autoridades judiciales, administrativas y/o ante particulares con funciones judiciales, a nivel de la etapa de casación."}]
["SECRETARIA GENERAL Y JURÍDICA","GERENCIA JURÍDICA","SI",null,"80111607","Prestar servicios profesionales de recobro vía judicial, de las prestaciones económicas y asistenciales derivadas de Enfermedad Laboral, contra las ARL que hubieren asumido ese riesgo con anterioridad,  a prorrata del tiempo durante el cual se otorgó dicha prestación","2021-12-01",{"$f":"MONTH(G38)","v":12},"2022-01-11",12,"Invitación directa","SINIESTRO","INDETERMINADO","INDETERMINADO","NO","N/A","Gerencia de Abastecimiento Estratégico\ncontratacion@positiva.gov.co\nPBX: (1)6502200 Ext: 10641","NO","NO","NO","NO","Pública",{"$f":"CONCATENATE(D38,\"-\",\"Tipo de información\",\" \",V38,\"-\",F38)","v":"-Tipo de información Pública-Prestar servicios profesionales de recobro vía judicial, de las prestaciones económicas y asistenciales derivadas de Enfermedad Laboral, contra las ARL que hubieren asumido ese riesgo con anterioridad,  a prorrata del tiempo durante el cual se otorgó dicha prestación"}]
["SECRETARIA GENERAL Y JURÍDICA","GERENCIA JURÍDICA","NO",null,"80111607","Prestar servicios profesionales especializados en seguros y seguridad social, para la atención y representación de la Compañía en procesos judiciales en los cuales sea demandante o demandada, procesos de nulidades relativas y demás acciones que se deriven del contrato de seguros, demandas contra dictámenes de las Juntas de calificación de Invalidez, demandas por responsabilidad civil y acompañamiento mediante la emisión de conceptos jurídicos en los mismos temas.","2021-12-01",{"$f":"MONTH(G39)","v":12},"2022-01-11",12,"Invitación directa","SINIESTRO",120000000,120000000,"NO","N/A","Gerencia de Abastecimiento Estratégico\ncontratacion@positiva.gov.co\nPBX: (1)6502200 Ext: 10641","NO","NO","NO","NO","Pública",{"$f":"CONCATENATE(D39,\"-\",\"Tipo de información\",\" \",V39,\"-\",F39)","v":"-Tipo de información Pública-Prestar servicios profesionales especializados en seguros y seguridad social, para la atención y representación de la Compañía en procesos judiciales en los cuales sea demandante o demandada, procesos de nulidades relativas y demás acciones que se deriven del contrato de seguros, demandas contra dictámenes de las Juntas de calificación de Invalidez, demandas por responsabilidad civil y acompañamiento mediante la emisión de conceptos jurídicos en los mismos temas."}]
["SECRETARIA GENERAL Y JURÍDICA","GERENCIA JURÍDICA","NO ",null,"80111607","Prestar servicios profesionales de abogado especializado en derecho laboral y seguridad social o de seguros, para defender los intereses de Positiva en los procesos judiciales asignados, así como las audiencias de conciliación judicial, prejudicial y extrajudicial en los procesos en que sea parte la Entidad, en las: Sucursales de ATLÁNTICO, BOLIVAR, MAGDALENA CESAR Y GUAJIRA, CÓRDOBA, SUCRE, ANTIOQUIA Y CHOCO.  Igualmente para rendir conceptos jurídicos en las áreas especializadas a contratar y prestar la asesoría jurídica que se le solicite.","2021-12-01",{"$f":"MONTH(G40)","v":12},"2022-01-11",12,"Invitación directa","SINIESTRO",520000000,520000000,"NO","N/A","Gerencia de Abastecimiento Estratégico\ncontratacion@positiva.gov.co\nPBX: (1)6502200 Ext: 10641","NO","NO","NO","NO","Pública",{"$f":"CONCATENATE(D40,\"-\",\"Tipo de información\",\" \",V40,\"-\",F40)","v":"-Tipo de información Pública-Prestar servicios profesionales de abogado especializado en derecho laboral y seguridad social o de seguros, para defender los intereses de Positiva en los procesos judiciales asignados, así como las audiencias de conciliación judicial, prejudicial y extrajudicial en los procesos en que sea parte la Entidad, en las: Sucursales de ATLÁNTICO, BOLIVAR, MAGDALENA CESAR Y GUAJIRA, CÓRDOBA, SUCRE, ANTIOQUIA Y CHOCO.  Igualmente para rendir conceptos jurídicos en las áreas especializadas a contratar y prestar la asesoría jurídica que se le solicite."}]
["SECRETARIA GENERAL Y JURÍDICA","GERENCIA JURÍDICA","NO",null,"80111607","Prestar servicios profesionales de abogado especializado en derecho laboral y seguridad social o de seguros, para defender los intereses de Positiva en los procesos judiciales asignados, así como las audiencias de conciliación judicial, prejudicial y extrajudicial en los procesos en que sea parte la Entidad, en la Regional Occidente: Sucursales de CALDAS, RISARALDA, VALLE, NARIÑO, CAUCA, QUINDIO, ANTIOQUIA  Y CHOCÓ   Igualmente para rendir conceptos jurídicos en las áreas especializadas a contratar y prestar la asesoría jurídica que se le solicite.","2021-12-01",{"$f":"MONTH(G41)","v":12},"2022-01-11",12,"Invitación directa","SINIESTRO",490000000,490000000,"NO","N/A","Gerencia de Abastecimiento Estratégico\ncontratacion@positiva.gov.co\nPBX: (1)6502200 Ext: 10641","NO","NO","NO","NO","Pública",{"$f":"CONCATENATE(D41,\"-\",\"Tipo de información\",\" \",V41,\"-\",F41)","v":"-Tipo de información Pública-Prestar servicios profesionales de abogado especializado en derecho laboral y seguridad social o de seguros, para defender los intereses de Positiva en los procesos judiciales asignados, así como las audiencias de conciliación judicial, prejudicial y extrajudicial en los procesos en que sea parte la Entidad, en la Regional Occidente: Sucursales de CALDAS, RISARALDA, VALLE, NARIÑO, CAUCA, QUINDIO, ANTIOQUIA  Y CHOCÓ   Igualmente para rendir conceptos jurídicos en las áreas especializadas a contratar y prestar la asesoría jurídica que se le solicite."}]
["SECRETARIA GENERAL Y JURÍDICA","GERENCIA JURÍDICA","SI",null,"80111607","Prestación de servicios jurídicos profesionales de abogado para representar los intereses de la Compañía en los procesos judiciales asignado, así como las audiencias de conciliación judicial, prejudicial, en los proceso en que sea parte la Entidad en calidad de demandante o demandado, en las Sucursales de Bogotá, Cundinamarca, Boyacá y Meta.   Igualmente rendir conceptos jurídicos en las áreas especializadas a contratar y prestar la asesoría jurídica que se le solicite.  ","2021-12-01",{"$f":"MONTH(G42)","v":12},"2022-01-11",12,"Invitación directa","SINIESTRO",400000000,400000000,"NO","N/A","Gerencia de Abastecimiento Estratégico\ncontratacion@positiva.gov.co\nPBX: (1)6502200 Ext: 10641","NO","NO","NO","NO","Pública",{"$f":"CONCATENATE(D42,\"-\",\"Tipo de información\",\" \",V42,\"-\",F42)","v":"-Tipo de información Pública-Prestación de servicios jurídicos profesionales de abogado para representar los intereses de la Compañía en los procesos judiciales asignado, así como las audiencias de conciliación judicial, prejudicial, en los proceso en que sea parte la Entidad en calidad de demandante o demandado, en las Sucursales de Bogotá, Cundinamarca, Boyacá y Meta.   Igualmente rendir conceptos jurídicos en las áreas especializadas a contratar y prestar la asesoría jurídica que se le solicite.  "}]
["SECRETARIA GENERAL Y JURÍDICA","GERENCIA JURÍDICA","NO ",null,"80111607","Representar a la Compañía en procesos judiciales de carácter laboral, de seguridad social, civil, comercial o administrativa, donde sea demandada o actúe como demandante por temas de riesgos laborales o por seguros de vida; en procesos de recobros por enfermedad laboral por accidente laboral, por responsabilidad civil y determinación de multiafiliaciones a las administradoras de riesgos laborales, vía extraprocesal o judicial; en Acciones Populares y en Conciliaciones administrativas o extrajudiciales.   ","2021-12-01",{"$f":"MONTH(G43)","v":12},"2022-01-11",12,"Invitación directa","SINIESTRO","INDETERMINADO","INDETERMINADO","NO","N/A","Gerencia de Abastecimiento Estratégico\ncontratacion@positiva.gov.co\nPBX: (1)6502200 Ext: 10641","NO","NO","NO","NO","Pública",{"$f":"CONCATENATE(D43,\"-\",\"Tipo de información\",\" \",V43,\"-\",F43)","v":"-Tipo de información Pública-Representar a la Compañía en procesos judiciales de carácter laboral, de seguridad social, civil, comercial o administrativa, donde sea demandada o actúe como demandante por temas de riesgos laborales o por seguros de vida; en procesos de recobros por enfermedad laboral por accidente laboral, por responsabilidad civil y determinación de multiafiliaciones a las administradoras de riesgos laborales, vía extraprocesal o judicial; en Acciones Populares y en Conciliaciones administrativas o extrajudiciales.   "}]
["SECRETARIA GENERAL Y JURÍDICA","GERENCIA JURÍDICA","NO ",null,"80111607","El contratista se compromete a prestar servicios profesionales como firma de Abogados expertos en Gestión de cobro de cartera y recobros por mora en aportes, mediante el proceso de Cobro Coactivo a favor de Positiva Compañía de Seguros S.A. de las prestaciones asistenciales y/o económicas por mora en aportes y de los aportes a la seguridad social en riesgos laborales que le adeuden a la Compañía, según la asignación de procesos que efectúe la Gerencia Juridica.\n","2021-12-01",{"$f":"MONTH(G44)","v":12},"2022-01-03",12,"Invitación directa","CONTRA RECAUDO","INDETERMINADO","INDETERMINADO","NO","N/A","Gerencia de Abastecimiento Estratégico\ncontratacion@positiva.gov.co\nPBX: (1)6502200 Ext: 10641","NO","NO","NO","NO","Pública",{"$f":"CONCATENATE(D44,\"-\",\"Tipo de información\",\" \",V44,\"-\",F44)","v":"-Tipo de información Pública-El contratista se compromete a prestar servicios profesionales como firma de Abogados expertos en Gestión de cobro de cartera y recobros por mora en aportes, mediante el proceso de Cobro Coactivo a favor de Positiva Compañía de Seguros S.A. de las prestaciones asistenciales y/o económicas por mora en aportes y de los aportes a la seguridad social en riesgos laborales que le adeuden a la Compañía, según la asignación de procesos que efectúe la Gerencia Juridica.\n"}]
["SECRETARIA GENERAL Y JURÍDICA","GERENCIA JURÍDICA","NO ",null,"80111607","EL CONTRATISTA, se compromete con POSITIVA COMPAÑÍA DE SEGUROS S.A., a la prestación de servicios para la investigación, análisis y diagnóstico de fraudes.","2021-12-01",{"$f":"MONTH(G45)","v":12},"2022-01-15",12,"Invitación directa","SINIESTRO","INDETERMINADO","INDETERMINADO","NO","N/A","Gerencia de Abastecimiento Estratégico\ncontratacion@positiva.gov.co\nPBX: (1)6502200 Ext: 10641","NO","NO","NO","NO","Pública",{"$f":"CONCATENATE(D45,\"-\",\"Tipo de información\",\" \",V45,\"-\",F45)","v":"-Tipo de información Pública-EL CONTRATISTA, se compromete con POSITIVA COMPAÑÍA DE SEGUROS S.A., a la prestación de servicios para la investigación, análisis y diagnóstico de fraudes."}]
["SECRETARIA GENERAL Y JURÍDICA","GERENCIA JURÍDICA","SI",null,"80111607"," El contratista se compromete con Positiva Compañía de Seguros S.A. a permitir el acceso al portal de red jurista, con la generación de varios usuarios con claves individuales, con acceso interono y externo.","2021-12-01",{"$f":"MONTH(G46)","v":12},"2022-01-15",12,"Invitación directa","SINIESTRO",6000000,6000000,"NO","N/A","Gerencia de Abastecimiento Estratégico\ncontratacion@positiva.gov.co\nPBX: (1)6502200 Ext: 10641","NO","NO","NO","NO","Pública",{"$f":"CONCATENATE(D46,\"-\",\"Tipo de información\",\" \",V46,\"-\",F46)","v":"-Tipo de información Pública- El contratista se compromete con Positiva Compañía de Seguros S.A. a permitir el acceso al portal de red jurista, con la generación de varios usuarios con claves individuales, con acceso interono y externo."}]
["SECRETARIA GENERAL Y JURÍDICA","GERENCIA JURÍDICA","NO",null,"80111607","Prestar servicios profesionales de firma de Abogados Especializados en el área de Derecho Laboral y Seguridad Social, con el propósito acompañar y estructurar un plan estratégico a seguir para el cierre de casos especiales sin que superen cinco (5) mensuales, más relevantes de abuso del derecho, conforme a las necesidades de Positiva Compañía de Seguros S.A., en el cual se definirán las medias a implementar y las acciones a desarrollar.","2021-12-01",{"$f":"MONTH(G47)","v":12},"2021-09-20",16,"Invitación directa","SINIESTRO",60690000,60690000,"NO","N/A","Gerencia de Abastecimiento Estratégico\ncontratacion@positiva.gov.co\nPBX: (1)6502200 Ext: 10641","NO","NO","NO","NO","Pública",{"$f":"CONCATENATE(D47,\"-\",\"Tipo de información\",\" \",V47,\"-\",F47)","v":"-Tipo de información Pública-Prestar servicios profesionales de firma de Abogados Especializados en el área de Derecho Laboral y Seguridad Social, con el propósito acompañar y estructurar un plan estratégico a seguir para el cierre de casos especiales sin que superen cinco (5) mensuales, más relevantes de abuso del derecho, conforme a las necesidades de Positiva Compañía de Seguros S.A., en el cual se definirán las medias a implementar y las acciones a desarrollar."}]
["SECRETARIA GENERAL Y JURÍDICA","GERENCIA JURÍDICA","NO ",null,"80111607","Representar los intereses de la Compañía en los procesos judiciales asignados, ante la en la jurisdicción de lo contencioso administrativa, respecto de los medios de control de Nulidad Simple, Nulidad y Restablecimiento del Derecho, lesividad, reparación directa, controversias contractuales, repetición, ejecutivos administrativos, en los procesos en que sea parte la Entidad en calidad de demandante o demandado e igualmente en las demás especialidades tales como civil, laboral y seguridad social. ","2021-12-01",{"$f":"MONTH(G48)","v":12},"2022-01-11",12,"Invitación directa","SINIESTRO",86000000,86000000,"NO","N/A","Gerencia de Abastecimiento Estratégico\ncontratacion@positiva.gov.co\nPBX: (1)6502200 Ext: 10641","NO","NO","NO","NO","Pública",{"$f":"CONCATENATE(D48,\"-\",\"Tipo de información\",\" \",V48,\"-\",F48)","v":"-Tipo de información Pública-Representar los intereses de la Compañía en los procesos judiciales asignados, ante la en la jurisdicción de lo contencioso administrativa, respecto de los medios de control de Nulidad Simple, Nulidad y Restablecimiento del Derecho, lesividad, reparación directa, controversias contractuales, repetición, ejecutivos administrativos, en los procesos en que sea parte la Entidad en calidad de demandante o demandado e igualmente en las demás especialidades tales como civil, laboral y seguridad social. "}]
["SECRETARIA GENERAL Y JURÍDICA","GERENCIA JURÍDICA","SI",null,"80111607","Prestar servicios profesionales como abogado especializado en derecho comercial, para atender el proceso concursal de liquidación Forzosa Administrativa de la Sociedad FERTILIZANTES COLOMBIANOS S.A. FERTICOL S.A. EN LIQUIDACIÓN, en aras de cumplir con la debida defensa de los intereses de Positiva Compañía de Seguros S.A.","2021-12-01",{"$f":"MONTH(G49)","v":12},"2022-01-15","INDETERMINADO","Invitación directa","CONTRA RECAUDO","INDETERMINADO","INDETERMINADO","NO","N/A","Gerencia de Abastecimiento Estratégico\ncontratacion@positiva.gov.co\nPBX: (1)6502200 Ext: 10641","NO","NO","NO","NO","Pública",{"$f":"CONCATENATE(D49,\"-\",\"Tipo de información\",\" \",V49,\"-\",F49)","v":"-Tipo de información Pública-Prestar servicios profesionales como abogado especializado en derecho comercial, para atender el proceso concursal de liquidación Forzosa Administrativa de la Sociedad FERTILIZANTES COLOMBIANOS S.A. FERTICOL S.A. EN LIQUIDACIÓN, en aras de cumplir con la debida defensa de los intereses de Positiva Compañía de Seguros S.A."}]
["NEGOCIOS","Riesgos laborales","SI","C35022022",80141625,"Suministro de productos y/o servicios  de acuerdo con los requerimientos, cantidades y precios demandados por la compañía, para satisfacer las necesidades referentes a la entrega de incentivos a la gestión comercial","2022-01-01",{"$f":"MONTH(G50)","v":1},"2022-12-31",12.133333333333333,"Invitación directa","Gasto Administrativo",50780208,50780208,"SI","APROBADA","Gerencia de Abastecimiento Estratégico\ncontratacion@positiva.gov.co\nPBX: (1)6502200 Ext: 10641","SI","SI","SI","SI","Pública clasificada",{"$f":"CONCATENATE(D50,\"-\",\"Tipo de información\",\" \",V50,\"-\",F50)","v":"C35022022-Tipo de información Pública clasificada-Suministro de productos y/o servicios  de acuerdo con los requerimientos, cantidades y precios demandados por la compañía, para satisfacer las necesidades referentes a la entrega de incentivos a la gestión comercial"}]
["NEGOCIOS","Mercadeo y Comunicaciones","NO","C35032022\nC35212022\nC35312022\nC35322022\nC35332022\nC35342022\nC35362022\nC35372022\nC35382022","82101800, 82101701, 82101801, 82101802, 82101900, 82101901, 82101902, 82101903, 82101904, 82101905, 82110000, 82111704, 82111900, 82111801, 82111901, 82111904, 80141607, 80141611, 80141612, 80141613, 80141614, 80141616, 80141618, 80141623, 80141624, 80141625, 80141626, 80141700, 80141902, 80150000, 78102205, 14111608, 86101808, 82100000, 82101600, 80141500, 80141501, 80141509,80141600"," EL CONTRATISTA, se compromete con POSITIVA COMPAÑÍA DE SEGUROS S.A., a la prestación de servicios para la Planeación e Implementación de estrategias de mercadeo y comunicaciones, las cuales se ejecutarán por medio de las diversas actividades y disciplinas del marketing, endomarketing y comunicaciones, orientadas a fortalecer la posición de Positiva Compañía de Seguros S.A. en el mercado y al interior de la compañía, adicionalmente, gestionará investigaciones de mercado y consultorías que se requieran para la compañía.","2022-04-01",{"$f":"MONTH(G51)","v":4},"2022-12-31",9.1333333333333329,"Invitación pública","Gasto Administrativo",2454553459,2454553459,"NO",null,"Gerencia de Abastecimiento Estratégico\ncontratacion@positiva.gov.co\nPBX: (1)6502200 Ext: 10641","SI","SI","NA","SI","Pública clasificada",{"$f":"CONCATENATE(D51,\"-\",\"Tipo de información\",\" \",V51,\"-\",F51)","v":"C35032022\nC35212022\nC35312022\nC35322022\nC35332022\nC35342022\nC35362022\nC35372022\nC35382022-Tipo de información Pública clasificada- EL CONTRATISTA, se compromete con POSITIVA COMPAÑÍA DE SEGUROS S.A., a la prestación de servicios para la Planeación e Implementación de estrategias de mercadeo y comunicaciones, las cuales se ejecutarán por medio de las diversas actividades y disciplinas del marketing, endomarketing y comunicaciones, orientadas a fortalecer la posición de Positiva Compañía de Seguros S.A. en el mercado y al interior de la compañía, adicionalmente, gestionará investigaciones de mercado y consultorías que se requieran para la compañía."}]
["NEGOCIOS","Canales","NO","C35042022",86132001,"Capacitación y entrenamiento Fuerza Comercial","2022-08-01",{"$f":"MONTH(G52)","v":8},"2022-12-31",5.0666666666666664,"Invitación directa","Gasto Administrativo",46350000,46350000,"NO",null,"Gerencia de Abastecimiento Estratégico\ncontratacion@positiva.gov.co\nPBX: (1)6502200 Ext: 10641","SI","SI","NA","SI","Pública clasificada",{"$f":"CONCATENATE(D52,\"-\",\"Tipo de información\",\" \",V52,\"-\",F52)","v":"C35042022-Tipo de información Pública clasificada-Capacitación y entrenamiento Fuerza Comercial"}]
["NEGOCIOS","Canales","SI","C35052022",80141625,"Suministro de productos y/o servicios  de acuerdo con los requerimientos, cantidades y precios demandados por la compañía, para satisfacer las necesidades referentes a la entrega de incentivos a la gestión comercial","2022-01-01",{"$f":"MONTH(G53)","v":1},"2022-12-31",12.133333333333333,"Invitación directa","Gasto Administrativo",94770000,94770000,"SI","APROBADA","Gerencia de Abastecimiento Estratégico\ncontratacion@positiva.gov.co\nPBX: (1)6502200 Ext: 10641","SI","SI","SI","SI","Pública clasificada",{"$f":"CONCATENATE(D53,\"-\",\"Tipo de información\",\" \",V53,\"-\",F53)","v":"C35052022-Tipo de información Pública clasificada-Suministro de productos y/o servicios  de acuerdo con los requerimientos, cantidades y precios demandados por la compañía, para satisfacer las necesidades referentes a la entrega de incentivos a la gestión comercial"}]
["NEGOCIOS","Canales","NO","C35062022",86101804,"Prestación de Servicios, Capacitaciones virtuales para la estructura Comercial  e Intermediarios","2022-01-01",{"$f":"MONTH(G54)","v":1},"2022-12-31",12.133333333333333,"Invitación directa","Gasto Administrativo",105300000,105300000,"NO",null,"Gerencia de Abastecimiento Estratégico\ncontratacion@positiva.gov.co\nPBX: (1)6502200 Ext: 10641","SI","NO","SI","SI","Pública clasificada",{"$f":"CONCATENATE(D54,\"-\",\"Tipo de información\",\" \",V54,\"-\",F54)","v":"C35062022-Tipo de información Pública clasificada-Prestación de Servicios, Capacitaciones virtuales para la estructura Comercial  e Intermediarios"}]
["NEGOCIOS","Canales","NO","C35072022",90000000,"Prestación de Servicios - Viajes comerciales - Tiquetes","2022-01-01",{"$f":"MONTH(G55)","v":1},"2022-12-31",12.133333333333333,"Invitación cerrada","Gasto Administrativo",120000000,120000000,"SI","APROBADA","Gerencia de Abastecimiento Estratégico\ncontratacion@positiva.gov.co\nPBX: (1)6502200 Ext: 10641","SI","NO","NO","SI","Pública clasificada",{"$f":"CONCATENATE(D55,\"-\",\"Tipo de información\",\" \",V55,\"-\",F55)","v":"C35072022-Tipo de información Pública clasificada-Prestación de Servicios - Viajes comerciales - Tiquetes"}]
["NEGOCIOS","Canales","SI","C35092022",80141600,"Prestación de servicios Outsorcing de personal","2022-01-01",{"$f":"MONTH(G56)","v":1},"2022-09-30",9.0666666666666664,"Invitación directa","Gasto Administrativo",4714861730,4714861730,"SI","APROBADA","Gerencia de Abastecimiento Estratégico\ncontratacion@positiva.gov.co\nPBX: (1)6502200 Ext: 10641","SI","SI","NA","SI","Pública clasificada",{"$f":"CONCATENATE(D56,\"-\",\"Tipo de información\",\" \",V56,\"-\",F56)","v":"C35092022-Tipo de información Pública clasificada-Prestación de servicios Outsorcing de personal"}]
["NEGOCIOS","Canales","SI","C35122022",43232303,"Prestación de servicios para la habilitación de suscripción Salesforce.com, Marketing Cloud, así como los Servicios de Soporte Tecnológico y capacitación funcional.","2022-01-01",{"$f":"MONTH(G57)","v":1},"2022-12-31",12.133333333333333,"Invitación directa","Gasto Administrativo",670146211,670146211,"SI","APROBADA","Gerencia de Abastecimiento Estratégico\ncontratacion@positiva.gov.co\nPBX: (1)6502200 Ext: 10641","SI","SI","SI","SI","Pública clasificada",{"$f":"CONCATENATE(D57,\"-\",\"Tipo de información\",\" \",V57,\"-\",F57)","v":"C35122022-Tipo de información Pública clasificada-Prestación de servicios para la habilitación de suscripción Salesforce.com, Marketing Cloud, así como los Servicios de Soporte Tecnológico y capacitación funcional."}]
["NEGOCIOS","Canales","SI","C35132022",80141500,"Adquisición de estudio de la calidad del servicio de las ARL","2022-01-29",{"$f":"MONTH(G58)","v":1},"2022-06-30",5.0666666666666664,"Invitación directa","Gasto Administrativo",14648953,14648953,"SI","APROBADA","Gerencia de Abastecimiento Estratégico\ncontratacion@positiva.gov.co\nPBX: (1)6502200 Ext: 10641","SI","SI","NA","SI","Pública clasificada",{"$f":"CONCATENATE(D58,\"-\",\"Tipo de información\",\" \",V58,\"-\",F58)","v":"C35132022-Tipo de información Pública clasificada-Adquisición de estudio de la calidad del servicio de las ARL"}]
["NEGOCIOS","Canales","NO","C35142022",80141500,"Contratar los servicios de una agencia de investigación de mercado,  para realizar investigaciones que permitan recolectar información de interés para la compañía","2022-07-01",{"$f":"MONTH(G59)","v":7},"2022-12-31",6.1,"Invitación directa","Gasto Administrativo",14197005,14197005,"NO",null,"Gerencia de Abastecimiento Estratégico\ncontratacion@positiva.gov.co\nPBX: (1)6502200 Ext: 10641","SI","SI","NA","NO","Pública",{"$f":"CONCATENATE(D59,\"-\",\"Tipo de información\",\" \",V59,\"-\",F59)","v":"C35142022-Tipo de información Pública-Contratar los servicios de una agencia de investigación de mercado,  para realizar investigaciones que permitan recolectar información de interés para la compañía"}]
["NEGOCIOS","Canales","NO","C35152022","82101800, 82101701, 82101801, 82101802, 82101900, 82101901, 82101902, 82101903, 82101904, 82101905, 82110000, 82111704, 82111900, 82111801, 82111901, 82111904, 80141607, 80141611, 80141612, 80141613, 80141614, 80141616, 80141618, 80141623, 80141624, 80141625, 80141626, 80141700, 80141902, 80150000, 78102205, 14111608, 86101808, 82100000, 82101600, 80141500, 80141501, 80141509,80141600","Prestación de servicios para la Planeación e Implementación  de estrategias de mercadeo y comunicaciones, las cuales se ejecutarán por medio de las diversas actividades y disciplinas de marketing, endomarketing y comunicaciones, orientadas a fortalecer la posición de Positiva Compañía de Seguros en el mercado y al interior de la compañía","2022-07-01",{"$f":"MONTH(G60)","v":7},"2022-12-31",6.1,"Invitación directa","Gasto Administrativo",126360000,126360000,"NO",null,"Gerencia de Abastecimiento Estratégico\ncontratacion@positiva.gov.co\nPBX: (1)6502200 Ext: 10641","SI","SI","NA","SI","Pública clasificada",{"$f":"CONCATENATE(D60,\"-\",\"Tipo de información\",\" \",V60,\"-\",F60)","v":"C35152022-Tipo de información Pública clasificada-Prestación de servicios para la Planeación e Implementación  de estrategias de mercadeo y comunicaciones, las cuales se ejecutarán por medio de las diversas actividades y disciplinas de marketing, endomarketing y comunicaciones, orientadas a fortalecer la posición de Positiva Compañía de Seguros en el mercado y al interior de la compañía"}]
["NEGOCIOS","Canales","NO","C35162022",80141607,"Prestación de servicios Plan de Formación","2022-09-01",{"$f":"MONTH(G61)","v":9},"2022-10-31",2,"Invitación directa","Gasto Administrativo",835295884,835295884,"NO",null,"Gerencia de Abastecimiento Estratégico\ncontratacion@positiva.gov.co\nPBX: (1)6502200 Ext: 10641","NO","SI","NA","SI","Pública clasificada",{"$f":"CONCATENATE(D61,\"-\",\"Tipo de información\",\" \",V61,\"-\",F61)","v":"C35162022-Tipo de información Pública clasificada-Prestación de servicios Plan de Formación"}]
["NEGOCIOS","Canales","SI","C35172022",14111608,"Suministro de reconocimientos e Incentivos para la fuerza comercial","2022-01-01",{"$f":"MONTH(G62)","v":1},"2022-12-31",12.133333333333333,"Invitación directa","Gasto Administrativo",47385000,47385000,"SI","APROBADA","Gerencia de Abastecimiento Estratégico\ncontratacion@positiva.gov.co\nPBX: (1)6502200 Ext: 10641","NO","SI","NA","N/A","Pública",{"$f":"CONCATENATE(D62,\"-\",\"Tipo de información\",\" \",V62,\"-\",F62)","v":"C35172022-Tipo de información Pública-Suministro de reconocimientos e Incentivos para la fuerza comercial"}]
["NEGOCIOS","Experiencia del cliente","NO","C35222022",86101804,"Prestación de Servicios / Desarrollar el Programa de Educación Financiera  dirigido a los trabajadores de las empresas afiliadas a Riesgos Laborales, Tomadores de Pólizas de Vida y de otros  ramos y/o Clientes potenciales, proveedores, intermediarios y Usuarios en general a través de webinars, talleres y/o conferencias presenciales y/o virtuales, generación de piezas y contenidos para el programa, utilizando el contenido y la metodología definida por POSITIVA.","2022-01-25",{"$f":"MONTH(G63)","v":1},"2022-12-31",11.333333333333334,"Invitación cerrada","Gasto Administrativo",96760170,96760170,"SI","APROBADA","Gerencia de Abastecimiento Estratégico\ncontratacion@positiva.gov.co\nPBX: (1)6502200 Ext: 10641","NO","SI","NA","NO","Pública",{"$f":"CONCATENATE(D63,\"-\",\"Tipo de información\",\" \",V63,\"-\",F63)","v":"C35222022-Tipo de información Pública-Prestación de Servicios / Desarrollar el Programa de Educación Financiera  dirigido a los trabajadores de las empresas afiliadas a Riesgos Laborales, Tomadores de Pólizas de Vida y de otros  ramos y/o Clientes potenciales, proveedores, intermediarios y Usuarios en general a través de webinars, talleres y/o conferencias presenciales y/o virtuales, generación de piezas y contenidos para el programa, utilizando el contenido y la metodología definida por POSITIVA."}]
["NEGOCIOS","Experiencia del cliente","NO","C35232022",81131504,"Prestación de Servicios / Medición de Satisfacción y Experiencia con los productos y servicios que ofrece Positiva Compañía de Seguros S.A. dirigida a Clientes, Empresas Ramo RL, Tomadores de Póliza Seguros de Vida, Intermediarios y Proveedores.","2022-09-01",{"$f":"MONTH(G64)","v":9},"2022-12-31",4.0333333333333332,"Invitación cerrada","Gasto Administrativo",329790913,329790913,"NO",null,"Gerencia de Abastecimiento Estratégico\ncontratacion@positiva.gov.co\nPBX: (1)6502200 Ext: 10641","NO","SI","NA","SI","Pública clasificada",{"$f":"CONCATENATE(D64,\"-\",\"Tipo de información\",\" \",V64,\"-\",F64)","v":"C35232022-Tipo de información Pública clasificada-Prestación de Servicios / Medición de Satisfacción y Experiencia con los productos y servicios que ofrece Positiva Compañía de Seguros S.A. dirigida a Clientes, Empresas Ramo RL, Tomadores de Póliza Seguros de Vida, Intermediarios y Proveedores."}]
["NEGOCIOS","Experiencia del cliente","SI","C35252022",80141600,"Prestación de servicios Outsorcing de personal","2022-01-01",{"$f":"MONTH(G65)","v":1},"2022-12-31",12.133333333333333,"Invitación directa","Gasto Administrativo",285138270,285138270,"SI","APROBADA","Gerencia de Abastecimiento Estratégico\ncontratacion@positiva.gov.co\nPBX: (1)6502200 Ext: 10641","SI","SI","NA","SI","Pública clasificada",{"$f":"CONCATENATE(D65,\"-\",\"Tipo de información\",\" \",V65,\"-\",F65)","v":"C35252022-Tipo de información Pública clasificada-Prestación de servicios Outsorcing de personal"}]
["NEGOCIOS","Experiencia del cliente","NO","C35272022",80111616,"Prestación de Servicios / Contar con el Defensor del Consumidor Financiero","2022-07-01",{"$f":"MONTH(G66)","v":7},"2022-12-31",6.1,"Invitación directa","Gasto Administrativo",78276664,78276664,"SI","APROBADA","Gerencia de Abastecimiento Estratégico\ncontratacion@positiva.gov.co\nPBX: (1)6502200 Ext: 10641","NO","SI","NA","NO","Pública",{"$f":"CONCATENATE(D66,\"-\",\"Tipo de información\",\" \",V66,\"-\",F66)","v":"C35272022-Tipo de información Pública-Prestación de Servicios / Contar con el Defensor del Consumidor Financiero"}]
["NEGOCIOS","Experiencia del cliente","NO","C35292022",14111608,"Prestación de Servicios / Contar con un Programa de Fidelización y Experiencia en los diferentes momentos de verdad","2022-08-01",{"$f":"MONTH(G67)","v":8},"2022-12-31",5.0666666666666664,"Invitación directa","Gasto Administrativo",53560000,53560000,"NO",null,"Gerencia de Abastecimiento Estratégico\ncontratacion@positiva.gov.co\nPBX: (1)6502200 Ext: 10641","NO","SI","NA","SI","Pública clasificada",{"$f":"CONCATENATE(D67,\"-\",\"Tipo de información\",\" \",V67,\"-\",F67)","v":"C35292022-Tipo de información Pública clasificada-Prestación de Servicios / Contar con un Programa de Fidelización y Experiencia en los diferentes momentos de verdad"}]
["NEGOCIOS","Experiencia del cliente","NO","C35302022",81131504,"Prestación de Servicios / Realizar Medición de Satisfacción y Experiencia en tiempo real","2022-08-01",{"$f":"MONTH(G68)","v":8},"2022-12-31",5.0666666666666664,"Invitación directa","Gasto Administrativo",40224848,40224848,"NO",null,"Gerencia de Abastecimiento Estratégico\ncontratacion@positiva.gov.co\nPBX: (1)6502200 Ext: 10641","NO","SI","NA","SI","Pública clasificada",{"$f":"CONCATENATE(D68,\"-\",\"Tipo de información\",\" \",V68,\"-\",F68)","v":"C35302022-Tipo de información Pública clasificada-Prestación de Servicios / Realizar Medición de Satisfacción y Experiencia en tiempo real"}]
["NEGOCIOS","Vida","NO","C35392022",82101500,"Renovación póliza Magisterio contratada por intermedio de LYM","2022-07-01",{"$f":"MONTH(G69)","v":7},"2022-12-31",6.1,"Invitación directa","Gasto Administrativo",15774450,15774450,"NO",null,"Gerencia de Abastecimiento Estratégico\ncontratacion@positiva.gov.co\nPBX: (1)6502200 Ext: 10641","SI","SI","NA","SI","Pública clasificada",{"$f":"CONCATENATE(D69,\"-\",\"Tipo de información\",\" \",V69,\"-\",F69)","v":"C35392022-Tipo de información Pública clasificada-Renovación póliza Magisterio contratada por intermedio de LYM"}]
["NEGOCIOS","Vida","NO","C35402022",82101500,"Impresión papelería negocios renovados para fideliza los clientes de Positiva","2022-07-01",{"$f":"MONTH(G70)","v":7},"2022-12-31",6.1,"Invitación directa","Gasto Administrativo",20420000,20420000,"NO",null,"Gerencia de Abastecimiento Estratégico\ncontratacion@positiva.gov.co\nPBX: (1)6502200 Ext: 10641","NO","SI","NA","SI","Pública clasificada",{"$f":"CONCATENATE(D70,\"-\",\"Tipo de información\",\" \",V70,\"-\",F70)","v":"C35402022-Tipo de información Pública clasificada-Impresión papelería negocios renovados para fideliza los clientes de Positiva"}]
["NEGOCIOS","Vida","NO","C35422022","80141600, 80141606, 80141613","Prestación de servicios de Promoción y Prevención para implementar, mejorar y/o mantener actividades de asesoría, asistencia técnica y de formación en Seguridad y Salud en el Trabajo, del Plan Básico en los programas (Estructura Empresarial, Preparación y Atención de Emergencias, Promoción y Prevención en Salud, Protección Colectiva e individual), Plan Avanzado en los Programas (Gestión de Incidentes y accidentes de Trabajo, Gestión de enfermedad laboral), Plan Especializado (Programa de Vigilancia Epidemiológica), Plan Gestión Integral (Sistemas integrados de Gestión) de la estrategia CREA del modelo de gestión POSITIVA SUMA, de acuerdo a los planes de trabajo pactados con las empresas y cargados en el aplicativo GESTPOS, para empresas afiliadas a Positiva Compañía de Seguros Sucursales Antioquia y Chocó. /  Actividades de formación en prevención de accidentes, para estudiantes  de las  empresas clientes, de Seguros de Vida, especialmente MUNICIPIO DE MEDELLÍN y la empresa ITM de la Sucursal Antioquia de la Zona Antioquia","2022-09-01",{"$f":"MONTH(G71)","v":9},"2022-12-31",4.0333333333333332,"Invitación directa","Gasto Administrativo",122346654,122346654,"NO",null,"Gerencia de Abastecimiento Estratégico\ncontratacion@positiva.gov.co\nPBX: (1)6502200 Ext: 10641","SI","SI","NA","SI","Pública clasificada",{"$f":"CONCATENATE(D71,\"-\",\"Tipo de información\",\" \",V71,\"-\",F71)","v":"C35422022-Tipo de información Pública clasificada-Prestación de servicios de Promoción y Prevención para implementar, mejorar y/o mantener actividades de asesoría, asistencia técnica y de formación en Seguridad y Salud en el Trabajo, del Plan Básico en los programas (Estructura Empresarial, Preparación y Atención de Emergencias, Promoción y Prevención en Salud, Protección Colectiva e individual), Plan Avanzado en los Programas (Gestión de Incidentes y accidentes de Trabajo, Gestión de enfermedad laboral), Plan Especializado (Programa de Vigilancia Epidemiológica), Plan Gestión Integral (Sistemas integrados de Gestión) de la estrategia CREA del modelo de gestión POSITIVA SUMA, de acuerdo a los planes de trabajo pactados con las empresas y cargados en el aplicativo GESTPOS, para empresas afiliadas a Positiva Compañía de Seguros Sucursales Antioquia y Chocó. /  Actividades de formación en prevención de accidentes, para estudiantes  de las  empresas clientes, de Seguros de Vida, especialmente MUNICIPIO DE MEDELLÍN y la empresa ITM de la Sucursal Antioquia de la Zona Antioquia"}]
["NEGOCIOS","Vida","NO","C35442022",14111608,"Incentivar la gestión comercial a partir del cumplimientos de metas","2022-01-18",{"$f":"MONTH(G72)","v":1},"2022-12-31",11.566666666666666,"Invitación directa","Gasto Administrativo",126212433,126212433,"NO",null,"Gerencia de Abastecimiento Estratégico\ncontratacion@positiva.gov.co\nPBX: (1)6502200 Ext: 10641","NO","SI","NA","SI","Pública clasificada",{"$f":"CONCATENATE(D72,\"-\",\"Tipo de información\",\" \",V72,\"-\",F72)","v":"C35442022-Tipo de información Pública clasificada-Incentivar la gestión comercial a partir del cumplimientos de metas"}]
["NEGOCIOS","Vida","NO","C35452022","14111514- 55101509","Suministro de material impreso para  la divulgación de  mensajes  de promoción  y prevención de  accidentes  en  la  póliza  de Accidentes  Personales de  la   Universidad Nacional","2022-07-01",{"$f":"MONTH(G73)","v":7},"2022-12-31",6.1,"Invitación directa","Gasto Administrativo",84380346,84380346,"NO",null,"Gerencia de Abastecimiento Estratégico\ncontratacion@positiva.gov.co\nPBX: (1)6502200 Ext: 10641","SI","SI","NA","SI","Pública clasificada",{"$f":"CONCATENATE(D73,\"-\",\"Tipo de información\",\" \",V73,\"-\",F73)","v":"C35452022-Tipo de información Pública clasificada-Suministro de material impreso para  la divulgación de  mensajes  de promoción  y prevención de  accidentes  en  la  póliza  de Accidentes  Personales de  la   Universidad Nacional"}]
["NEGOCIOS","Vida","NO","C35462022","83121700-83121703-82101903","Manejo de  redes  sociales de  la  Universidad Nacional  que  incluyen campañas  para controlar la  accidentalidad y prevención, vida saludable, valores y actividades","2022-01-18",{"$f":"MONTH(G74)","v":1},"2022-12-31",11.566666666666666,"Invitación directa","Gasto Administrativo",66000000,66000000,"NO",null,"Gerencia de Abastecimiento Estratégico\ncontratacion@positiva.gov.co\nPBX: (1)6502200 Ext: 10641","SI","SI","NA","SI","Pública clasificada",{"$f":"CONCATENATE(D74,\"-\",\"Tipo de información\",\" \",V74,\"-\",F74)","v":"C35462022-Tipo de información Pública clasificada-Manejo de  redes  sociales de  la  Universidad Nacional  que  incluyen campañas  para controlar la  accidentalidad y prevención, vida saludable, valores y actividades"}]
["NEGOCIOS","Vida","NO","C35482022","24141704, 821215","Material impreso compromiso comercial Banco Agrario Licitacion Pública  No  (No. SEG2021–01-DG )","2022-01-18",{"$f":"MONTH(G75)","v":1},"2022-12-31",11.566666666666666,"Invitación directa","Gasto Administrativo",300000000,300000000,"NO",null,"Gerencia de Abastecimiento Estratégico\ncontratacion@positiva.gov.co\nPBX: (1)6502200 Ext: 10641","NO","SI","NA","SI","Pública clasificada",{"$f":"CONCATENATE(D75,\"-\",\"Tipo de información\",\" \",V75,\"-\",F75)","v":"C35482022-Tipo de información Pública clasificada-Material impreso compromiso comercial Banco Agrario Licitacion Pública  No  (No. SEG2021–01-DG )"}]
["Operaciones","Gcia. Recaudo y Cartera","NO","C450142022","80121610","\"Prestación de Servicios de gestion de cobro en etapa persuasiva y prejuridica de firmas externas para Cartera ARL, y recobros por Mora a la Fecha del evento por GESTION DE COBRANZA CARTERA APORTES CONCILIACION\"","2022-06-01",{"$f":"MONTH(G76)","v":6},"2023-05-31",12,"Invitación directa","GastosAdministrativos",5064905235,2351496667,"SI",null,"Gerencia de Abastecimiento Estratégico\ncontratacion@positiva.gov.co\nPBX: (1)6502200 Ext: 10641","SI","SI","NO","SI",{"$f":"IF(U76=\"SI\",\"Pública clasificada\",\"Pública\")","v":"Pública clasificada"},{"$f":"CONCATENATE(D76,\"-\",\"Tipo de información\",\" \",V76,\"-\",F76)","v":"C450142022-Tipo de información Pública clasificada-\"Prestación de Servicios de gestion de cobro en etapa persuasiva y prejuridica de firmas externas para Cartera ARL, y recobros por Mora a la Fecha del evento por GESTION DE COBRANZA CARTERA APORTES CONCILIACION\""}]
["Operaciones","Gcia. Recaudo y Cartera","NO","C450152022","80121610","\"Prestación de Servicios de gestion de cobro en etapa persuasiva y prejuridica de firmas externas para Cartera ARL, y recobros por Mora a la Fecha del evento por GESTION DE COBRANZA CARTERA APORTES CONCILIACION\"","2022-06-01",{"$f":"MONTH(G77)","v":6},"2023-05-31",12,"Invitación directa","GastosAdministrativos",{"$f":"+N77*2","v":3966000000},1983000000,"SI",null,"Gerencia de Abastecimiento Estratégico\ncontratacion@positiva.gov.co\nPBX: (1)6502200 Ext: 10641","SI","SI","NO","SI","Pública clasificada",{"$f":"CONCATENATE(D77,\"-\",\"Tipo de información\",\" \",V77,\"-\",F77)","v":"C450152022-Tipo de información Pública clasificada-\"Prestación de Servicios de gestion de cobro en etapa persuasiva y prejuridica de firmas externas para Cartera ARL, y recobros por Mora a la Fecha del evento por GESTION DE COBRANZA CARTERA APORTES CONCILIACION\""}]
["Operaciones","Gcia. Recaudo y Cartera","NO","C450162022","80121610","Prestación de Servicios de gestion servicios de gestion de cobro de cartera RAMO DE PERSONAS","2022-06-01",{"$f":"MONTH(G78)","v":6},"2023-05-31",12,"Invitación directa","GastosAdministrativos",101363889,44982000,"SI",null,"Gerencia de Abastecimiento Estratégico\ncontratacion@positiva.gov.co\nPBX: (1)6502200 Ext: 10641","SI","SI","NO","SI","Pública clasificada",{"$f":"CONCATENATE(D78,\"-\",\"Tipo de información\",\" \",V78,\"-\",F78)","v":"C450162022-Tipo de información Pública clasificada-Prestación de Servicios de gestion servicios de gestion de cobro de cartera RAMO DE PERSONAS"}]
["Operaciones","Gcia. Recaudo y Cartera","NO","C450172022","80121610","Administrador de Cartera","2022-10-01",{"$f":"MONTH(G79)","v":10},"2023-09-30",12,"Invitación directa","GastosAdministrativos",200000000,50000000,"SI",null,"Gerencia de Abastecimiento Estratégico\ncontratacion@positiva.gov.co\nPBX: (1)6502200 Ext: 10641","SI","SI","NO","SI","Pública clasificada",{"$f":"CONCATENATE(D79,\"-\",\"Tipo de información\",\" \",V79,\"-\",F79)","v":"C450172022-Tipo de información Pública clasificada-Administrador de Cartera"}]
["Operaciones","Gcia. Recaudo y Cartera","SI","NA","80121610","Prestación de Servicios de Compra de registros al operador de información  por datos Seguridad social sistema de Riesgos laborales.","2022-07-01",{"$f":"MONTH(G80)","v":7},"2023-06-30",12,"Invitación directa","GastosAdministrativos",10338491160,4894215765,"NO",null,"Gerencia de Abastecimiento Estratégico\ncontratacion@positiva.gov.co\nPBX: (1)6502200 Ext: 10641","SI","SI","NO","SI","Pública clasificada",{"$f":"CONCATENATE(D80,\"-\",\"Tipo de información\",\" \",V80,\"-\",F80)","v":"NA-Tipo de información Pública clasificada-Prestación de Servicios de Compra de registros al operador de información  por datos Seguridad social sistema de Riesgos laborales."}]
["Operaciones","Gcia. Recaudo y Cartera","SI","NA","80121610","Prestación de Servicios de Compra de registros al operador de información  por datos Seguridad social sistema de Riesgos laborales.","2022-07-01",{"$f":"MONTH(G81)","v":7},"2023-06-30",12,"Invitación directa","GastosAdministrativos",{"$f":"+N81","v":290889369},290889369,"NO",null,"Gerencia de Abastecimiento Estratégico\ncontratacion@positiva.gov.co\nPBX: (1)6502200 Ext: 10641","SI","SI","NO","SI","Pública clasificada",{"$f":"CONCATENATE(D81,\"-\",\"Tipo de información\",\" \",V81,\"-\",F81)","v":"NA-Tipo de información Pública clasificada-Prestación de Servicios de Compra de registros al operador de información  por datos Seguridad social sistema de Riesgos laborales."}]
["Operaciones","Gcia. Recaudo y Cartera","SI","C45122022","80121610","Prestar sus servicios profesionales a la Gerencia de Recaudo y Cartera de POSITIVA en la revisión y conciliación de la información registrada en los diferentes aplicativos de los procesos de recaudo, cartera y liquidación de comisiones a fin de identificar inconsistencias y realizar los ajustes a que haya lugar; así como a apoyar en la legalización y reporte de los saldos pendientes por recuperar y/o los saldos pendientes por pagar en las cuentas corrientes de los intermediarios.","2022-01-01",{"$f":"MONTH(G82)","v":1},"2022-12-31",12,"Invitación directa","GastosAdministrativos",{"$f":"+N82","v":124032074},124032074,"NO",null,"Gerencia de Abastecimiento Estratégico\ncontratacion@positiva.gov.co\nPBX: (1)6502200 Ext: 10641","SI","SI","NO","SI","Pública clasificada",{"$f":"CONCATENATE(D82,\"-\",\"Tipo de información\",\" \",V82,\"-\",F82)","v":"C45122022-Tipo de información Pública clasificada-Prestar sus servicios profesionales a la Gerencia de Recaudo y Cartera de POSITIVA en la revisión y conciliación de la información registrada en los diferentes aplicativos de los procesos de recaudo, cartera y liquidación de comisiones a fin de identificar inconsistencias y realizar los ajustes a que haya lugar; así como a apoyar en la legalización y reporte de los saldos pendientes por recuperar y/o los saldos pendientes por pagar en las cuentas corrientes de los intermediarios."}]
["Operaciones","Gcia. Recaudo y Cartera","SI","C45092022","80121610","Prestar sus servicios profesionales a la Gerencia de Recaudo y Cartera de POSITIVA en la revisión y conciliación de la información registrada en los diferentes aplicativos de los procesos de recaudo, cartera y liquidación de comisiones a fin de identificar inconsistencias y realizar los ajustes a que haya lugar; así como a apoyar en la legalización y reporte de los saldos pendientes por recuperar y/o los saldos pendientes por pagar en las cuentas corrientes de los intermediarios.","2022-01-01",{"$f":"MONTH(G83)","v":1},"2022-12-31",12,"Invitación directa","GastosAdministrativos",124032074,124032074,"NO",null,"Gerencia de Abastecimiento Estratégico\ncontratacion@positiva.gov.co\nPBX: (1)6502200 Ext: 10641","SI","SI","NO","SI","Pública clasificada",{"$f":"CONCATENATE(D83,\"-\",\"Tipo de información\",\" \",V83,\"-\",F83)","v":"C45092022-Tipo de información Pública clasificada-Prestar sus servicios profesionales a la Gerencia de Recaudo y Cartera de POSITIVA en la revisión y conciliación de la información registrada en los diferentes aplicativos de los procesos de recaudo, cartera y liquidación de comisiones a fin de identificar inconsistencias y realizar los ajustes a que haya lugar; así como a apoyar en la legalización y reporte de los saldos pendientes por recuperar y/o los saldos pendientes por pagar en las cuentas corrientes de los intermediarios."}]
["Operaciones","Gcia. Recaudo y Cartera","SI","C45102022","80121610","Prestar servicios a la Gerencia de Afiliaciones y Novedades y a la Gerencia de Recaudo y Cartera de la Vicepresidencia de Operaciones de POSITIVA S.A en los asuntos administrativos que les competan en materia de afiliaciones, novedades, recaudos, cartera y recobros, así como en los temas específicos de naturaleza análoga que requiera directamente la Vicepresidencia de Operaciones.","2022-01-01",{"$f":"MONTH(G84)","v":1},"2022-12-31",12,"Invitación directa","GastosAdministrativos",150790197,150790197,"NO",null,"Gerencia de Abastecimiento Estratégico\ncontratacion@positiva.gov.co\nPBX: (1)6502200 Ext: 10641","SI","SI","NO","SI","Pública clasificada",{"$f":"CONCATENATE(D84,\"-\",\"Tipo de información\",\" \",V84,\"-\",F84)","v":"C45102022-Tipo de información Pública clasificada-Prestar servicios a la Gerencia de Afiliaciones y Novedades y a la Gerencia de Recaudo y Cartera de la Vicepresidencia de Operaciones de POSITIVA S.A en los asuntos administrativos que les competan en materia de afiliaciones, novedades, recaudos, cartera y recobros, así como en los temas específicos de naturaleza análoga que requiera directamente la Vicepresidencia de Operaciones."}]
["Operaciones","Gcia. Afiliaciones y Novedades","SI","C45112022","80121610","Prestar sus servicios a la Gerencia de Afiliaciones y Novedades en la revisión, validación, conciliación y gestión de los procesos de mantenimiento de pólizas de los ramos de vida individual y colectivo.","2022-01-01",{"$f":"MONTH(G85)","v":1},"2022-12-31",12,"Invitación directa","GastosAdministrativos",52507822,52507822,"NO",null,"Gerencia de Abastecimiento Estratégico\ncontratacion@positiva.gov.co\nPBX: (1)6502200 Ext: 10641","SI","SI","NO","SI","Pública clasificada",{"$f":"CONCATENATE(D85,\"-\",\"Tipo de información\",\" \",V85,\"-\",F85)","v":"C45112022-Tipo de información Pública clasificada-Prestar sus servicios a la Gerencia de Afiliaciones y Novedades en la revisión, validación, conciliación y gestión de los procesos de mantenimiento de pólizas de los ramos de vida individual y colectivo."}]
["Operaciones","Vicepresidencia de operaciones","NO","C450182022","80121610","\"Prestación de servicios de Contact Center de acuerdo a las políticas, normas y características definidas por POSITIVA COMPAÑÍA DE SEGUROS S.A., para ofrecer un soporte integral de información de la compañía, a los afiliados a Riesgos laborales, diferentes ramos de pólizas de vida: vida individual, accidentes personales, vida grupo, exequias, desempleo, planes de salud, rentas vitalicias, conmutaciones pensionales, BEPS y, a los otros ramos que sean autorizados a la compañía  y a los ciudadanos en general; con el objetivo permanente de brindar una información completa y satisfactoria en primer contacto a cada una de las solicitudes, agregando valor a los asegurados y ciudadanos.\"","2022-12-01",{"$f":"MONTH(G86)","v":12},"2023-11-30",12,"Invitación directa","GastosAdministrativos",400000000,400000000,"NO",null,"Gerencia de Abastecimiento Estratégico\ncontratacion@positiva.gov.co\nPBX: (1)6502200 Ext: 10641","SI","SI","NO","SI","Pública clasificada",{"$f":"CONCATENATE(D86,\"-\",\"Tipo de información\",\" \",V86,\"-\",F86)","v":"C450182022-Tipo de información Pública clasificada-\"Prestación de servicios de Contact Center de acuerdo a las políticas, normas y características definidas por POSITIVA COMPAÑÍA DE SEGUROS S.A., para ofrecer un soporte integral de información de la compañía, a los afiliados a Riesgos laborales, diferentes ramos de pólizas de vida: vida individual, accidentes personales, vida grupo, exequias, desempleo, planes de salud, rentas vitalicias, conmutaciones pensionales, BEPS y, a los otros ramos que sean autorizados a la compañía  y a los ciudadanos en general; con el objetivo permanente de brindar una información completa y satisfactoria en primer contacto a cada una de las solicitudes, agregando valor a los asegurados y ciudadanos.\""}]
["SECRETARIA GENERAL Y JURÍDICA","Oficina Gestión Integral de Riesgos ","No","C00022022",80101510,"Capacitación Proveedores en cumplimiento de requisitos de normas relacionadas con la capacitación de proveedores que ejecutan funciones de la compañía","2022-09-01",{"$f":"MONTH(G87)","v":9},"2022-12-31",4,"Invitación directa","GastosAdministrativos",21887599.466699999,21887599.466699999,"No","N/A","Gerencia de Abastecimiento Estratégico\ncontratacion@positiva.gov.co\nPBX: (1)6502200 Ext: 10641","NO","NO","NO","NO",{"$f":"IF(U87=\"SI\",\"Pública clasificada\",\"Pública\")","v":"Pública"},{"$f":"CONCATENATE(D87,\"-\",\"Tipo de información\",\" \",V87,\"-\",F87)","v":"C00022022-Tipo de información Pública-Capacitación Proveedores en cumplimiento de requisitos de normas relacionadas con la capacitación de proveedores que ejecutan funciones de la compañía"}]
["SECRETARIA GENERAL Y JURÍDICA","Oficina Gestión Integral de Riesgos ","No","C00032022",81112201,"Prestar servicios de soporte y mantenimiento de la herramienta ERA (ENTREPRISE RISK ASESSOR) que soporta la gestión de riesgos de la Oficina de Gestión Integral Riesgos.","2022-01-01",{"$f":"MONTH(G88)","v":1},"2022-07-31",7,"Invitación directa","GastosAdministrativos",9736637.2816020008,9736637.2816020008,"No","N/A","Gerencia de Abastecimiento Estratégico\ncontratacion@positiva.gov.co\nPBX: (1)6502200 Ext: 10641","NO","NO","NO","NO",{"$f":"IF(U88=\"SI\",\"Pública clasificada\",\"Pública\")","v":"Pública"},{"$f":"CONCATENATE(D88,\"-\",\"Tipo de información\",\" \",V88,\"-\",F88)","v":"C00032022-Tipo de información Pública-Prestar servicios de soporte y mantenimiento de la herramienta ERA (ENTREPRISE RISK ASESSOR) que soporta la gestión de riesgos de la Oficina de Gestión Integral Riesgos."}]
["SECRETARIA GENERAL Y JURÍDICA","Oficina Gestión Integral de Riesgos ","No","C00052022",43232300,"Investigaciones externas o internas relacionadas con LAFT, consultas en centrales de riesgo y busqueda de informacion acerca de cliente, proveedores, funcionarios y quienes correspondan.","2022-01-01",{"$f":"MONTH(G89)","v":1},"2022-12-31",12,"Invitación directa","GastosAdministrativos",9520889.8059,9520889.8059,"No","N/A","Gerencia de Abastecimiento Estratégico\ncontratacion@positiva.gov.co\nPBX: (1)6502200 Ext: 10641","NO","NO","NO","NO",{"$f":"IF(U89=\"SI\",\"Pública clasificada\",\"Pública\")","v":"Pública"},{"$f":"CONCATENATE(D89,\"-\",\"Tipo de información\",\" \",V89,\"-\",F89)","v":"C00052022-Tipo de información Pública-Investigaciones externas o internas relacionadas con LAFT, consultas en centrales de riesgo y busqueda de informacion acerca de cliente, proveedores, funcionarios y quienes correspondan."}]
["SECRETARIA GENERAL Y JURÍDICA","Oficina Gestión Integral de Riesgos ","No","C00042022",43232300,"Investigaciones externas o internas acerca de casos de fraude y/o corrupcion presentados en la entidad","2022-01-01",{"$f":"MONTH(G90)","v":1},"2022-12-31",12,"Invitación directa","GastosAdministrativos",15691500,15691500,"No","N/A","Gerencia de Abastecimiento Estratégico\ncontratacion@positiva.gov.co\nPBX: (1)6502200 Ext: 10641","NO","NO","NO","NO",{"$f":"IF(U90=\"SI\",\"Pública clasificada\",\"Pública\")","v":"Pública"},{"$f":"CONCATENATE(D90,\"-\",\"Tipo de información\",\" \",V90,\"-\",F90)","v":"C00042022-Tipo de información Pública-Investigaciones externas o internas acerca de casos de fraude y/o corrupcion presentados en la entidad"}]
["SECRETARIA GENERAL Y JURÍDICA","Oficina Gestión Integral de Riesgos ","No","C00062022",43232300,"Actualización de información de clientes - SARLAFT","2022-07-01",{"$f":"MONTH(G91)","v":7},"2023-08-01",12,"Invitación directa","GastosAdministrativos",20000000,20000000,"No","N/A","Gerencia de Abastecimiento Estratégico\ncontratacion@positiva.gov.co\nPBX: (1)6502200 Ext: 10641","NO","NO","NO","NO",{"$f":"IF(U91=\"SI\",\"Pública clasificada\",\"Pública\")","v":"Pública"},{"$f":"CONCATENATE(D91,\"-\",\"Tipo de información\",\" \",V91,\"-\",F91)","v":"C00062022-Tipo de información Pública-Actualización de información de clientes - SARLAFT"}]
["SECRETARIA GENERAL Y JURÍDICA","Oficina Gestión Integral de Riesgos ","No","C00072022",43232300,"Prestación de servicios para contar con acceso, consulta y verificación de información de Listas Vinculantes y Restrictivas, inhibitorias, informativas y PEPs","2022-09-01",{"$f":"MONTH(G92)","v":9},"2023-10-01",12,"Invitación directa","GastosAdministrativos",15000000,15000000,"No","N/A","Gerencia de Abastecimiento Estratégico\ncontratacion@positiva.gov.co\nPBX: (1)6502200 Ext: 10641","NO","NO","NO","NO",{"$f":"IF(U92=\"SI\",\"Pública clasificada\",\"Pública\")","v":"Pública"},{"$f":"CONCATENATE(D92,\"-\",\"Tipo de información\",\" \",V92,\"-\",F92)","v":"C00072022-Tipo de información Pública-Prestación de servicios para contar con acceso, consulta y verificación de información de Listas Vinculantes y Restrictivas, inhibitorias, informativas y PEPs"}]
["PyP","Gerencia de administración del riesgo","No","C75012022",93141808,"PRESTACION DE SERVICIOS DE PROMOCION Y PREVENCION – SERVICIOS_ESPECIALIZADOS_ZONA_ANTIOQUIA","1/01/2022",{"$f":"MONTH(G93)","v":1},"30/11/2022",{"$f":"(I93-G93)/30","v":11.1},"Invitación directa","GastosAdministrativos",200000000,200000000,"No","N/A","Gerencia de Abastecimiento Estratégico\ncontratacion@positiva.gov.co\nPBX: (1)6502200 Ext: 10641","SI","SI","NO","SI",{"$f":"IF(U93=\"SI\",\"Pública clasificada\",\"Pública\")","v":"Pública clasificada"},{"$f":"CONCATENATE(D93,\"-\",\"Tipo de información\",\" \",V93,\"-\",F93)","v":"C75012022-Tipo de información Pública clasificada-PRESTACION DE SERVICIOS DE PROMOCION Y PREVENCION – SERVICIOS_ESPECIALIZADOS_ZONA_ANTIOQUIA"}]
["PyP","Gerencia de administración del riesgo","No","C75022022",93141808,"PRESTACION DE SERVICIOS DE PROMOCION Y PREVENCION – SERVICIOS_ESPECIALIZADOS_ZONA_ANTIOQUIA","1/01/2022",{"$f":"MONTH(G94)","v":1},"30/11/2022",{"$f":"(I94-G94)/30","v":11.1},"Invitación directa","GastosAdministrativos",47323529,47323529,"No","N/A","Gerencia de Abastecimiento Estratégico\ncontratacion@positiva.gov.co\nPBX: (1)6502200 Ext: 10641","SI","SI","NO","SI",null,{"$f":"CONCATENATE(D94,\"-\",\"Tipo de información\",\" \",V94,\"-\",F94)","v":"C75022022-Tipo de información -PRESTACION DE SERVICIOS DE PROMOCION Y PREVENCION – SERVICIOS_ESPECIALIZADOS_ZONA_ANTIOQUIA"}]
["PyP","Gerencia de administración del riesgo","No","C75032022",93141808,"PRESTACION DE SERVICIOS DE PROMOCION Y PREVENCION – SERVICIOS_ESPECIALIZADOS_ZONA_ANTIOQUIA","1/01/2022",{"$f":"MONTH(G95)","v":1},"30/11/2022",{"$f":"(I95-G95)/30","v":11.1},"Invitación directa","GastosAdministrativos",206352227,206352227,"No","N/A","Gerencia de Abastecimiento Estratégico\ncontratacion@positiva.gov.co\nPBX: (1)6502200 Ext: 10641","SI","SI","NO","SI",null,{"$f":"CONCATENATE(D95,\"-\",\"Tipo de información\",\" \",V95,\"-\",F95)","v":"C75032022-Tipo de información -PRESTACION DE SERVICIOS DE PROMOCION Y PREVENCION – SERVICIOS_ESPECIALIZADOS_ZONA_ANTIOQUIA"}]
["PyP","Gerencia de administración del riesgo","No","C75042022",93141808,"PRESTACION DE SERVICIOS DE PROMOCION Y PREVENCION – SERVICIOS_ESPECIALIZADOS_ZONA_ANTIOQUIA","1/01/2022",{"$f":"MONTH(G96)","v":1},"30/11/2022",{"$f":"(I96-G96)/30","v":11.1},"Invitación directa","GastosAdministrativos",54273205,54273205,"No","N/A","Gerencia de Abastecimiento Estratégico\ncontratacion@positiva.gov.co\nPBX: (1)6502200 Ext: 10641","SI","SI","NO","SI",null,{"$f":"CONCATENATE(D96,\"-\",\"Tipo de información\",\" \",V96,\"-\",F96)","v":"C75042022-Tipo de información -PRESTACION DE SERVICIOS DE PROMOCION Y PREVENCION – SERVICIOS_ESPECIALIZADOS_ZONA_ANTIOQUIA"}]
["PyP","Gerencia de administración del riesgo","No","C75052022",93141808,"PRESTACION DE SERVICIOS DE PROMOCION Y PREVENCION – SERVICIOS_ESPECIALIZADOS_ZONA_ANTIOQUIA","1/01/2022",{"$f":"MONTH(G97)","v":1},"30/11/2022",{"$f":"(I97-G97)/30","v":11.1},"Invitación directa","GastosAdministrativos",65780731,65780731,"No","N/A","Gerencia de Abastecimiento Estratégico\ncontratacion@positiva.gov.co\nPBX: (1)6502200 Ext: 10641","SI","SI","NO","SI",null,{"$f":"CONCATENATE(D97,\"-\",\"Tipo de información\",\" \",V97,\"-\",F97)","v":"C75052022-Tipo de información -PRESTACION DE SERVICIOS DE PROMOCION Y PREVENCION – SERVICIOS_ESPECIALIZADOS_ZONA_ANTIOQUIA"}]
["PyP","Gerencia de administración del riesgo","No","C75062022",93141808,"PRESTACION DE SERVICIOS DE PROMOCION Y PREVENCION – SERVICIOS_ESPECIALIZADOS_ZONA_ANTIOQUIA","1/01/2022",{"$f":"MONTH(G98)","v":1},"30/11/2022",{"$f":"(I98-G98)/30","v":11.1},"Invitación directa","GastosAdministrativos",349193728,349193728,"No","N/A","Gerencia de Abastecimiento Estratégico\ncontratacion@positiva.gov.co\nPBX: (1)6502200 Ext: 10641","SI","SI","NO","SI",null,{"$f":"CONCATENATE(D98,\"-\",\"Tipo de información\",\" \",V98,\"-\",F98)","v":"C75062022-Tipo de información -PRESTACION DE SERVICIOS DE PROMOCION Y PREVENCION – SERVICIOS_ESPECIALIZADOS_ZONA_ANTIOQUIA"}]
["PyP","Gerencia de administración del riesgo","No","C75072022",93141808,"PRESTACION DE SERVICIOS DE PROMOCION Y PREVENCION – SERVICIOS_ESPECIALIZADOS_ZONA_ANTIOQUIA","1/01/2022",{"$f":"MONTH(G99)","v":1},"30/11/2022",{"$f":"(I99-G99)/30","v":11.1},"Invitación directa","GastosAdministrativos",243305085,243305085,"No","N/A","Gerencia de Abastecimiento Estratégico\ncontratacion@positiva.gov.co\nPBX: (1)6502200 Ext: 10641","SI","SI","NO","SI",null,{"$f":"CONCATENATE(D99,\"-\",\"Tipo de información\",\" \",V99,\"-\",F99)","v":"C75072022-Tipo de información -PRESTACION DE SERVICIOS DE PROMOCION Y PREVENCION – SERVICIOS_ESPECIALIZADOS_ZONA_ANTIOQUIA"}]
["PyP","Gerencia de administración del riesgo","No","C75082022",93141808,"PRESTACION DE SERVICIOS DE PROMOCION Y PREVENCION – SERVICIOS_ESPECIALIZADOS_ZONA_ANTIOQUIA","1/01/2022",{"$f":"MONTH(G100)","v":1},"30/11/2022",{"$f":"(I100-G100)/30","v":11.1},"Invitación directa","GastosAdministrativos",85000000,85000000,"No","N/A","Gerencia de Abastecimiento Estratégico\ncontratacion@positiva.gov.co\nPBX: (1)6502200 Ext: 10641","SI","SI","NO","SI",null,{"$f":"CONCATENATE(D100,\"-\",\"Tipo de información\",\" \",V100,\"-\",F100)","v":"C75082022-Tipo de información -PRESTACION DE SERVICIOS DE PROMOCION Y PREVENCION – SERVICIOS_ESPECIALIZADOS_ZONA_ANTIOQUIA"}]
["PyP","Gerencia de administración del riesgo","No","C75092022",93141808,"PRESTACION DE SERVICIOS DE PROMOCION Y PREVENCION – SERVICIOS_ESPECIALIZADOS_ZONA_ANTIOQUIA","1/01/2022",{"$f":"MONTH(G101)","v":1},"30/11/2022",{"$f":"(I101-G101)/30","v":11.1},"Invitación directa","GastosAdministrativos",90000000,90000000,"No","N/A","Gerencia de Abastecimiento Estratégico\ncontratacion@positiva.gov.co\nPBX: (1)6502200 Ext: 10641","SI","SI","NO","SI",null,{"$f":"CONCATENATE(D101,\"-\",\"Tipo de información\",\" \",V101,\"-\",F101)","v":"C75092022-Tipo de información -PRESTACION DE SERVICIOS DE PROMOCION Y PREVENCION – SERVICIOS_ESPECIALIZADOS_ZONA_ANTIOQUIA"}]
["PyP","Gerencia de administración del riesgo","No","C75102022",93141808,"PRESTACION DE SERVICIOS DE PROMOCION Y PREVENCION – SERVICIOS_ESPECIALIZADOS_ZONA_ANTIOQUIA","1/01/2022",{"$f":"MONTH(G102)","v":1},"30/11/2022",{"$f":"(I102-G102)/30","v":11.1},"Invitación directa","GastosAdministrativos",30000000,30000000,"No","N/A","Gerencia de Abastecimiento Estratégico\ncontratacion@positiva.gov.co\nPBX: (1)6502200 Ext: 10641","SI","SI","NO","SI",null,{"$f":"CONCATENATE(D102,\"-\",\"Tipo de información\",\" \",V102,\"-\",F102)","v":"C75102022-Tipo de información -PRESTACION DE SERVICIOS DE PROMOCION Y PREVENCION – SERVICIOS_ESPECIALIZADOS_ZONA_ANTIOQUIA"}]
["PyP","Gerencia de administración del riesgo","No","C75112022",93141808,"PRESTACION DE SERVICIOS DE PROMOCION Y PREVENCION – SERVICIOS_ESPECIALIZADOS_ZONA_ANTIOQUIA","1/01/2022",{"$f":"MONTH(G103)","v":1},"30/11/2022",{"$f":"(I103-G103)/30","v":11.1},"Invitación directa","GastosAdministrativos",163094491,163094491,"No","N/A","Gerencia de Abastecimiento Estratégico\ncontratacion@positiva.gov.co\nPBX: (1)6502200 Ext: 10641","SI","SI","NO","SI",null,{"$f":"CONCATENATE(D103,\"-\",\"Tipo de información\",\" \",V103,\"-\",F103)","v":"C75112022-Tipo de información -PRESTACION DE SERVICIOS DE PROMOCION Y PREVENCION – SERVICIOS_ESPECIALIZADOS_ZONA_ANTIOQUIA"}]
["PyP","Gerencia de administración del riesgo","No","C75122022",93141808,"PRESTACION DE SERVICIOS DE PROMOCION Y PREVENCION – SERVICIOS_ESPECIALIZADOS_ZONA_ANTIOQUIA","1/01/2022",{"$f":"MONTH(G104)","v":1},"30/11/2022",{"$f":"(I104-G104)/30","v":11.1},"Invitación directa","GastosAdministrativos",214432990,214432990,"No","N/A","Gerencia de Abastecimiento Estratégico\ncontratacion@positiva.gov.co\nPBX: (1)6502200 Ext: 10641","SI","SI","NO","SI",null,{"$f":"CONCATENATE(D104,\"-\",\"Tipo de información\",\" \",V104,\"-\",F104)","v":"C75122022-Tipo de información -PRESTACION DE SERVICIOS DE PROMOCION Y PREVENCION – SERVICIOS_ESPECIALIZADOS_ZONA_ANTIOQUIA"}]
["PyP","Gerencia de administración del riesgo","No","C75132022",93141808,"PRESTACION DE SERVICIOS DE PROMOCION Y PREVENCION – SERVICIOS_ESPECIALIZADOS_ZONA_ANTIOQUIA","1/01/2022",{"$f":"MONTH(G105)","v":1},"30/11/2022",{"$f":"(I105-G105)/30","v":11.1},"Invitación directa","GastosAdministrativos",95000000,95000000,"No","N/A","Gerencia de Abastecimiento Estratégico\ncontratacion@positiva.gov.co\nPBX: (1)6502200 Ext: 10641","SI","SI","NO","SI",null,{"$f":"CONCATENATE(D105,\"-\",\"Tipo de información\",\" \",V105,\"-\",F105)","v":"C75132022-Tipo de información -PRESTACION DE SERVICIOS DE PROMOCION Y PREVENCION – SERVICIOS_ESPECIALIZADOS_ZONA_ANTIOQUIA"}]
["PyP","Gerencia de administración del riesgo","No","C75142022",93141808,"PRESTACION DE SERVICIOS DE PROMOCION Y PREVENCION – SERVICIOS_ESPECIALIZADOS_ZONA_ANTIOQUIA","1/01/2022",{"$f":"MONTH(G106)","v":1},"30/11/2022",{"$f":"(I106-G106)/30","v":11.1},"Invitación directa","GastosAdministrativos",62482813,62482813,"No","N/A","Gerencia de Abastecimiento Estratégico\ncontratacion@positiva.gov.co\nPBX: (1)6502200 Ext: 10641","SI","SI","NO","SI",null,{"$f":"CONCATENATE(D106,\"-\",\"Tipo de información\",\" \",V106,\"-\",F106)","v":"C75142022-Tipo de información -PRESTACION DE SERVICIOS DE PROMOCION Y PREVENCION – SERVICIOS_ESPECIALIZADOS_ZONA_ANTIOQUIA"}]
["PyP","Gerencia de administración del riesgo","No","C76012022",93141808,"PRESTACION DE SERVICIOS DE PROMOCION Y PREVENCION – SERVICIOS_ESPECIALIZADOS_ZONA_ATLANTICO","1/01/2022",{"$f":"MONTH(G107)","v":1},"30/11/2022",{"$f":"(I107-G107)/30","v":11.1},"Invitación directa","GastosAdministrativos",115733143,115733143,"No","N/A","Gerencia de Abastecimiento Estratégico\ncontratacion@positiva.gov.co\nPBX: (1)6502200 Ext: 10641","SI","SI","NO","SI",null,{"$f":"CONCATENATE(D107,\"-\",\"Tipo de información\",\" \",V107,\"-\",F107)","v":"C76012022-Tipo de información -PRESTACION DE SERVICIOS DE PROMOCION Y PREVENCION – SERVICIOS_ESPECIALIZADOS_ZONA_ATLANTICO"}]
["PyP","Gerencia de administración del riesgo","No","C76022022",93141808,"PRESTACION DE SERVICIOS DE PROMOCION Y PREVENCION – SERVICIOS_ESPECIALIZADOS_ZONA_ATLANTICO","1/01/2022",{"$f":"MONTH(G108)","v":1},"30/11/2022",{"$f":"(I108-G108)/30","v":11.1},"Invitación directa","GastosAdministrativos",38076923,38076923,"No","N/A","Gerencia de Abastecimiento Estratégico\ncontratacion@positiva.gov.co\nPBX: (1)6502200 Ext: 10641","SI","SI","NO","SI",null,{"$f":"CONCATENATE(D108,\"-\",\"Tipo de información\",\" \",V108,\"-\",F108)","v":"C76022022-Tipo de información -PRESTACION DE SERVICIOS DE PROMOCION Y PREVENCION – SERVICIOS_ESPECIALIZADOS_ZONA_ATLANTICO"}]
["PyP","Gerencia de administración del riesgo","No","C76032022",93141808,"PRESTACION DE SERVICIOS DE PROMOCION Y PREVENCION – SERVICIOS_ESPECIALIZADOS_ZONA_ATLANTICO","1/01/2022",{"$f":"MONTH(G109)","v":1},"30/11/2022",{"$f":"(I109-G109)/30","v":11.1},"Invitación directa","GastosAdministrativos",100000000,100000000,"No","N/A","Gerencia de Abastecimiento Estratégico\ncontratacion@positiva.gov.co\nPBX: (1)6502200 Ext: 10641","SI","SI","NO","SI",null,{"$f":"CONCATENATE(D109,\"-\",\"Tipo de información\",\" \",V109,\"-\",F109)","v":"C76032022-Tipo de información -PRESTACION DE SERVICIOS DE PROMOCION Y PREVENCION – SERVICIOS_ESPECIALIZADOS_ZONA_ATLANTICO"}]
["PyP","Gerencia de administración del riesgo","No","C76042022",93141808,"PRESTACION DE SERVICIOS DE PROMOCION Y PREVENCION – SERVICIOS_ESPECIALIZADOS_ZONA_ATLANTICO","1/01/2022",{"$f":"MONTH(G110)","v":1},"30/11/2022",{"$f":"(I110-G110)/30","v":11.1},"Invitación directa","GastosAdministrativos",98172315,98172315,"No","N/A","Gerencia de Abastecimiento Estratégico\ncontratacion@positiva.gov.co\nPBX: (1)6502200 Ext: 10641","SI","SI","NO","SI",null,{"$f":"CONCATENATE(D110,\"-\",\"Tipo de información\",\" \",V110,\"-\",F110)","v":"C76042022-Tipo de información -PRESTACION DE SERVICIOS DE PROMOCION Y PREVENCION – SERVICIOS_ESPECIALIZADOS_ZONA_ATLANTICO"}]
["PyP","Gerencia de administración del riesgo","No","C76052022",93141808,"PRESTACION DE SERVICIOS DE PROMOCION Y PREVENCION – SERVICIOS_ESPECIALIZADOS_ZONA_ATLANTICO","1/01/2022",{"$f":"MONTH(G111)","v":1},"30/11/2022",{"$f":"(I111-G111)/30","v":11.1},"Invitación directa","GastosAdministrativos",110482143,110482143,"No","N/A","Gerencia de Abastecimiento Estratégico\ncontratacion@positiva.gov.co\nPBX: (1)6502200 Ext: 10641","SI","SI","NO","SI",null,{"$f":"CONCATENATE(D111,\"-\",\"Tipo de información\",\" \",V111,\"-\",F111)","v":"C76052022-Tipo de información -PRESTACION DE SERVICIOS DE PROMOCION Y PREVENCION – SERVICIOS_ESPECIALIZADOS_ZONA_ATLANTICO"}]
["PyP","Gerencia de administración del riesgo","No","C76062022",93141808,"PRESTACION DE SERVICIOS DE PROMOCION Y PREVENCION – SERVICIOS_ESPECIALIZADOS_ZONA_ATLANTICO","1/01/2022",{"$f":"MONTH(G112)","v":1},"30/11/2022",{"$f":"(I112-G112)/30","v":11.1},"Invitación directa","GastosAdministrativos",130339036,130339036,"No","N/A","Gerencia de Abastecimiento Estratégico\ncontratacion@positiva.gov.co\nPBX: (1)6502200 Ext: 10641","SI","SI","NO","SI",null,{"$f":"CONCATENATE(D112,\"-\",\"Tipo de información\",\" \",V112,\"-\",F112)","v":"C76062022-Tipo de información -PRESTACION DE SERVICIOS DE PROMOCION Y PREVENCION – SERVICIOS_ESPECIALIZADOS_ZONA_ATLANTICO"}]
["PyP","Gerencia de administración del riesgo","No","C76072022",93141808,"PRESTACION DE SERVICIOS DE PROMOCION Y PREVENCION – SERVICIOS_ESPECIALIZADOS_ZONA_ATLANTICO","1/01/2022",{"$f":"MONTH(G113)","v":1},"30/11/2022",{"$f":"(I113-G113)/30","v":11.1},"Invitación directa","GastosAdministrativos",198275000,198275000,"No","N/A","Gerencia de Abastecimiento Estratégico\ncontratacion@positiva.gov.co\nPBX: (1)6502200 Ext: 10641","SI","SI","NO","SI",null,{"$f":"CONCATENATE(D113,\"-\",\"Tipo de información\",\" \",V113,\"-\",F113)","v":"C76072022-Tipo de información -PRESTACION DE SERVICIOS DE PROMOCION Y PREVENCION – SERVICIOS_ESPECIALIZADOS_ZONA_ATLANTICO"}]
["PyP","Gerencia de administración del riesgo","No","C76082022",93141808,"PRESTACION DE SERVICIOS DE PROMOCION Y PREVENCION – SERVICIOS_ESPECIALIZADOS_ZONA_ATLANTICO","1/01/2022",{"$f":"MONTH(G114)","v":1},"30/11/2022",{"$f":"(I114-G114)/30","v":11.1},"Invitación directa","GastosAdministrativos",94087000,94087000,"No","N/A","Gerencia de Abastecimiento Estratégico\ncontratacion@positiva.gov.co\nPBX: (1)6502200 Ext: 10641","SI","SI","NO","SI",null,{"$f":"CONCATENATE(D114,\"-\",\"Tipo de información\",\" \",V114,\"-\",F114)","v":"C76082022-Tipo de información -PRESTACION DE SERVICIOS DE PROMOCION Y PREVENCION – SERVICIOS_ESPECIALIZADOS_ZONA_ATLANTICO"}]
["PyP","Gerencia de administración del riesgo","No","C76092022",93141808,"PRESTACION DE SERVICIOS DE PROMOCION Y PREVENCION – SERVICIOS_ESPECIALIZADOS_ZONA_ATLANTICO","1/01/2022",{"$f":"MONTH(G115)","v":1},"30/11/2022",{"$f":"(I115-G115)/30","v":11.1},"Invitación directa","GastosAdministrativos",221453919,221453919,"No","N/A","Gerencia de Abastecimiento Estratégico\ncontratacion@positiva.gov.co\nPBX: (1)6502200 Ext: 10641","SI","SI","NO","SI",null,{"$f":"CONCATENATE(D115,\"-\",\"Tipo de información\",\" \",V115,\"-\",F115)","v":"C76092022-Tipo de información -PRESTACION DE SERVICIOS DE PROMOCION Y PREVENCION – SERVICIOS_ESPECIALIZADOS_ZONA_ATLANTICO"}]
["PyP","Gerencia de administración del riesgo","No","C76102022",93141808,"PRESTACION DE SERVICIOS DE PROMOCION Y PREVENCION – SERVICIOS_ESPECIALIZADOS_ZONA_ATLANTICO","1/01/2022",{"$f":"MONTH(G116)","v":1},"30/11/2022",{"$f":"(I116-G116)/30","v":11.1},"Invitación directa","GastosAdministrativos",268510373,268510373,"No","N/A","Gerencia de Abastecimiento Estratégico\ncontratacion@positiva.gov.co\nPBX: (1)6502200 Ext: 10641","SI","SI","NO","SI",null,{"$f":"CONCATENATE(D116,\"-\",\"Tipo de información\",\" \",V116,\"-\",F116)","v":"C76102022-Tipo de información -PRESTACION DE SERVICIOS DE PROMOCION Y PREVENCION – SERVICIOS_ESPECIALIZADOS_ZONA_ATLANTICO"}]
["PyP","Gerencia de administración del riesgo","No","C76112022",93141808,"PRESTACION DE SERVICIOS DE PROMOCION Y PREVENCION – SERVICIOS_ESPECIALIZADOS_ZONA_ATLANTICO","1/01/2022",{"$f":"MONTH(G117)","v":1},"30/11/2022",{"$f":"(I117-G117)/30","v":11.1},"Invitación directa","GastosAdministrativos",1849897080,1849897080,"No","N/A","Gerencia de Abastecimiento Estratégico\ncontratacion@positiva.gov.co\nPBX: (1)6502200 Ext: 10641","SI","SI","NO","SI",null,{"$f":"CONCATENATE(D117,\"-\",\"Tipo de información\",\" \",V117,\"-\",F117)","v":"C76112022-Tipo de información -PRESTACION DE SERVICIOS DE PROMOCION Y PREVENCION – SERVICIOS_ESPECIALIZADOS_ZONA_ATLANTICO"}]
["PyP","Gerencia de administración del riesgo","No","C76122022",93141808,"PRESTACION DE SERVICIOS DE PROMOCION Y PREVENCION – SERVICIOS_ESPECIALIZADOS_ZONA_ATLANTICO","1/01/2022",{"$f":"MONTH(G118)","v":1},"30/11/2022",{"$f":"(I118-G118)/30","v":11.1},"Invitación directa","GastosAdministrativos",54476190,54476190,"No","N/A","Gerencia de Abastecimiento Estratégico\ncontratacion@positiva.gov.co\nPBX: (1)6502200 Ext: 10641","SI","SI","NO","SI",null,{"$f":"CONCATENATE(D118,\"-\",\"Tipo de información\",\" \",V118,\"-\",F118)","v":"C76122022-Tipo de información -PRESTACION DE SERVICIOS DE PROMOCION Y PREVENCION – SERVICIOS_ESPECIALIZADOS_ZONA_ATLANTICO"}]
["PyP","Gerencia de administración del riesgo","No","C76132022",93141808,"PRESTACION DE SERVICIOS DE PROMOCION Y PREVENCION – SERVICIOS_ESPECIALIZADOS_ZONA_ATLANTICO","1/01/2022",{"$f":"MONTH(G119)","v":1},"30/11/2022",{"$f":"(I119-G119)/30","v":11.1},"Invitación directa","GastosAdministrativos",94087000,94087000,"No","N/A","Gerencia de Abastecimiento Estratégico\ncontratacion@positiva.gov.co\nPBX: (1)6502200 Ext: 10641","SI","SI","NO","SI",null,{"$f":"CONCATENATE(D119,\"-\",\"Tipo de información\",\" \",V119,\"-\",F119)","v":"C76132022-Tipo de información -PRESTACION DE SERVICIOS DE PROMOCION Y PREVENCION – SERVICIOS_ESPECIALIZADOS_ZONA_ATLANTICO"}]
["PyP","Gerencia de administración del riesgo","No","C76142022",93141808,"PRESTACION DE SERVICIOS DE PROMOCION Y PREVENCION – SERVICIOS_ESPECIALIZADOS_ZONA_ATLANTICO","1/01/2022",{"$f":"MONTH(G120)","v":1},"30/11/2022",{"$f":"(I120-G120)/30","v":11.1},"Invitación directa","GastosAdministrativos",100000000,100000000,"No","N/A","Gerencia de Abastecimiento Estratégico\ncontratacion@positiva.gov.co\nPBX: (1)6502200 Ext: 10641","SI","SI","NO","SI",null,{"$f":"CONCATENATE(D120,\"-\",\"Tipo de información\",\" \",V120,\"-\",F120)","v":"C76142022-Tipo de información -PRESTACION DE SERVICIOS DE PROMOCION Y PREVENCION – SERVICIOS_ESPECIALIZADOS_ZONA_ATLANTICO"}]
["PyP","Gerencia de administración del riesgo","No","C76152022",93141808,"PRESTACION DE SERVICIOS DE PROMOCION Y PREVENCION – SERVICIOS_ESPECIALIZADOS_ZONA_ATLANTICO","1/01/2022",{"$f":"MONTH(G121)","v":1},"30/11/2022",{"$f":"(I121-G121)/30","v":11.1},"Invitación directa","GastosAdministrativos",103339036,103339036,"No","N/A","Gerencia de Abastecimiento Estratégico\ncontratacion@positiva.gov.co\nPBX: (1)6502200 Ext: 10641","SI","SI","NO","SI",null,{"$f":"CONCATENATE(D121,\"-\",\"Tipo de información\",\" \",V121,\"-\",F121)","v":"C76152022-Tipo de información -PRESTACION DE SERVICIOS DE PROMOCION Y PREVENCION – SERVICIOS_ESPECIALIZADOS_ZONA_ATLANTICO"}]
["PyP","Gerencia de administración del riesgo","No","C76162022",93141808,"PRESTACION DE SERVICIOS DE PROMOCION Y PREVENCION – SERVICIOS_ESPECIALIZADOS_ZONA_ATLANTICO","1/01/2022",{"$f":"MONTH(G122)","v":1},"30/11/2022",{"$f":"(I122-G122)/30","v":11.1},"Invitación directa","GastosAdministrativos",115000000,115000000,"No","N/A","Gerencia de Abastecimiento Estratégico\ncontratacion@positiva.gov.co\nPBX: (1)6502200 Ext: 10641","SI","SI","NO","SI",null,{"$f":"CONCATENATE(D122,\"-\",\"Tipo de información\",\" \",V122,\"-\",F122)","v":"C76162022-Tipo de información -PRESTACION DE SERVICIOS DE PROMOCION Y PREVENCION – SERVICIOS_ESPECIALIZADOS_ZONA_ATLANTICO"}]
["PyP","Gerencia de administración del riesgo","No","C76172022",93141808,"PRESTACION DE SERVICIOS DE PROMOCION Y PREVENCION – SERVICIOS_ESPECIALIZADOS_ZONA_ATLANTICO","1/01/2022",{"$f":"MONTH(G123)","v":1},"30/11/2022",{"$f":"(I123-G123)/30","v":11.1},"Invitación directa","GastosAdministrativos",40000000,40000000,"No","N/A","Gerencia de Abastecimiento Estratégico\ncontratacion@positiva.gov.co\nPBX: (1)6502200 Ext: 10641","SI","SI","NO","SI",null,{"$f":"CONCATENATE(D123,\"-\",\"Tipo de información\",\" \",V123,\"-\",F123)","v":"C76172022-Tipo de información -PRESTACION DE SERVICIOS DE PROMOCION Y PREVENCION – SERVICIOS_ESPECIALIZADOS_ZONA_ATLANTICO"}]
["PyP","Gerencia de administración del riesgo","No","C76182022",93141808,"PRESTACION DE SERVICIOS DE PROMOCION Y PREVENCION – SERVICIOS_ESPECIALIZADOS_ZONA_ATLANTICO","1/01/2022",{"$f":"MONTH(G124)","v":1},"30/11/2022",{"$f":"(I124-G124)/30","v":11.1},"Invitación directa","GastosAdministrativos",54544219,54544219,"No","N/A","Gerencia de Abastecimiento Estratégico\ncontratacion@positiva.gov.co\nPBX: (1)6502200 Ext: 10641","SI","SI","NO","SI",null,{"$f":"CONCATENATE(D124,\"-\",\"Tipo de información\",\" \",V124,\"-\",F124)","v":"C76182022-Tipo de información -PRESTACION DE SERVICIOS DE PROMOCION Y PREVENCION – SERVICIOS_ESPECIALIZADOS_ZONA_ATLANTICO"}]
["PyP","Gerencia de administración del riesgo","No","C76192022",93141808,"PRESTACION DE SERVICIOS DE PROMOCION Y PREVENCION – SERVICIOS_ESPECIALIZADOS_ZONA_ATLANTICO","1/01/2022",{"$f":"MONTH(G125)","v":1},"30/11/2022",{"$f":"(I125-G125)/30","v":11.1},"Invitación directa","GastosAdministrativos",220358306,220358306,"No","N/A","Gerencia de Abastecimiento Estratégico\ncontratacion@positiva.gov.co\nPBX: (1)6502200 Ext: 10641","SI","SI","NO","SI",null,{"$f":"CONCATENATE(D125,\"-\",\"Tipo de información\",\" \",V125,\"-\",F125)","v":"C76192022-Tipo de información -PRESTACION DE SERVICIOS DE PROMOCION Y PREVENCION – SERVICIOS_ESPECIALIZADOS_ZONA_ATLANTICO"}]
["PyP","Gerencia de administración del riesgo","No","C76202022",93141808,"PRESTACION DE SERVICIOS DE PROMOCION Y PREVENCION – SERVICIOS_ESPECIALIZADOS_ZONA_ATLANTICO","1/01/2022",{"$f":"MONTH(G126)","v":1},"30/11/2022",{"$f":"(I126-G126)/30","v":11.1},"Invitación directa","GastosAdministrativos",121302817,121302817,"No","N/A","Gerencia de Abastecimiento Estratégico\ncontratacion@positiva.gov.co\nPBX: (1)6502200 Ext: 10641","SI","SI","NO","SI",null,{"$f":"CONCATENATE(D126,\"-\",\"Tipo de información\",\" \",V126,\"-\",F126)","v":"C76202022-Tipo de información -PRESTACION DE SERVICIOS DE PROMOCION Y PREVENCION – SERVICIOS_ESPECIALIZADOS_ZONA_ATLANTICO"}]
["PyP","Gerencia de administración del riesgo","No","C76212022",93141808,"PRESTACION DE SERVICIOS DE PROMOCION Y PREVENCION – SERVICIOS_ESPECIALIZADOS_ZONA_ATLANTICO","1/01/2022",{"$f":"MONTH(G127)","v":1},"30/11/2022",{"$f":"(I127-G127)/30","v":11.1},"Invitación directa","GastosAdministrativos",181725352,181725352,"No","N/A","Gerencia de Abastecimiento Estratégico\ncontratacion@positiva.gov.co\nPBX: (1)6502200 Ext: 10641","SI","SI","NO","SI",null,{"$f":"CONCATENATE(D127,\"-\",\"Tipo de información\",\" \",V127,\"-\",F127)","v":"C76212022-Tipo de información -PRESTACION DE SERVICIOS DE PROMOCION Y PREVENCION – SERVICIOS_ESPECIALIZADOS_ZONA_ATLANTICO"}]
["PyP","Gerencia de administración del riesgo","No","C76222022",93141808,"PRESTACION DE SERVICIOS DE PROMOCION Y PREVENCION – SERVICIOS_ESPECIALIZADOS_ZONA_ATLANTICO","1/01/2022",{"$f":"MONTH(G128)","v":1},"30/11/2022",{"$f":"(I128-G128)/30","v":11.1},"Invitación directa","GastosAdministrativos",156679181,156679181,"No","N/A","Gerencia de Abastecimiento Estratégico\ncontratacion@positiva.gov.co\nPBX: (1)6502200 Ext: 10641","SI","SI","NO","SI",null,{"$f":"CONCATENATE(D128,\"-\",\"Tipo de información\",\" \",V128,\"-\",F128)","v":"C76222022-Tipo de información -PRESTACION DE SERVICIOS DE PROMOCION Y PREVENCION – SERVICIOS_ESPECIALIZADOS_ZONA_ATLANTICO"}]
["PyP","Gerencia de administración del riesgo","No","C76232022",93141808,"PRESTACION DE SERVICIOS DE PROMOCION Y PREVENCION – SERVICIOS_ESPECIALIZADOS_ZONA_ATLANTICO","1/01/2022",{"$f":"MONTH(G129)","v":1},"30/11/2022",{"$f":"(I129-G129)/30","v":11.1},"Invitación directa","GastosAdministrativos",11000000,11000000,"No","N/A","Gerencia de Abastecimiento Estratégico\ncontratacion@positiva.gov.co\nPBX: (1)6502200 Ext: 10641","SI","SI","NO","SI",null,{"$f":"CONCATENATE(D129,\"-\",\"Tipo de información\",\" \",V129,\"-\",F129)","v":"C76232022-Tipo de información -PRESTACION DE SERVICIOS DE PROMOCION Y PREVENCION – SERVICIOS_ESPECIALIZADOS_ZONA_ATLANTICO"}]
["PyP","Gerencia de administración del riesgo","No","C76242022",93141808,"PRESTACION DE SERVICIOS DE PROMOCION Y PREVENCION – SERVICIOS_ESPECIALIZADOS_ZONA_ATLANTICO","1/01/2022",{"$f":"MONTH(G130)","v":1},"30/11/2022",{"$f":"(I130-G130)/30","v":11.1},"Invitación directa","GastosAdministrativos",76769039,76769039,"No","N/A","Gerencia de Abastecimiento Estratégico\ncontratacion@positiva.gov.co\nPBX: (1)6502200 Ext: 10641","SI","SI","NO","SI",null,{"$f":"CONCATENATE(D130,\"-\",\"Tipo de información\",\" \",V130,\"-\",F130)","v":"C76242022-Tipo de información -PRESTACION DE SERVICIOS DE PROMOCION Y PREVENCION – SERVICIOS_ESPECIALIZADOS_ZONA_ATLANTICO"}]
["PyP","Gerencia de administración del riesgo","No","C76252022",93141808,"PRESTACION DE SERVICIOS DE PROMOCION Y PREVENCION – SERVICIOS_ESPECIALIZADOS_ZONA_ATLANTICO","1/01/2022",{"$f":"MONTH(G131)","v":1},"30/11/2022",{"$f":"(I131-G131)/30","v":11.1},"Invitación directa","GastosAdministrativos",1417564738,1417564738,"No","N/A","Gerencia de Abastecimiento Estratégico\ncontratacion@positiva.gov.co\nPBX: (1)6502200 Ext: 10641","SI","SI","NO","SI",null,{"$f":"CONCATENATE(D131,\"-\",\"Tipo de información\",\" \",V131,\"-\",F131)","v":"C76252022-Tipo de información -PRESTACION DE SERVICIOS DE PROMOCION Y PREVENCION – SERVICIOS_ESPECIALIZADOS_ZONA_ATLANTICO"}]
["PyP","Gerencia de administración del riesgo","No","C76262022",93141808,"PRESTACION DE SERVICIOS DE PROMOCION Y PREVENCION – SERVICIOS_ESPECIALIZADOS_ZONA_ATLANTICO","1/01/2022",{"$f":"MONTH(G132)","v":1},"30/11/2022",{"$f":"(I132-G132)/30","v":11.1},"Invitación directa","GastosAdministrativos",131291688,131291688,"No","N/A","Gerencia de Abastecimiento Estratégico\ncontratacion@positiva.gov.co\nPBX: (1)6502200 Ext: 10641","SI","SI","NO","SI",null,{"$f":"CONCATENATE(D132,\"-\",\"Tipo de información\",\" \",V132,\"-\",F132)","v":"C76262022-Tipo de información -PRESTACION DE SERVICIOS DE PROMOCION Y PREVENCION – SERVICIOS_ESPECIALIZADOS_ZONA_ATLANTICO"}]
["PyP","Gerencia de administración del riesgo","No","C76272022",93141808,"PRESTACION DE SERVICIOS DE PROMOCION Y PREVENCION – SERVICIOS_ESPECIALIZADOS_ZONA_ATLANTICO","1/01/2022",{"$f":"MONTH(G133)","v":1},"30/11/2022",{"$f":"(I133-G133)/30","v":11.1},"Invitación directa","GastosAdministrativos",16791649,16791649,"No","N/A","Gerencia de Abastecimiento Estratégico\ncontratacion@positiva.gov.co\nPBX: (1)6502200 Ext: 10641","SI","SI","NO","SI",null,{"$f":"CONCATENATE(D133,\"-\",\"Tipo de información\",\" \",V133,\"-\",F133)","v":"C76272022-Tipo de información -PRESTACION DE SERVICIOS DE PROMOCION Y PREVENCION – SERVICIOS_ESPECIALIZADOS_ZONA_ATLANTICO"}]
["PyP","Gerencia de administración del riesgo","No","C76282022",93141808,"PRESTACION DE SERVICIOS DE PROMOCION Y PREVENCION – SERVICIOS_ESPECIALIZADOS_ZONA_ATLANTICO","1/01/2022",{"$f":"MONTH(G134)","v":1},"30/11/2022",{"$f":"(I134-G134)/30","v":11.1},"Invitación directa","GastosAdministrativos",309497143,309497143,"No","N/A","Gerencia de Abastecimiento Estratégico\ncontratacion@positiva.gov.co\nPBX: (1)6502200 Ext: 10641","SI","SI","NO","SI",null,{"$f":"CONCATENATE(D134,\"-\",\"Tipo de información\",\" \",V134,\"-\",F134)","v":"C76282022-Tipo de información -PRESTACION DE SERVICIOS DE PROMOCION Y PREVENCION – SERVICIOS_ESPECIALIZADOS_ZONA_ATLANTICO"}]
["PyP","Gerencia de administración del riesgo","No","C76292022",93141808,"PRESTACION DE SERVICIOS DE PROMOCION Y PREVENCION – SERVICIOS_ESPECIALIZADOS_ZONA_ATLANTICO","1/01/2022",{"$f":"MONTH(G135)","v":1},"30/11/2022",{"$f":"(I135-G135)/30","v":11.1},"Invitación directa","GastosAdministrativos",32258400,32258400,"No","N/A","Gerencia de Abastecimiento Estratégico\ncontratacion@positiva.gov.co\nPBX: (1)6502200 Ext: 10641","SI","SI","NO","SI",null,{"$f":"CONCATENATE(D135,\"-\",\"Tipo de información\",\" \",V135,\"-\",F135)","v":"C76292022-Tipo de información -PRESTACION DE SERVICIOS DE PROMOCION Y PREVENCION – SERVICIOS_ESPECIALIZADOS_ZONA_ATLANTICO"}]
["PyP","Gerencia de administración del riesgo","No","C76302022",93141808,"PRESTACION DE SERVICIOS DE PROMOCION Y PREVENCION – SERVICIOS_ESPECIALIZADOS_ZONA_ATLANTICO","1/01/2022",{"$f":"MONTH(G136)","v":1},"30/11/2022",{"$f":"(I136-G136)/30","v":11.1},"Invitación directa","GastosAdministrativos",69665466,69665466,"No","N/A","Gerencia de Abastecimiento Estratégico\ncontratacion@positiva.gov.co\nPBX: (1)6502200 Ext: 10641","SI","SI","NO","SI",null,{"$f":"CONCATENATE(D136,\"-\",\"Tipo de información\",\" \",V136,\"-\",F136)","v":"C76302022-Tipo de información -PRESTACION DE SERVICIOS DE PROMOCION Y PREVENCION – SERVICIOS_ESPECIALIZADOS_ZONA_ATLANTICO"}]
["PyP","Gerencia de administración del riesgo","No","C76312022",93141808,"PRESTACION DE SERVICIOS DE PROMOCION Y PREVENCION – SERVICIOS_ESPECIALIZADOS_ZONA_ATLANTICO","1/01/2022",{"$f":"MONTH(G137)","v":1},"30/11/2022",{"$f":"(I137-G137)/30","v":11.1},"Invitación directa","GastosAdministrativos",118715998,118715998,"No","N/A","Gerencia de Abastecimiento Estratégico\ncontratacion@positiva.gov.co\nPBX: (1)6502200 Ext: 10641","SI","SI","NO","SI",null,{"$f":"CONCATENATE(D137,\"-\",\"Tipo de información\",\" \",V137,\"-\",F137)","v":"C76312022-Tipo de información -PRESTACION DE SERVICIOS DE PROMOCION Y PREVENCION – SERVICIOS_ESPECIALIZADOS_ZONA_ATLANTICO"}]
["PyP","Gerencia de administración del riesgo","No","C77012022",93141808,"PRESTACION DE SERVICIOS DE PROMOCION Y PREVENCION – SERVICIOS_ESPECIALIZADOS_ZONA_BOGOTA","1/01/2022",{"$f":"MONTH(G138)","v":1},"30/11/2022",{"$f":"(I138-G138)/30","v":11.1},"Invitación directa","GastosAdministrativos",183827812,183827812,"No","N/A","Gerencia de Abastecimiento Estratégico\ncontratacion@positiva.gov.co\nPBX: (1)6502200 Ext: 10641","SI","SI","NO","SI",null,{"$f":"CONCATENATE(D138,\"-\",\"Tipo de información\",\" \",V138,\"-\",F138)","v":"C77012022-Tipo de información -PRESTACION DE SERVICIOS DE PROMOCION Y PREVENCION – SERVICIOS_ESPECIALIZADOS_ZONA_BOGOTA"}]
["PyP","Gerencia de administración del riesgo","No","C77022022",93141808,"PRESTACION DE SERVICIOS DE PROMOCION Y PREVENCION – SERVICIOS_ESPECIALIZADOS_ZONA_BOGOTA","1/01/2022",{"$f":"MONTH(G139)","v":1},"30/11/2022",{"$f":"(I139-G139)/30","v":11.1},"Invitación directa","GastosAdministrativos",15000000,15000000,"No","N/A","Gerencia de Abastecimiento Estratégico\ncontratacion@positiva.gov.co\nPBX: (1)6502200 Ext: 10641","SI","SI","NO","SI",null,{"$f":"CONCATENATE(D139,\"-\",\"Tipo de información\",\" \",V139,\"-\",F139)","v":"C77022022-Tipo de información -PRESTACION DE SERVICIOS DE PROMOCION Y PREVENCION – SERVICIOS_ESPECIALIZADOS_ZONA_BOGOTA"}]
["PyP","Gerencia de administración del riesgo","No","C77032022",93141808,"PRESTACION DE SERVICIOS DE PROMOCION Y PREVENCION – SERVICIOS_ESPECIALIZADOS_ZONA_BOGOTA","1/01/2022",{"$f":"MONTH(G140)","v":1},"30/11/2022",{"$f":"(I140-G140)/30","v":11.1},"Invitación directa","GastosAdministrativos",70000000,70000000,"No","N/A","Gerencia de Abastecimiento Estratégico\ncontratacion@positiva.gov.co\nPBX: (1)6502200 Ext: 10641","SI","SI","NO","SI",null,{"$f":"CONCATENATE(D140,\"-\",\"Tipo de información\",\" \",V140,\"-\",F140)","v":"C77032022-Tipo de información -PRESTACION DE SERVICIOS DE PROMOCION Y PREVENCION – SERVICIOS_ESPECIALIZADOS_ZONA_BOGOTA"}]
["PyP","Gerencia de administración del riesgo","No","C81012022",93141808,"PRESTACION DE SERVICIOS DE PROMOCION Y PREVENCION – SERVICIOS_ESPECIALIZADOS_CUENTA_RAMA","1/01/2022",{"$f":"MONTH(G141)","v":1},"30/11/2022",{"$f":"(I141-G141)/30","v":11.1},"Invitación directa","GastosAdministrativos",109678560,109678560,"No","N/A","Gerencia de Abastecimiento Estratégico\ncontratacion@positiva.gov.co\nPBX: (1)6502200 Ext: 10641","SI","SI","NO","SI",null,{"$f":"CONCATENATE(D141,\"-\",\"Tipo de información\",\" \",V141,\"-\",F141)","v":"C81012022-Tipo de información -PRESTACION DE SERVICIOS DE PROMOCION Y PREVENCION – SERVICIOS_ESPECIALIZADOS_CUENTA_RAMA"}]
["PyP","Gerencia de administración del riesgo","No","C81022022",93141808,"PRESTACION DE SERVICIOS DE PROMOCION Y PREVENCION – SERVICIOS_ESPECIALIZADOS_CUENTA_RAMA","1/01/2022",{"$f":"MONTH(G142)","v":1},"30/11/2022",{"$f":"(I142-G142)/30","v":11.1},"Invitación directa","GastosAdministrativos",260766485,260766485,"No","N/A","Gerencia de Abastecimiento Estratégico\ncontratacion@positiva.gov.co\nPBX: (1)6502200 Ext: 10641","SI","SI","NO","SI",null,{"$f":"CONCATENATE(D142,\"-\",\"Tipo de información\",\" \",V142,\"-\",F142)","v":"C81022022-Tipo de información -PRESTACION DE SERVICIOS DE PROMOCION Y PREVENCION – SERVICIOS_ESPECIALIZADOS_CUENTA_RAMA"}]
["PyP","Gerencia de administración del riesgo","No","C81032022",93141808,"PRESTACION DE SERVICIOS DE PROMOCION Y PREVENCION – SERVICIOS_ESPECIALIZADOS_CUENTA_RAMA","1/01/2022",{"$f":"MONTH(G143)","v":1},"30/11/2022",{"$f":"(I143-G143)/30","v":11.1},"Invitación directa","GastosAdministrativos",343750000,343750000,"No","N/A","Gerencia de Abastecimiento Estratégico\ncontratacion@positiva.gov.co\nPBX: (1)6502200 Ext: 10641","SI","SI","NO","SI",null,{"$f":"CONCATENATE(D143,\"-\",\"Tipo de información\",\" \",V143,\"-\",F143)","v":"C81032022-Tipo de información -PRESTACION DE SERVICIOS DE PROMOCION Y PREVENCION – SERVICIOS_ESPECIALIZADOS_CUENTA_RAMA"}]
["PyP","Gerencia de administración del riesgo","No","C79012022",93141808,"PRESTACION DE SERVICIOS DE PROMOCION Y PREVENCION – SERVICIOS_ESPECIALIZADOS_ZONA_SANTANDER","1/01/2022",{"$f":"MONTH(G144)","v":1},"30/11/2022",{"$f":"(I144-G144)/30","v":11.1},"Invitación directa","GastosAdministrativos",150000000,150000000,"No","N/A","Gerencia de Abastecimiento Estratégico\ncontratacion@positiva.gov.co\nPBX: (1)6502200 Ext: 10641","SI","SI","NO","SI",null,{"$f":"CONCATENATE(D144,\"-\",\"Tipo de información\",\" \",V144,\"-\",F144)","v":"C79012022-Tipo de información -PRESTACION DE SERVICIOS DE PROMOCION Y PREVENCION – SERVICIOS_ESPECIALIZADOS_ZONA_SANTANDER"}]
["PyP","Gerencia de administración del riesgo","No","C79022022",93141808,"PRESTACION DE SERVICIOS DE PROMOCION Y PREVENCION – SERVICIOS_ESPECIALIZADOS_ZONA_SANTANDER","1/01/2022",{"$f":"MONTH(G145)","v":1},"30/11/2022",{"$f":"(I145-G145)/30","v":11.1},"Invitación directa","GastosAdministrativos",220000000,220000000,"No","N/A","Gerencia de Abastecimiento Estratégico\ncontratacion@positiva.gov.co\nPBX: (1)6502200 Ext: 10641","SI","SI","NO","SI",null,{"$f":"CONCATENATE(D145,\"-\",\"Tipo de información\",\" \",V145,\"-\",F145)","v":"C79022022-Tipo de información -PRESTACION DE SERVICIOS DE PROMOCION Y PREVENCION – SERVICIOS_ESPECIALIZADOS_ZONA_SANTANDER"}]
["PyP","Gerencia de administración del riesgo","No","C79032022",93141808,"PRESTACION DE SERVICIOS DE PROMOCION Y PREVENCION – SERVICIOS_ESPECIALIZADOS_ZONA_SANTANDER","1/01/2022",{"$f":"MONTH(G146)","v":1},"30/11/2022",{"$f":"(I146-G146)/30","v":11.1},"Invitación directa","GastosAdministrativos",60000000,60000000,"No","N/A","Gerencia de Abastecimiento Estratégico\ncontratacion@positiva.gov.co\nPBX: (1)6502200 Ext: 10641","SI","SI","NO","SI",null,{"$f":"CONCATENATE(D146,\"-\",\"Tipo de información\",\" \",V146,\"-\",F146)","v":"C79032022-Tipo de información -PRESTACION DE SERVICIOS DE PROMOCION Y PREVENCION – SERVICIOS_ESPECIALIZADOS_ZONA_SANTANDER"}]
["PyP","Gerencia de administración del riesgo","No","C79042022",93141808,"PRESTACION DE SERVICIOS DE PROMOCION Y PREVENCION – SERVICIOS_ESPECIALIZADOS_ZONA_SANTANDER","1/01/2022",{"$f":"MONTH(G147)","v":1},"30/11/2022",{"$f":"(I147-G147)/30","v":11.1},"Invitación directa","GastosAdministrativos",220000000,220000000,"No","N/A","Gerencia de Abastecimiento Estratégico\ncontratacion@positiva.gov.co\nPBX: (1)6502200 Ext: 10641","SI","SI","NO","SI",null,{"$f":"CONCATENATE(D147,\"-\",\"Tipo de información\",\" \",V147,\"-\",F147)","v":"C79042022-Tipo de información -PRESTACION DE SERVICIOS DE PROMOCION Y PREVENCION – SERVICIOS_ESPECIALIZADOS_ZONA_SANTANDER"}]
["PyP","Gerencia de administración del riesgo","No","C79052022",93141808,"PRESTACION DE SERVICIOS DE PROMOCION Y PREVENCION – SERVICIOS_ESPECIALIZADOS_ZONA_SANTANDER","1/01/2022",{"$f":"MONTH(G148)","v":1},"30/11/2022",{"$f":"(I148-G148)/30","v":11.1},"Invitación directa","GastosAdministrativos",85000000,85000000,"No","N/A","Gerencia de Abastecimiento Estratégico\ncontratacion@positiva.gov.co\nPBX: (1)6502200 Ext: 10641","SI","SI","NO","SI",null,{"$f":"CONCATENATE(D148,\"-\",\"Tipo de información\",\" \",V148,\"-\",F148)","v":"C79052022-Tipo de información -PRESTACION DE SERVICIOS DE PROMOCION Y PREVENCION – SERVICIOS_ESPECIALIZADOS_ZONA_SANTANDER"}]
["PyP","Gerencia de administración del riesgo","No","C79062022",93141808,"PRESTACION DE SERVICIOS DE PROMOCION Y PREVENCION – SERVICIOS_ESPECIALIZADOS_ZONA_SANTANDER","1/01/2022",{"$f":"MONTH(G149)","v":1},"30/11/2022",{"$f":"(I149-G149)/30","v":11.1},"Invitación directa","GastosAdministrativos",133462870,133462870,"No","N/A","Gerencia de Abastecimiento Estratégico\ncontratacion@positiva.gov.co\nPBX: (1)6502200 Ext: 10641","SI","SI","NO","SI",null,{"$f":"CONCATENATE(D149,\"-\",\"Tipo de información\",\" \",V149,\"-\",F149)","v":"C79062022-Tipo de información -PRESTACION DE SERVICIOS DE PROMOCION Y PREVENCION – SERVICIOS_ESPECIALIZADOS_ZONA_SANTANDER"}]
["PyP","Gerencia de administración del riesgo","No","C79072022",93141808,"PRESTACION DE SERVICIOS DE PROMOCION Y PREVENCION – SERVICIOS_ESPECIALIZADOS_ZONA_SANTANDER","1/01/2022",{"$f":"MONTH(G150)","v":1},"30/11/2022",{"$f":"(I150-G150)/30","v":11.1},"Invitación directa","GastosAdministrativos",90000000,90000000,"No","N/A","Gerencia de Abastecimiento Estratégico\ncontratacion@positiva.gov.co\nPBX: (1)6502200 Ext: 10641","SI","SI","NO","SI",null,{"$f":"CONCATENATE(D150,\"-\",\"Tipo de información\",\" \",V150,\"-\",F150)","v":"C79072022-Tipo de información -PRESTACION DE SERVICIOS DE PROMOCION Y PREVENCION – SERVICIOS_ESPECIALIZADOS_ZONA_SANTANDER"}]
["PyP","Gerencia de administración del riesgo","No","C79082022",93141808,"PRESTACION DE SERVICIOS DE PROMOCION Y PREVENCION – SERVICIOS_ESPECIALIZADOS_ZONA_SANTANDER","1/01/2022",{"$f":"MONTH(G151)","v":1},"30/11/2022",{"$f":"(I151-G151)/30","v":11.1},"Invitación directa","GastosAdministrativos",150000000,150000000,"No","N/A","Gerencia de Abastecimiento Estratégico\ncontratacion@positiva.gov.co\nPBX: (1)6502200 Ext: 10641","SI","SI","NO","SI",null,{"$f":"CONCATENATE(D151,\"-\",\"Tipo de información\",\" \",V151,\"-\",F151)","v":"C79082022-Tipo de información -PRESTACION DE SERVICIOS DE PROMOCION Y PREVENCION – SERVICIOS_ESPECIALIZADOS_ZONA_SANTANDER"}]
["PyP","Gerencia de administración del riesgo","No","C79092022",93141808,"PRESTACION DE SERVICIOS DE PROMOCION Y PREVENCION – SERVICIOS_ESPECIALIZADOS_ZONA_SANTANDER","1/01/2022",{"$f":"MONTH(G152)","v":1},"30/11/2022",{"$f":"(I152-G152)/30","v":11.1},"Invitación directa","GastosAdministrativos",35000000,35000000,"No","N/A","Gerencia de Abastecimiento Estratégico\ncontratacion@positiva.gov.co\nPBX: (1)6502200 Ext: 10641","SI","SI","NO","SI",null,{"$f":"CONCATENATE(D152,\"-\",\"Tipo de información\",\" \",V152,\"-\",F152)","v":"C79092022-Tipo de información -PRESTACION DE SERVICIOS DE PROMOCION Y PREVENCION – SERVICIOS_ESPECIALIZADOS_ZONA_SANTANDER"}]
["PyP","Gerencia de administración del riesgo","No","C79102022",93141808,"PRESTACION DE SERVICIOS DE PROMOCION Y PREVENCION – SERVICIOS_ESPECIALIZADOS_ZONA_SANTANDER","1/01/2022",{"$f":"MONTH(G153)","v":1},"30/11/2022",{"$f":"(I153-G153)/30","v":11.1},"Invitación directa","GastosAdministrativos",210722891,210722891,"No","N/A","Gerencia de Abastecimiento Estratégico\ncontratacion@positiva.gov.co\nPBX: (1)6502200 Ext: 10641","SI","SI","NO","SI",null,{"$f":"CONCATENATE(D153,\"-\",\"Tipo de información\",\" \",V153,\"-\",F153)","v":"C79102022-Tipo de información -PRESTACION DE SERVICIOS DE PROMOCION Y PREVENCION – SERVICIOS_ESPECIALIZADOS_ZONA_SANTANDER"}]
["PyP","Gerencia de administración del riesgo","No","C79112022",93141808,"PRESTACION DE SERVICIOS DE PROMOCION Y PREVENCION – SERVICIOS_ESPECIALIZADOS_ZONA_SANTANDER","1/01/2022",{"$f":"MONTH(G154)","v":1},"30/11/2022",{"$f":"(I154-G154)/30","v":11.1},"Invitación directa","GastosAdministrativos",100000000,100000000,"No","N/A","Gerencia de Abastecimiento Estratégico\ncontratacion@positiva.gov.co\nPBX: (1)6502200 Ext: 10641","SI","SI","NO","SI",null,{"$f":"CONCATENATE(D154,\"-\",\"Tipo de información\",\" \",V154,\"-\",F154)","v":"C79112022-Tipo de información -PRESTACION DE SERVICIOS DE PROMOCION Y PREVENCION – SERVICIOS_ESPECIALIZADOS_ZONA_SANTANDER"}]
["PyP","Gerencia de administración del riesgo","No","C79122022",93141808,"PRESTACION DE SERVICIOS DE PROMOCION Y PREVENCION – SERVICIOS_ESPECIALIZADOS_ZONA_SANTANDER","1/01/2022",{"$f":"MONTH(G155)","v":1},"30/11/2022",{"$f":"(I155-G155)/30","v":11.1},"Invitación directa","GastosAdministrativos",35000000,35000000,"No","N/A","Gerencia de Abastecimiento Estratégico\ncontratacion@positiva.gov.co\nPBX: (1)6502200 Ext: 10641","SI","SI","NO","SI",null,{"$f":"CONCATENATE(D155,\"-\",\"Tipo de información\",\" \",V155,\"-\",F155)","v":"C79122022-Tipo de información -PRESTACION DE SERVICIOS DE PROMOCION Y PREVENCION – SERVICIOS_ESPECIALIZADOS_ZONA_SANTANDER"}]
["PyP","Gerencia de administración del riesgo","No","C79132022",93141808,"PRESTACION DE SERVICIOS DE PROMOCION Y PREVENCION – SERVICIOS_ESPECIALIZADOS_ZONA_SANTANDER","1/01/2022",{"$f":"MONTH(G156)","v":1},"30/11/2022",{"$f":"(I156-G156)/30","v":11.1},"Invitación directa","GastosAdministrativos",184545296,184545296,"No","N/A","Gerencia de Abastecimiento Estratégico\ncontratacion@positiva.gov.co\nPBX: (1)6502200 Ext: 10641","SI","SI","NO","SI",null,{"$f":"CONCATENATE(D156,\"-\",\"Tipo de información\",\" \",V156,\"-\",F156)","v":"C79132022-Tipo de información -PRESTACION DE SERVICIOS DE PROMOCION Y PREVENCION – SERVICIOS_ESPECIALIZADOS_ZONA_SANTANDER"}]
["PyP","Gerencia de administración del riesgo","No","C79142022",93141808,"PRESTACION DE SERVICIOS DE PROMOCION Y PREVENCION – SERVICIOS_ESPECIALIZADOS_ZONA_SANTANDER","1/01/2022",{"$f":"MONTH(G157)","v":1},"30/11/2022",{"$f":"(I157-G157)/30","v":11.1},"Invitación directa","GastosAdministrativos",226000000,226000000,"No","N/A","Gerencia de Abastecimiento Estratégico\ncontratacion@positiva.gov.co\nPBX: (1)6502200 Ext: 10641","SI","SI","NO","SI",null,{"$f":"CONCATENATE(D157,\"-\",\"Tipo de información\",\" \",V157,\"-\",F157)","v":"C79142022-Tipo de información -PRESTACION DE SERVICIOS DE PROMOCION Y PREVENCION – SERVICIOS_ESPECIALIZADOS_ZONA_SANTANDER"}]
["PyP","Gerencia de administración del riesgo","No","C79152022",93141808,"PRESTACION DE SERVICIOS DE PROMOCION Y PREVENCION – SERVICIOS_ESPECIALIZADOS_ZONA_SANTANDER","1/01/2022",{"$f":"MONTH(G158)","v":1},"30/11/2022",{"$f":"(I158-G158)/30","v":11.1},"Invitación directa","GastosAdministrativos",50000000,50000000,"No","N/A","Gerencia de Abastecimiento Estratégico\ncontratacion@positiva.gov.co\nPBX: (1)6502200 Ext: 10641","SI","SI","NO","SI",null,{"$f":"CONCATENATE(D158,\"-\",\"Tipo de información\",\" \",V158,\"-\",F158)","v":"C79152022-Tipo de información -PRESTACION DE SERVICIOS DE PROMOCION Y PREVENCION – SERVICIOS_ESPECIALIZADOS_ZONA_SANTANDER"}]
["PyP","Gerencia de administración del riesgo","No","C79162022",93141808,"PRESTACION DE SERVICIOS DE PROMOCION Y PREVENCION – SERVICIOS_ESPECIALIZADOS_ZONA_SANTANDER","1/01/2022",{"$f":"MONTH(G159)","v":1},"30/11/2022",{"$f":"(I159-G159)/30","v":11.1},"Invitación directa","GastosAdministrativos",65000000,65000000,"No","N/A","Gerencia de Abastecimiento Estratégico\ncontratacion@positiva.gov.co\nPBX: (1)6502200 Ext: 10641","SI","SI","NO","SI",null,{"$f":"CONCATENATE(D159,\"-\",\"Tipo de información\",\" \",V159,\"-\",F159)","v":"C79162022-Tipo de información -PRESTACION DE SERVICIOS DE PROMOCION Y PREVENCION – SERVICIOS_ESPECIALIZADOS_ZONA_SANTANDER"}]
["PyP","Gerencia de administración del riesgo","No","C79172022",93141808,"PRESTACION DE SERVICIOS DE PROMOCION Y PREVENCION – SERVICIOS_ESPECIALIZADOS_ZONA_SANTANDER","1/01/2022",{"$f":"MONTH(G160)","v":1},"30/11/2022",{"$f":"(I160-G160)/30","v":11.1},"Invitación directa","GastosAdministrativos",100000000,100000000,"No","N/A","Gerencia de Abastecimiento Estratégico\ncontratacion@positiva.gov.co\nPBX: (1)6502200 Ext: 10641","SI","SI","NO","SI",null,{"$f":"CONCATENATE(D160,\"-\",\"Tipo de información\",\" \",V160,\"-\",F160)","v":"C79172022-Tipo de información -PRESTACION DE SERVICIOS DE PROMOCION Y PREVENCION – SERVICIOS_ESPECIALIZADOS_ZONA_SANTANDER"}]
["PyP","Gerencia de administración del riesgo","No","C79182022",93141808,"PRESTACION DE SERVICIOS DE PROMOCION Y PREVENCION – SERVICIOS_ESPECIALIZADOS_ZONA_SANTANDER","1/01/2022",{"$f":"MONTH(G161)","v":1},"30/11/2022",{"$f":"(I161-G161)/30","v":11.1},"Invitación directa","GastosAdministrativos",170000000,170000000,"No","N/A","Gerencia de Abastecimiento Estratégico\ncontratacion@positiva.gov.co\nPBX: (1)6502200 Ext: 10641","SI","SI","NO","SI",null,{"$f":"CONCATENATE(D161,\"-\",\"Tipo de información\",\" \",V161,\"-\",F161)","v":"C79182022-Tipo de información -PRESTACION DE SERVICIOS DE PROMOCION Y PREVENCION – SERVICIOS_ESPECIALIZADOS_ZONA_SANTANDER"}]
["PyP","Gerencia de administración del riesgo","No","C79192022",93141808,"PRESTACION DE SERVICIOS DE PROMOCION Y PREVENCION – SERVICIOS_ESPECIALIZADOS_ZONA_SANTANDER","1/01/2022",{"$f":"MONTH(G162)","v":1},"30/11/2022",{"$f":"(I162-G162)/30","v":11.1},"Invitación directa","GastosAdministrativos",176000000,176000000,"No","N/A","Gerencia de Abastecimiento Estratégico\ncontratacion@positiva.gov.co\nPBX: (1)6502200 Ext: 10641","SI","SI","NO","SI",null,{"$f":"CONCATENATE(D162,\"-\",\"Tipo de información\",\" \",V162,\"-\",F162)","v":"C79192022-Tipo de información -PRESTACION DE SERVICIOS DE PROMOCION Y PREVENCION – SERVICIOS_ESPECIALIZADOS_ZONA_SANTANDER"}]
["PyP","Gerencia de administración del riesgo","No","C79202022",93141808,"PRESTACION DE SERVICIOS DE PROMOCION Y PREVENCION – SERVICIOS_ESPECIALIZADOS_ZONA_SANTANDER","1/01/2022",{"$f":"MONTH(G163)","v":1},"30/11/2022",{"$f":"(I163-G163)/30","v":11.1},"Invitación directa","GastosAdministrativos",330000000,330000000,"No","N/A","Gerencia de Abastecimiento Estratégico\ncontratacion@positiva.gov.co\nPBX: (1)6502200 Ext: 10641","SI","SI","NO","SI",null,{"$f":"CONCATENATE(D163,\"-\",\"Tipo de información\",\" \",V163,\"-\",F163)","v":"C79202022-Tipo de información -PRESTACION DE SERVICIOS DE PROMOCION Y PREVENCION – SERVICIOS_ESPECIALIZADOS_ZONA_SANTANDER"}]
["PyP","Gerencia de administración del riesgo","No","C79212022",93141808,"PRESTACION DE SERVICIOS DE PROMOCION Y PREVENCION – SERVICIOS_ESPECIALIZADOS_ZONA_SANTANDER","1/01/2022",{"$f":"MONTH(G164)","v":1},"30/11/2022",{"$f":"(I164-G164)/30","v":11.1},"Invitación directa","GastosAdministrativos",65000000,65000000,"No","N/A","Gerencia de Abastecimiento Estratégico\ncontratacion@positiva.gov.co\nPBX: (1)6502200 Ext: 10641","SI","SI","NO","SI",null,{"$f":"CONCATENATE(D164,\"-\",\"Tipo de información\",\" \",V164,\"-\",F164)","v":"C79212022-Tipo de información -PRESTACION DE SERVICIOS DE PROMOCION Y PREVENCION – SERVICIOS_ESPECIALIZADOS_ZONA_SANTANDER"}]
["PyP","Gerencia de administración del riesgo","No","C79222022",93141808,"PRESTACION DE SERVICIOS DE PROMOCION Y PREVENCION – SERVICIOS_ESPECIALIZADOS_ZONA_SANTANDER","1/01/2022",{"$f":"MONTH(G165)","v":1},"30/11/2022",{"$f":"(I165-G165)/30","v":11.1},"Invitación directa","GastosAdministrativos",50470128,50470128,"No","N/A","Gerencia de Abastecimiento Estratégico\ncontratacion@positiva.gov.co\nPBX: (1)6502200 Ext: 10641","SI","SI","NO","SI",null,{"$f":"CONCATENATE(D165,\"-\",\"Tipo de información\",\" \",V165,\"-\",F165)","v":"C79222022-Tipo de información -PRESTACION DE SERVICIOS DE PROMOCION Y PREVENCION – SERVICIOS_ESPECIALIZADOS_ZONA_SANTANDER"}]
["PyP","Gerencia de administración del riesgo","No","C79232022",93141808,"PRESTACION DE SERVICIOS DE PROMOCION Y PREVENCION – SERVICIOS_ESPECIALIZADOS_ZONA_SANTANDER","1/01/2022",{"$f":"MONTH(G166)","v":1},"30/11/2022",{"$f":"(I166-G166)/30","v":11.1},"Invitación directa","GastosAdministrativos",55000000,55000000,"No","N/A","Gerencia de Abastecimiento Estratégico\ncontratacion@positiva.gov.co\nPBX: (1)6502200 Ext: 10641","SI","SI","NO","SI",null,{"$f":"CONCATENATE(D166,\"-\",\"Tipo de información\",\" \",V166,\"-\",F166)","v":"C79232022-Tipo de información -PRESTACION DE SERVICIOS DE PROMOCION Y PREVENCION – SERVICIOS_ESPECIALIZADOS_ZONA_SANTANDER"}]
["PyP","Gerencia de administración del riesgo","No","C80012022",93141808,"PRESTACION DE SERVICIOS DE PROMOCION Y PREVENCION – SERVICIOS_ESPECIALIZADOS_ZONA_VALLE","1/01/2022",{"$f":"MONTH(G167)","v":1},"30/11/2022",{"$f":"(I167-G167)/30","v":11.1},"Invitación directa","GastosAdministrativos",160714286,160714286,"No","N/A","Gerencia de Abastecimiento Estratégico\ncontratacion@positiva.gov.co\nPBX: (1)6502200 Ext: 10641","SI","SI","NO","SI",null,{"$f":"CONCATENATE(D167,\"-\",\"Tipo de información\",\" \",V167,\"-\",F167)","v":"C80012022-Tipo de información -PRESTACION DE SERVICIOS DE PROMOCION Y PREVENCION – SERVICIOS_ESPECIALIZADOS_ZONA_VALLE"}]
["PyP","Gerencia de administración del riesgo","No","C80022022",93141808,"PRESTACION DE SERVICIOS DE PROMOCION Y PREVENCION – SERVICIOS_ESPECIALIZADOS_ZONA_VALLE","1/01/2022",{"$f":"MONTH(G168)","v":1},"30/11/2022",{"$f":"(I168-G168)/30","v":11.1},"Invitación directa","GastosAdministrativos",56701031,56701031,"No","N/A","Gerencia de Abastecimiento Estratégico\ncontratacion@positiva.gov.co\nPBX: (1)6502200 Ext: 10641","SI","SI","NO","SI",null,{"$f":"CONCATENATE(D168,\"-\",\"Tipo de información\",\" \",V168,\"-\",F168)","v":"C80022022-Tipo de información -PRESTACION DE SERVICIOS DE PROMOCION Y PREVENCION – SERVICIOS_ESPECIALIZADOS_ZONA_VALLE"}]
["PyP","Gerencia de administración del riesgo","No","C80032022",93141808,"PRESTACION DE SERVICIOS DE PROMOCION Y PREVENCION – SERVICIOS_ESPECIALIZADOS_ZONA_VALLE","1/01/2022",{"$f":"MONTH(G169)","v":1},"30/11/2022",{"$f":"(I169-G169)/30","v":11.1},"Invitación directa","GastosAdministrativos",105201342,105201342,"No","N/A","Gerencia de Abastecimiento Estratégico\ncontratacion@positiva.gov.co\nPBX: (1)6502200 Ext: 10641","SI","SI","NO","SI",null,{"$f":"CONCATENATE(D169,\"-\",\"Tipo de información\",\" \",V169,\"-\",F169)","v":"C80032022-Tipo de información -PRESTACION DE SERVICIOS DE PROMOCION Y PREVENCION – SERVICIOS_ESPECIALIZADOS_ZONA_VALLE"}]
["PyP","Gerencia de administración del riesgo","No","C80042022",93141808,"PRESTACION DE SERVICIOS DE PROMOCION Y PREVENCION – SERVICIOS_ESPECIALIZADOS_ZONA_VALLE","1/01/2022",{"$f":"MONTH(G170)","v":1},"30/11/2022",{"$f":"(I170-G170)/30","v":11.1},"Invitación directa","GastosAdministrativos",174834437,174834437,"No","N/A","Gerencia de Abastecimiento Estratégico\ncontratacion@positiva.gov.co\nPBX: (1)6502200 Ext: 10641","SI","SI","NO","SI",null,{"$f":"CONCATENATE(D170,\"-\",\"Tipo de información\",\" \",V170,\"-\",F170)","v":"C80042022-Tipo de información -PRESTACION DE SERVICIOS DE PROMOCION Y PREVENCION – SERVICIOS_ESPECIALIZADOS_ZONA_VALLE"}]
["PyP","Gerencia de administración del riesgo","No","C80052022",93141808,"PRESTACION DE SERVICIOS DE PROMOCION Y PREVENCION – SERVICIOS_ESPECIALIZADOS_ZONA_VALLE","1/01/2022",{"$f":"MONTH(G171)","v":1},"30/11/2022",{"$f":"(I171-G171)/30","v":11.1},"Invitación directa","GastosAdministrativos",382108894,382108894,"No","N/A","Gerencia de Abastecimiento Estratégico\ncontratacion@positiva.gov.co\nPBX: (1)6502200 Ext: 10641","SI","SI","NO","SI",null,{"$f":"CONCATENATE(D171,\"-\",\"Tipo de información\",\" \",V171,\"-\",F171)","v":"C80052022-Tipo de información -PRESTACION DE SERVICIOS DE PROMOCION Y PREVENCION – SERVICIOS_ESPECIALIZADOS_ZONA_VALLE"}]
["PyP","Gerencia de administración del riesgo","No","C80062022",93141808,"PRESTACION DE SERVICIOS DE PROMOCION Y PREVENCION – SERVICIOS_ESPECIALIZADOS_ZONA_VALLE","1/01/2022",{"$f":"MONTH(G172)","v":1},"30/11/2022",{"$f":"(I172-G172)/30","v":11.1},"Invitación directa","GastosAdministrativos",889221557,889221557,"No","N/A","Gerencia de Abastecimiento Estratégico\ncontratacion@positiva.gov.co\nPBX: (1)6502200 Ext: 10641","SI","SI","NO","SI",null,{"$f":"CONCATENATE(D172,\"-\",\"Tipo de información\",\" \",V172,\"-\",F172)","v":"C80062022-Tipo de información -PRESTACION DE SERVICIOS DE PROMOCION Y PREVENCION – SERVICIOS_ESPECIALIZADOS_ZONA_VALLE"}]
["PyP","Gerencia de administración del riesgo","No","C80072022",93141808,"PRESTACION DE SERVICIOS DE PROMOCION Y PREVENCION – SERVICIOS_ESPECIALIZADOS_ZONA_VALLE","1/01/2022",{"$f":"MONTH(G173)","v":1},"30/11/2022",{"$f":"(I173-G173)/30","v":11.1},"Invitación directa","GastosAdministrativos",316530612,316530612,"No","N/A","Gerencia de Abastecimiento Estratégico\ncontratacion@positiva.gov.co\nPBX: (1)6502200 Ext: 10641","SI","SI","NO","SI",null,{"$f":"CONCATENATE(D173,\"-\",\"Tipo de información\",\" \",V173,\"-\",F173)","v":"C80072022-Tipo de información -PRESTACION DE SERVICIOS DE PROMOCION Y PREVENCION – SERVICIOS_ESPECIALIZADOS_ZONA_VALLE"}]
["PyP","Gerencia de administración del riesgo","No","C80082022",93141808,"PRESTACION DE SERVICIOS DE PROMOCION Y PREVENCION – SERVICIOS_ESPECIALIZADOS_ZONA_VALLE","1/01/2022",{"$f":"MONTH(G174)","v":1},"30/11/2022",{"$f":"(I174-G174)/30","v":11.1},"Invitación directa","GastosAdministrativos",200000000,200000000,"No","N/A","Gerencia de Abastecimiento Estratégico\ncontratacion@positiva.gov.co\nPBX: (1)6502200 Ext: 10641","SI","SI","NO","SI",null,{"$f":"CONCATENATE(D174,\"-\",\"Tipo de información\",\" \",V174,\"-\",F174)","v":"C80082022-Tipo de información -PRESTACION DE SERVICIOS DE PROMOCION Y PREVENCION – SERVICIOS_ESPECIALIZADOS_ZONA_VALLE"}]
["PyP","Gerencia de administración del riesgo","No","C80092022",93141808,"PRESTACION DE SERVICIOS DE PROMOCION Y PREVENCION – SERVICIOS_ESPECIALIZADOS_ZONA_VALLE","1/01/2022",{"$f":"MONTH(G175)","v":1},"30/11/2022",{"$f":"(I175-G175)/30","v":11.1},"Invitación directa","GastosAdministrativos",200000000,200000000,"No","N/A","Gerencia de Abastecimiento Estratégico\ncontratacion@positiva.gov.co\nPBX: (1)6502200 Ext: 10641","SI","SI","NO","SI",null,{"$f":"CONCATENATE(D175,\"-\",\"Tipo de información\",\" \",V175,\"-\",F175)","v":"C80092022-Tipo de información -PRESTACION DE SERVICIOS DE PROMOCION Y PREVENCION – SERVICIOS_ESPECIALIZADOS_ZONA_VALLE"}]
["PyP","Gerencia de administración del riesgo","No","C80102022",93141808,"PRESTACION DE SERVICIOS DE PROMOCION Y PREVENCION – SERVICIOS_ESPECIALIZADOS_ZONA_VALLE","1/01/2022",{"$f":"MONTH(G176)","v":1},"30/11/2022",{"$f":"(I176-G176)/30","v":11.1},"Invitación directa","GastosAdministrativos",60000000,60000000,"No","N/A","Gerencia de Abastecimiento Estratégico\ncontratacion@positiva.gov.co\nPBX: (1)6502200 Ext: 10641","SI","SI","NO","SI",null,{"$f":"CONCATENATE(D176,\"-\",\"Tipo de información\",\" \",V176,\"-\",F176)","v":"C80102022-Tipo de información -PRESTACION DE SERVICIOS DE PROMOCION Y PREVENCION – SERVICIOS_ESPECIALIZADOS_ZONA_VALLE"}]
["PyP","Gerencia de administración del riesgo","No","C80112022",93141808,"PRESTACION DE SERVICIOS DE PROMOCION Y PREVENCION – SERVICIOS_ESPECIALIZADOS_ZONA_VALLE","1/01/2022",{"$f":"MONTH(G177)","v":1},"30/11/2022",{"$f":"(I177-G177)/30","v":11.1},"Invitación directa","GastosAdministrativos",90000000,90000000,"No","N/A","Gerencia de Abastecimiento Estratégico\ncontratacion@positiva.gov.co\nPBX: (1)6502200 Ext: 10641","SI","SI","NO","SI",null,{"$f":"CONCATENATE(D177,\"-\",\"Tipo de información\",\" \",V177,\"-\",F177)","v":"C80112022-Tipo de información -PRESTACION DE SERVICIOS DE PROMOCION Y PREVENCION – SERVICIOS_ESPECIALIZADOS_ZONA_VALLE"}]
["PyP","Gerencia de administración del riesgo","No","C80122022",93141808,"PRESTACION DE SERVICIOS DE PROMOCION Y PREVENCION – SERVICIOS_ESPECIALIZADOS_ZONA_VALLE","1/01/2022",{"$f":"MONTH(G178)","v":1},"30/11/2022",{"$f":"(I178-G178)/30","v":11.1},"Invitación directa","GastosAdministrativos",75000000,75000000,"No","N/A","Gerencia de Abastecimiento Estratégico\ncontratacion@positiva.gov.co\nPBX: (1)6502200 Ext: 10641","SI","SI","NO","SI",null,{"$f":"CONCATENATE(D178,\"-\",\"Tipo de información\",\" \",V178,\"-\",F178)","v":"C80122022-Tipo de información -PRESTACION DE SERVICIOS DE PROMOCION Y PREVENCION – SERVICIOS_ESPECIALIZADOS_ZONA_VALLE"}]
["PyP","Gerencia de administración del riesgo","No","C80132022",93141808,"PRESTACION DE SERVICIOS DE PROMOCION Y PREVENCION – SERVICIOS_ESPECIALIZADOS_ZONA_VALLE","1/01/2022",{"$f":"MONTH(G179)","v":1},"30/11/2022",{"$f":"(I179-G179)/30","v":11.1},"Invitación directa","GastosAdministrativos",450000000,450000000,"No","N/A","Gerencia de Abastecimiento Estratégico\ncontratacion@positiva.gov.co\nPBX: (1)6502200 Ext: 10641","SI","SI","NO","SI",null,{"$f":"CONCATENATE(D179,\"-\",\"Tipo de información\",\" \",V179,\"-\",F179)","v":"C80132022-Tipo de información -PRESTACION DE SERVICIOS DE PROMOCION Y PREVENCION – SERVICIOS_ESPECIALIZADOS_ZONA_VALLE"}]
["PyP","Gerencia de administración del riesgo","No","C80142022",93141808,"PRESTACION DE SERVICIOS DE PROMOCION Y PREVENCION – SERVICIOS_ESPECIALIZADOS_ZONA_VALLE","1/01/2022",{"$f":"MONTH(G180)","v":1},"30/11/2022",{"$f":"(I180-G180)/30","v":11.1},"Invitación directa","GastosAdministrativos",60000000,60000000,"No","N/A","Gerencia de Abastecimiento Estratégico\ncontratacion@positiva.gov.co\nPBX: (1)6502200 Ext: 10641","SI","SI","NO","SI",null,{"$f":"CONCATENATE(D180,\"-\",\"Tipo de información\",\" \",V180,\"-\",F180)","v":"C80142022-Tipo de información -PRESTACION DE SERVICIOS DE PROMOCION Y PREVENCION – SERVICIOS_ESPECIALIZADOS_ZONA_VALLE"}]
["PyP","Gerencia de administración del riesgo","No","C80152022",93141808,"PRESTACION DE SERVICIOS DE PROMOCION Y PREVENCION – SERVICIOS_ESPECIALIZADOS_ZONA_VALLE","1/01/2022",{"$f":"MONTH(G181)","v":1},"30/11/2022",{"$f":"(I181-G181)/30","v":11.1},"Invitación directa","GastosAdministrativos",90000000,90000000,"No","N/A","Gerencia de Abastecimiento Estratégico\ncontratacion@positiva.gov.co\nPBX: (1)6502200 Ext: 10641","SI","SI","NO","SI",null,{"$f":"CONCATENATE(D181,\"-\",\"Tipo de información\",\" \",V181,\"-\",F181)","v":"C80152022-Tipo de información -PRESTACION DE SERVICIOS DE PROMOCION Y PREVENCION – SERVICIOS_ESPECIALIZADOS_ZONA_VALLE"}]
["PyP","Gerencia de administración del riesgo","No","C80162022",93141808,"PRESTACION DE SERVICIOS DE PROMOCION Y PREVENCION – SERVICIOS_ESPECIALIZADOS_ZONA_VALLE","1/01/2022",{"$f":"MONTH(G182)","v":1},"30/11/2022",{"$f":"(I182-G182)/30","v":11.1},"Invitación directa","GastosAdministrativos",416701769,416701769,"No","N/A","Gerencia de Abastecimiento Estratégico\ncontratacion@positiva.gov.co\nPBX: (1)6502200 Ext: 10641","SI","SI","NO","SI",null,{"$f":"CONCATENATE(D182,\"-\",\"Tipo de información\",\" \",V182,\"-\",F182)","v":"C80162022-Tipo de información -PRESTACION DE SERVICIOS DE PROMOCION Y PREVENCION – SERVICIOS_ESPECIALIZADOS_ZONA_VALLE"}]
["PyP","Gerencia de administración del riesgo","No","C80172022",93141808,"PRESTACION DE SERVICIOS DE PROMOCION Y PREVENCION – SERVICIOS_ESPECIALIZADOS_ZONA_VALLE","1/01/2022",{"$f":"MONTH(G183)","v":1},"30/11/2022",{"$f":"(I183-G183)/30","v":11.1},"Invitación directa","GastosAdministrativos",22000000,22000000,"No","N/A","Gerencia de Abastecimiento Estratégico\ncontratacion@positiva.gov.co\nPBX: (1)6502200 Ext: 10641","SI","SI","NO","SI",null,{"$f":"CONCATENATE(D183,\"-\",\"Tipo de información\",\" \",V183,\"-\",F183)","v":"C80172022-Tipo de información -PRESTACION DE SERVICIOS DE PROMOCION Y PREVENCION – SERVICIOS_ESPECIALIZADOS_ZONA_VALLE"}]
["PyP","Gerencia de administración del riesgo","No","C80182022",93141808,"PRESTACION DE SERVICIOS DE PROMOCION Y PREVENCION – SERVICIOS_ESPECIALIZADOS_ZONA_VALLE","1/01/2022",{"$f":"MONTH(G184)","v":1},"30/11/2022",{"$f":"(I184-G184)/30","v":11.1},"Invitación directa","GastosAdministrativos",572068711,572068711,"No","N/A","Gerencia de Abastecimiento Estratégico\ncontratacion@positiva.gov.co\nPBX: (1)6502200 Ext: 10641","SI","SI","NO","SI",null,{"$f":"CONCATENATE(D184,\"-\",\"Tipo de información\",\" \",V184,\"-\",F184)","v":"C80182022-Tipo de información -PRESTACION DE SERVICIOS DE PROMOCION Y PREVENCION – SERVICIOS_ESPECIALIZADOS_ZONA_VALLE"}]
["PyP","Gerencia de administración del riesgo","No","C80192022",93141808,"PRESTACION DE SERVICIOS DE PROMOCION Y PREVENCION – SERVICIOS_ESPECIALIZADOS_ZONA_VALLE","1/01/2022",{"$f":"MONTH(G185)","v":1},"30/11/2022",{"$f":"(I185-G185)/30","v":11.1},"Invitación directa","GastosAdministrativos",55000000,55000000,"No","N/A","Gerencia de Abastecimiento Estratégico\ncontratacion@positiva.gov.co\nPBX: (1)6502200 Ext: 10641","SI","SI","NO","SI",null,{"$f":"CONCATENATE(D185,\"-\",\"Tipo de información\",\" \",V185,\"-\",F185)","v":"C80192022-Tipo de información -PRESTACION DE SERVICIOS DE PROMOCION Y PREVENCION – SERVICIOS_ESPECIALIZADOS_ZONA_VALLE"}]
["PyP","Gerencia de administración del riesgo","No","C80202022",93141808,"PRESTACION DE SERVICIOS DE PROMOCION Y PREVENCION – SERVICIOS_ESPECIALIZADOS_ZONA_VALLE","1/01/2022",{"$f":"MONTH(G186)","v":1},"30/11/2022",{"$f":"(I186-G186)/30","v":11.1},"Invitación cerrada","GastosAdministrativos",450000000,450000000,"No","N/A","Gerencia de Abastecimiento Estratégico\ncontratacion@positiva.gov.co\nPBX: (1)6502200 Ext: 10641","SI","SI","NO","SI",null,{"$f":"CONCATENATE(D186,\"-\",\"Tipo de información\",\" \",V186,\"-\",F186)","v":"C80202022-Tipo de información -PRESTACION DE SERVICIOS DE PROMOCION Y PREVENCION – SERVICIOS_ESPECIALIZADOS_ZONA_VALLE"}]
["PyP","Gerencia de administración del riesgo","No","C80212022",93141808,"PRESTACION DE SERVICIOS DE PROMOCION Y PREVENCION – SERVICIOS_ESPECIALIZADOS_ZONA_VALLE","1/01/2022",{"$f":"MONTH(G187)","v":1},"30/11/2022",{"$f":"(I187-G187)/30","v":11.1},"Invitación directa","GastosAdministrativos",200000000,200000000,"No","N/A","Gerencia de Abastecimiento Estratégico\ncontratacion@positiva.gov.co\nPBX: (1)6502200 Ext: 10641","SI","SI","NO","SI",null,{"$f":"CONCATENATE(D187,\"-\",\"Tipo de información\",\" \",V187,\"-\",F187)","v":"C80212022-Tipo de información -PRESTACION DE SERVICIOS DE PROMOCION Y PREVENCION – SERVICIOS_ESPECIALIZADOS_ZONA_VALLE"}]
["PyP","Gerencia de administración del riesgo","No","C80222022",93141808,"PRESTACION DE SERVICIOS DE PROMOCION Y PREVENCION – SERVICIOS_ESPECIALIZADOS_ZONA_VALLE","1/01/2022",{"$f":"MONTH(G188)","v":1},"30/11/2022",{"$f":"(I188-G188)/30","v":11.1},"Invitación directa","GastosAdministrativos",100000000,100000000,"No","N/A","Gerencia de Abastecimiento Estratégico\ncontratacion@positiva.gov.co\nPBX: (1)6502200 Ext: 10641","SI","SI","NO","SI",null,{"$f":"CONCATENATE(D188,\"-\",\"Tipo de información\",\" \",V188,\"-\",F188)","v":"C80222022-Tipo de información -PRESTACION DE SERVICIOS DE PROMOCION Y PREVENCION – SERVICIOS_ESPECIALIZADOS_ZONA_VALLE"}]
["PyP","Gerencia de administración del riesgo","No","C80232022",93141808,"PRESTACION DE SERVICIOS DE PROMOCION Y PREVENCION – SERVICIOS_ESPECIALIZADOS_ZONA_VALLE","1/01/2022",{"$f":"MONTH(G189)","v":1},"30/11/2022",{"$f":"(I189-G189)/30","v":11.1},"Invitación directa","GastosAdministrativos",27000000,27000000,"No","N/A","Gerencia de Abastecimiento Estratégico\ncontratacion@positiva.gov.co\nPBX: (1)6502200 Ext: 10641","SI","SI","NO","SI",null,{"$f":"CONCATENATE(D189,\"-\",\"Tipo de información\",\" \",V189,\"-\",F189)","v":"C80232022-Tipo de información -PRESTACION DE SERVICIOS DE PROMOCION Y PREVENCION – SERVICIOS_ESPECIALIZADOS_ZONA_VALLE"}]
["PyP","Gerencia de administración del riesgo","No","C80242022",93141808,"PRESTACION DE SERVICIOS DE PROMOCION Y PREVENCION – SERVICIOS_ESPECIALIZADOS_ZONA_VALLE","1/01/2022",{"$f":"MONTH(G190)","v":1},"30/11/2022",{"$f":"(I190-G190)/30","v":11.1},"Invitación directa","GastosAdministrativos",138914237,138914237,"No","N/A","Gerencia de Abastecimiento Estratégico\ncontratacion@positiva.gov.co\nPBX: (1)6502200 Ext: 10641","SI","SI","NO","SI",null,{"$f":"CONCATENATE(D190,\"-\",\"Tipo de información\",\" \",V190,\"-\",F190)","v":"C80242022-Tipo de información -PRESTACION DE SERVICIOS DE PROMOCION Y PREVENCION – SERVICIOS_ESPECIALIZADOS_ZONA_VALLE"}]
["PyP","Gerencia de administración del riesgo","No","C80252022",93141808,"PRESTACION DE SERVICIOS DE PROMOCION Y PREVENCION – SERVICIOS_ESPECIALIZADOS_ZONA_VALLE","1/01/2022",{"$f":"MONTH(G191)","v":1},"30/11/2022",{"$f":"(I191-G191)/30","v":11.1},"Invitación directa","GastosAdministrativos",199450549,199450549,"No","N/A","Gerencia de Abastecimiento Estratégico\ncontratacion@positiva.gov.co\nPBX: (1)6502200 Ext: 10641","SI","SI","NO","SI",null,{"$f":"CONCATENATE(D191,\"-\",\"Tipo de información\",\" \",V191,\"-\",F191)","v":"C80252022-Tipo de información -PRESTACION DE SERVICIOS DE PROMOCION Y PREVENCION – SERVICIOS_ESPECIALIZADOS_ZONA_VALLE"}]
["PyP","Gerencia de administración del riesgo","No","C80262022",93141808,"PRESTACION DE SERVICIOS DE PROMOCION Y PREVENCION – SERVICIOS_ESPECIALIZADOS_ZONA_VALLE","1/01/2022",{"$f":"MONTH(G192)","v":1},"30/11/2022",{"$f":"(I192-G192)/30","v":11.1},"Invitación directa","GastosAdministrativos",127729791,127729791,"No","N/A","Gerencia de Abastecimiento Estratégico\ncontratacion@positiva.gov.co\nPBX: (1)6502200 Ext: 10641","SI","SI","NO","SI",null,{"$f":"CONCATENATE(D192,\"-\",\"Tipo de información\",\" \",V192,\"-\",F192)","v":"C80262022-Tipo de información -PRESTACION DE SERVICIOS DE PROMOCION Y PREVENCION – SERVICIOS_ESPECIALIZADOS_ZONA_VALLE"}]
["PyP","Gerencia de administración del riesgo","No","C76322022",93141808,"PRESTACION DE SERVICIOS DE PROMOCION Y PREVENCION – SERVICIOS_ESPECIALIZADOS_ZONA_ATLANTICO","1/01/2022",{"$f":"MONTH(G193)","v":1},"30/11/2022",{"$f":"(I193-G193)/30","v":11.1},"Invitación directa","GastosAdministrativos",34946600,34946600,"No","N/A","Gerencia de Abastecimiento Estratégico\ncontratacion@positiva.gov.co\nPBX: (1)6502200 Ext: 10641","SI","SI","NO","SI",null,{"$f":"CONCATENATE(D193,\"-\",\"Tipo de información\",\" \",V193,\"-\",F193)","v":"C76322022-Tipo de información -PRESTACION DE SERVICIOS DE PROMOCION Y PREVENCION – SERVICIOS_ESPECIALIZADOS_ZONA_ATLANTICO"}]
["PyP","Gerencia de administración del riesgo","No","C77042022",93141808,"PRESTACION DE SERVICIOS DE PROMOCION Y PREVENCION – SERVICIOS_ESPECIALIZADOS_ZONA_BOGOTA","1/01/2022",{"$f":"MONTH(G194)","v":1},"30/11/2022",{"$f":"(I194-G194)/30","v":11.1},"Invitación directa","GastosAdministrativos",1200000000,1200000000,"No","N/A","Gerencia de Abastecimiento Estratégico\ncontratacion@positiva.gov.co\nPBX: (1)6502200 Ext: 10641","SI","SI","NO","SI",null,{"$f":"CONCATENATE(D194,\"-\",\"Tipo de información\",\" \",V194,\"-\",F194)","v":"C77042022-Tipo de información -PRESTACION DE SERVICIOS DE PROMOCION Y PREVENCION – SERVICIOS_ESPECIALIZADOS_ZONA_BOGOTA"}]
["PyP","Gerencia de administración del riesgo","No","C77052022",93141808,"PRESTACION DE SERVICIOS DE PROMOCION Y PREVENCION – SERVICIOS_ESPECIALIZADOS_ZONA_BOGOTA","1/01/2022",{"$f":"MONTH(G195)","v":1},"30/11/2022",{"$f":"(I195-G195)/30","v":11.1},"Invitación directa","GastosAdministrativos",175220196,175220196,"No","N/A","Gerencia de Abastecimiento Estratégico\ncontratacion@positiva.gov.co\nPBX: (1)6502200 Ext: 10641","SI","SI","NO","SI",null,{"$f":"CONCATENATE(D195,\"-\",\"Tipo de información\",\" \",V195,\"-\",F195)","v":"C77052022-Tipo de información -PRESTACION DE SERVICIOS DE PROMOCION Y PREVENCION – SERVICIOS_ESPECIALIZADOS_ZONA_BOGOTA"}]
["PyP","Gerencia de administración del riesgo","No","C77062022",93141808,"PRESTACION DE SERVICIOS DE PROMOCION Y PREVENCION – SERVICIOS_ESPECIALIZADOS_ZONA_BOGOTA","1/01/2022",{"$f":"MONTH(G196)","v":1},"30/11/2022",{"$f":"(I196-G196)/30","v":11.1},"Invitación directa","GastosAdministrativos",300000000,300000000,"No","N/A","Gerencia de Abastecimiento Estratégico\ncontratacion@positiva.gov.co\nPBX: (1)6502200 Ext: 10641","SI","SI","NO","SI",null,{"$f":"CONCATENATE(D196,\"-\",\"Tipo de información\",\" \",V196,\"-\",F196)","v":"C77062022-Tipo de información -PRESTACION DE SERVICIOS DE PROMOCION Y PREVENCION – SERVICIOS_ESPECIALIZADOS_ZONA_BOGOTA"}]
["PyP","Gerencia de administración del riesgo","No","C77072022",93141808,"PRESTACION DE SERVICIOS DE PROMOCION Y PREVENCION – SERVICIOS_ESPECIALIZADOS_ZONA_BOGOTA","1/01/2022",{"$f":"MONTH(G197)","v":1},"30/11/2022",{"$f":"(I197-G197)/30","v":11.1},"Invitación directa","GastosAdministrativos",300000000,300000000,"No","N/A","Gerencia de Abastecimiento Estratégico\ncontratacion@positiva.gov.co\nPBX: (1)6502200 Ext: 10641","SI","SI","NO","SI",null,{"$f":"CONCATENATE(D197,\"-\",\"Tipo de información\",\" \",V197,\"-\",F197)","v":"C77072022-Tipo de información -PRESTACION DE SERVICIOS DE PROMOCION Y PREVENCION – SERVICIOS_ESPECIALIZADOS_ZONA_BOGOTA"}]
["PyP","Gerencia de administración del riesgo","No","C77082022",93141808,"PRESTACION DE SERVICIOS DE PROMOCION Y PREVENCION – SERVICIOS_ESPECIALIZADOS_ZONA_BOGOTA","1/01/2022",{"$f":"MONTH(G198)","v":1},"30/11/2022",{"$f":"(I198-G198)/30","v":11.1},"Invitación directa","GastosAdministrativos",130000000,130000000,"No","N/A","Gerencia de Abastecimiento Estratégico\ncontratacion@positiva.gov.co\nPBX: (1)6502200 Ext: 10641","SI","SI","NO","SI",null,{"$f":"CONCATENATE(D198,\"-\",\"Tipo de información\",\" \",V198,\"-\",F198)","v":"C77082022-Tipo de información -PRESTACION DE SERVICIOS DE PROMOCION Y PREVENCION – SERVICIOS_ESPECIALIZADOS_ZONA_BOGOTA"}]
["PyP","Gerencia de administración del riesgo","No","C77092022",93141808,"PRESTACION DE SERVICIOS DE PROMOCION Y PREVENCION – SERVICIOS_ESPECIALIZADOS_ZONA_BOGOTA","1/01/2022",{"$f":"MONTH(G199)","v":1},"30/11/2022",{"$f":"(I199-G199)/30","v":11.1},"Invitación directa","GastosAdministrativos",60000000,60000000,"No","N/A","Gerencia de Abastecimiento Estratégico\ncontratacion@positiva.gov.co\nPBX: (1)6502200 Ext: 10641","SI","SI","NO","SI",null,{"$f":"CONCATENATE(D199,\"-\",\"Tipo de información\",\" \",V199,\"-\",F199)","v":"C77092022-Tipo de información -PRESTACION DE SERVICIOS DE PROMOCION Y PREVENCION – SERVICIOS_ESPECIALIZADOS_ZONA_BOGOTA"}]
["PyP","Gerencia de administración del riesgo","No","C77102022",93141808,"PRESTACION DE SERVICIOS DE PROMOCION Y PREVENCION – SERVICIOS_ESPECIALIZADOS_ZONA_BOGOTA","1/01/2022",{"$f":"MONTH(G200)","v":1},"30/11/2022",{"$f":"(I200-G200)/30","v":11.1},"Invitación directa","GastosAdministrativos",70000000,70000000,"No","N/A","Gerencia de Abastecimiento Estratégico\ncontratacion@positiva.gov.co\nPBX: (1)6502200 Ext: 10641","SI","SI","NO","SI",null,{"$f":"CONCATENATE(D200,\"-\",\"Tipo de información\",\" \",V200,\"-\",F200)","v":"C77102022-Tipo de información -PRESTACION DE SERVICIOS DE PROMOCION Y PREVENCION – SERVICIOS_ESPECIALIZADOS_ZONA_BOGOTA"}]
["PyP","Gerencia de administración del riesgo","No","C77112022",93141808,"PRESTACION DE SERVICIOS DE PROMOCION Y PREVENCION – SERVICIOS_ESPECIALIZADOS_ZONA_BOGOTA","1/01/2022",{"$f":"MONTH(G201)","v":1},"30/11/2022",{"$f":"(I201-G201)/30","v":11.1},"Invitación directa","GastosAdministrativos",700000000,700000000,"No","N/A","Gerencia de Abastecimiento Estratégico\ncontratacion@positiva.gov.co\nPBX: (1)6502200 Ext: 10641","SI","SI","NO","SI",null,{"$f":"CONCATENATE(D201,\"-\",\"Tipo de información\",\" \",V201,\"-\",F201)","v":"C77112022-Tipo de información -PRESTACION DE SERVICIOS DE PROMOCION Y PREVENCION – SERVICIOS_ESPECIALIZADOS_ZONA_BOGOTA"}]
["PyP","Gerencia de administración del riesgo","No","C79242022",93141808,"PRESTACION DE SERVICIOS DE PROMOCION Y PREVENCION – SERVICIOS_ESPECIALIZADOS_ZONA_SANTANDER","1/01/2022",{"$f":"MONTH(G202)","v":1},"30/11/2022",{"$f":"(I202-G202)/30","v":11.1},"Invitación directa","GastosAdministrativos",61256250,61256250,"No","N/A","Gerencia de Abastecimiento Estratégico\ncontratacion@positiva.gov.co\nPBX: (1)6502200 Ext: 10641","SI","SI","NO","SI",null,{"$f":"CONCATENATE(D202,\"-\",\"Tipo de información\",\" \",V202,\"-\",F202)","v":"C79242022-Tipo de información -PRESTACION DE SERVICIOS DE PROMOCION Y PREVENCION – SERVICIOS_ESPECIALIZADOS_ZONA_SANTANDER"}]
["PyP","Gerencia de administración del riesgo","No","C79252022",93141808,"PRESTACION DE SERVICIOS DE PROMOCION Y PREVENCION – SERVICIOS_ESPECIALIZADOS_ZONA_SANTANDER","1/01/2022",{"$f":"MONTH(G203)","v":1},"30/11/2022",{"$f":"(I203-G203)/30","v":11.1},"Invitación directa","GastosAdministrativos",63845928,63845928,"No","N/A","Gerencia de Abastecimiento Estratégico\ncontratacion@positiva.gov.co\nPBX: (1)6502200 Ext: 10641","SI","SI","NO","SI",null,{"$f":"CONCATENATE(D203,\"-\",\"Tipo de información\",\" \",V203,\"-\",F203)","v":"C79252022-Tipo de información -PRESTACION DE SERVICIOS DE PROMOCION Y PREVENCION – SERVICIOS_ESPECIALIZADOS_ZONA_SANTANDER"}]
["PyP","Gerencia de administración del riesgo","No","C79262022",93141808,"PRESTACION DE SERVICIOS DE PROMOCION Y PREVENCION – SERVICIOS_ESPECIALIZADOS_ZONA_SANTANDER","1/01/2022",{"$f":"MONTH(G204)","v":1},"30/11/2022",{"$f":"(I204-G204)/30","v":11.1},"Invitación directa","GastosAdministrativos",14895833,14895833,"No","N/A","Gerencia de Abastecimiento Estratégico\ncontratacion@positiva.gov.co\nPBX: (1)6502200 Ext: 10641","SI","SI","NO","SI",null,{"$f":"CONCATENATE(D204,\"-\",\"Tipo de información\",\" \",V204,\"-\",F204)","v":"C79262022-Tipo de información -PRESTACION DE SERVICIOS DE PROMOCION Y PREVENCION – SERVICIOS_ESPECIALIZADOS_ZONA_SANTANDER"}]
["PyP","Gerencia de administración del riesgo","No","C79272022",93141808,"PRESTACION DE SERVICIOS DE PROMOCION Y PREVENCION – SERVICIOS_ESPECIALIZADOS_ZONA_SANTANDER","1/01/2022",{"$f":"MONTH(G205)","v":1},"30/11/2022",{"$f":"(I205-G205)/30","v":11.1},"Invitación directa","GastosAdministrativos",79113439,79113439,"No","N/A","Gerencia de Abastecimiento Estratégico\ncontratacion@positiva.gov.co\nPBX: (1)6502200 Ext: 10641","SI","SI","NO","SI",null,{"$f":"CONCATENATE(D205,\"-\",\"Tipo de información\",\" \",V205,\"-\",F205)","v":"C79272022-Tipo de información -PRESTACION DE SERVICIOS DE PROMOCION Y PREVENCION – SERVICIOS_ESPECIALIZADOS_ZONA_SANTANDER"}]
["PyP","Gerencia de administración del riesgo","No","C79282022",93141808,"PRESTACION DE SERVICIOS DE PROMOCION Y PREVENCION – SERVICIOS_ESPECIALIZADOS_ZONA_SANTANDER","1/01/2022",{"$f":"MONTH(G206)","v":1},"30/11/2022",{"$f":"(I206-G206)/30","v":11.1},"Invitación directa","GastosAdministrativos",13678756,13678756,"No","N/A","Gerencia de Abastecimiento Estratégico\ncontratacion@positiva.gov.co\nPBX: (1)6502200 Ext: 10641","SI","SI","NO","SI",null,{"$f":"CONCATENATE(D206,\"-\",\"Tipo de información\",\" \",V206,\"-\",F206)","v":"C79282022-Tipo de información -PRESTACION DE SERVICIOS DE PROMOCION Y PREVENCION – SERVICIOS_ESPECIALIZADOS_ZONA_SANTANDER"}]
["PyP","Gerencia de administración del riesgo","No","C79292022",93141808,"PRESTACION DE SERVICIOS DE PROMOCION Y PREVENCION – SERVICIOS_ESPECIALIZADOS_ZONA_SANTANDER","1/01/2022",{"$f":"MONTH(G207)","v":1},"30/11/2022",{"$f":"(I207-G207)/30","v":11.1},"Invitación directa","GastosAdministrativos",50000000,50000000,"No","N/A","Gerencia de Abastecimiento Estratégico\ncontratacion@positiva.gov.co\nPBX: (1)6502200 Ext: 10641","SI","SI","NO","SI",null,{"$f":"CONCATENATE(D207,\"-\",\"Tipo de información\",\" \",V207,\"-\",F207)","v":"C79292022-Tipo de información -PRESTACION DE SERVICIOS DE PROMOCION Y PREVENCION – SERVICIOS_ESPECIALIZADOS_ZONA_SANTANDER"}]
["PyP","Gerencia de administración del riesgo","No","C79302022",93141808,"PRESTACION DE SERVICIOS DE PROMOCION Y PREVENCION – SERVICIOS_ESPECIALIZADOS_ZONA_SANTANDER","1/01/2022",{"$f":"MONTH(G208)","v":1},"30/11/2022",{"$f":"(I208-G208)/30","v":11.1},"Invitación directa","GastosAdministrativos",30000000,30000000,"No","N/A","Gerencia de Abastecimiento Estratégico\ncontratacion@positiva.gov.co\nPBX: (1)6502200 Ext: 10641","SI","SI","NO","SI",null,{"$f":"CONCATENATE(D208,\"-\",\"Tipo de información\",\" \",V208,\"-\",F208)","v":"C79302022-Tipo de información -PRESTACION DE SERVICIOS DE PROMOCION Y PREVENCION – SERVICIOS_ESPECIALIZADOS_ZONA_SANTANDER"}]
["PyP","Gerencia de administración del riesgo","No","C79312022",93141808,"PRESTACION DE SERVICIOS DE PROMOCION Y PREVENCION – SERVICIOS_ESPECIALIZADOS_ZONA_SANTANDER","1/01/2022",{"$f":"MONTH(G209)","v":1},"30/11/2022",{"$f":"(I209-G209)/30","v":11.1},"Invitación directa","GastosAdministrativos",15000000,15000000,"No","N/A","Gerencia de Abastecimiento Estratégico\ncontratacion@positiva.gov.co\nPBX: (1)6502200 Ext: 10641","SI","SI","NO","SI",null,{"$f":"CONCATENATE(D209,\"-\",\"Tipo de información\",\" \",V209,\"-\",F209)","v":"C79312022-Tipo de información -PRESTACION DE SERVICIOS DE PROMOCION Y PREVENCION – SERVICIOS_ESPECIALIZADOS_ZONA_SANTANDER"}]
["PyP","Gerencia de administración del riesgo","No","C79322022",93141808,"PRESTACION DE SERVICIOS DE PROMOCION Y PREVENCION – SERVICIOS_ESPECIALIZADOS_ZONA_SANTANDER","1/01/2022",{"$f":"MONTH(G210)","v":1},"30/11/2022",{"$f":"(I210-G210)/30","v":11.1},"Invitación directa","GastosAdministrativos",60000000,60000000,"No","N/A","Gerencia de Abastecimiento Estratégico\ncontratacion@positiva.gov.co\nPBX: (1)6502200 Ext: 10641","SI","SI","NO","SI",null,{"$f":"CONCATENATE(D210,\"-\",\"Tipo de información\",\" \",V210,\"-\",F210)","v":"C79322022-Tipo de información -PRESTACION DE SERVICIOS DE PROMOCION Y PREVENCION – SERVICIOS_ESPECIALIZADOS_ZONA_SANTANDER"}]
["PyP","Gerencia de administración del riesgo","No","C79332022",93141808,"PRESTACION DE SERVICIOS DE PROMOCION Y PREVENCION – SERVICIOS_ESPECIALIZADOS_ZONA_SANTANDER","1/01/2022",{"$f":"MONTH(G211)","v":1},"30/11/2022",{"$f":"(I211-G211)/30","v":11.1},"Invitación directa","GastosAdministrativos",140196078,140196078,"No","N/A","Gerencia de Abastecimiento Estratégico\ncontratacion@positiva.gov.co\nPBX: (1)6502200 Ext: 10641","SI","SI","NO","SI",null,{"$f":"CONCATENATE(D211,\"-\",\"Tipo de información\",\" \",V211,\"-\",F211)","v":"C79332022-Tipo de información -PRESTACION DE SERVICIOS DE PROMOCION Y PREVENCION – SERVICIOS_ESPECIALIZADOS_ZONA_SANTANDER"}]
["PyP","Gerencia de administración del riesgo","No","C79342022",93141808,"PRESTACION DE SERVICIOS DE PROMOCION Y PREVENCION – SERVICIOS_ESPECIALIZADOS_ZONA_SANTANDER","1/01/2022",{"$f":"MONTH(G212)","v":1},"30/11/2022",{"$f":"(I212-G212)/30","v":11.1},"Invitación directa","GastosAdministrativos",71920266,71920266,"No","N/A","Gerencia de Abastecimiento Estratégico\ncontratacion@positiva.gov.co\nPBX: (1)6502200 Ext: 10641","SI","SI","NO","SI",null,{"$f":"CONCATENATE(D212,\"-\",\"Tipo de información\",\" \",V212,\"-\",F212)","v":"C79342022-Tipo de información -PRESTACION DE SERVICIOS DE PROMOCION Y PREVENCION – SERVICIOS_ESPECIALIZADOS_ZONA_SANTANDER"}]
["PyP","Gerencia de administración del riesgo","No","C79352022",93141808,"PRESTACION DE SERVICIOS DE PROMOCION Y PREVENCION – SERVICIOS_ESPECIALIZADOS_ZONA_SANTANDER","1/01/2022",{"$f":"MONTH(G213)","v":1},"30/11/2022",{"$f":"(I213-G213)/30","v":11.1},"Invitación directa","GastosAdministrativos",170000000,170000000,"No","N/A","Gerencia de Abastecimiento Estratégico\ncontratacion@positiva.gov.co\nPBX: (1)6502200 Ext: 10641","SI","SI","NO","SI",null,{"$f":"CONCATENATE(D213,\"-\",\"Tipo de información\",\" \",V213,\"-\",F213)","v":"C79352022-Tipo de información -PRESTACION DE SERVICIOS DE PROMOCION Y PREVENCION – SERVICIOS_ESPECIALIZADOS_ZONA_SANTANDER"}]
["PyP","Gerencia de administración del riesgo","No","C80272022",93141808,"PRESTACION DE SERVICIOS DE PROMOCION Y PREVENCION – SERVICIOS_ESPECIALIZADOS_ZONA_VALLE","1/01/2022",{"$f":"MONTH(G214)","v":1},"30/11/2022",{"$f":"(I214-G214)/30","v":11.1},"Invitación directa","GastosAdministrativos",100000000,100000000,"No","N/A","Gerencia de Abastecimiento Estratégico\ncontratacion@positiva.gov.co\nPBX: (1)6502200 Ext: 10641","SI","SI","NO","SI",null,{"$f":"CONCATENATE(D214,\"-\",\"Tipo de información\",\" \",V214,\"-\",F214)","v":"C80272022-Tipo de información -PRESTACION DE SERVICIOS DE PROMOCION Y PREVENCION – SERVICIOS_ESPECIALIZADOS_ZONA_VALLE"}]
["PyP","Gerencia de administración del riesgo","No","C80282022",93141808,"PRESTACION DE SERVICIOS DE PROMOCION Y PREVENCION – SERVICIOS_ESPECIALIZADOS_ZONA_VALLE","1/01/2022",{"$f":"MONTH(G215)","v":1},"30/11/2022",{"$f":"(I215-G215)/30","v":11.1},"Invitación directa","GastosAdministrativos",54214286,54214286,"No","N/A","Gerencia de Abastecimiento Estratégico\ncontratacion@positiva.gov.co\nPBX: (1)6502200 Ext: 10641","SI","SI","NO","SI",null,{"$f":"CONCATENATE(D215,\"-\",\"Tipo de información\",\" \",V215,\"-\",F215)","v":"C80282022-Tipo de información -PRESTACION DE SERVICIOS DE PROMOCION Y PREVENCION – SERVICIOS_ESPECIALIZADOS_ZONA_VALLE"}]
["PyP","Gerencia de administración del riesgo","No","C80292022",93141808,"PRESTACION DE SERVICIOS DE PROMOCION Y PREVENCION – SERVICIOS_ESPECIALIZADOS_ZONA_VALLE","1/01/2022",{"$f":"MONTH(G216)","v":1},"30/11/2022",{"$f":"(I216-G216)/30","v":11.1},"Invitación directa","GastosAdministrativos",72262774,72262774,"No","N/A","Gerencia de Abastecimiento Estratégico\ncontratacion@positiva.gov.co\nPBX: (1)6502200 Ext: 10641","SI","SI","NO","SI",null,{"$f":"CONCATENATE(D216,\"-\",\"Tipo de información\",\" \",V216,\"-\",F216)","v":"C80292022-Tipo de información -PRESTACION DE SERVICIOS DE PROMOCION Y PREVENCION – SERVICIOS_ESPECIALIZADOS_ZONA_VALLE"}]
["PyP","Gerencia de administración del riesgo","No","C80302022",93141808,"PRESTACION DE SERVICIOS DE PROMOCION Y PREVENCION – SERVICIOS_ESPECIALIZADOS_ZONA_VALLE","1/01/2022",{"$f":"MONTH(G217)","v":1},"30/11/2022",{"$f":"(I217-G217)/30","v":11.1},"Invitación directa","GastosAdministrativos",92288136,92288136,"No","N/A","Gerencia de Abastecimiento Estratégico\ncontratacion@positiva.gov.co\nPBX: (1)6502200 Ext: 10641","SI","SI","NO","SI",null,{"$f":"CONCATENATE(D217,\"-\",\"Tipo de información\",\" \",V217,\"-\",F217)","v":"C80302022-Tipo de información -PRESTACION DE SERVICIOS DE PROMOCION Y PREVENCION – SERVICIOS_ESPECIALIZADOS_ZONA_VALLE"}]
["PyP","Gerencia de administración del riesgo","No","C80312022",93141808,"PRESTACION DE SERVICIOS DE PROMOCION Y PREVENCION – SERVICIOS_ESPECIALIZADOS_ZONA_VALLE","1/01/2022",{"$f":"MONTH(G218)","v":1},"30/11/2022",{"$f":"(I218-G218)/30","v":11.1},"Invitación directa","GastosAdministrativos",110000000,110000000,"No","N/A","Gerencia de Abastecimiento Estratégico\ncontratacion@positiva.gov.co\nPBX: (1)6502200 Ext: 10641","SI","SI","NO","SI",null,{"$f":"CONCATENATE(D218,\"-\",\"Tipo de información\",\" \",V218,\"-\",F218)","v":"C80312022-Tipo de información -PRESTACION DE SERVICIOS DE PROMOCION Y PREVENCION – SERVICIOS_ESPECIALIZADOS_ZONA_VALLE"}]
["PyP","Gerencia de administración del riesgo","No","C81042022",93141808,"PRESTACION DE SERVICIOS DE PROMOCION Y PREVENCION – SERVICIOS_ESPECIALIZADOS_CUENTA_FGN","1/01/2022",{"$f":"MONTH(G219)","v":1},"30/11/2022",{"$f":"(I219-G219)/30","v":11.1},"Invitación directa","GastosAdministrativos",594000000,594000000,"No","N/A","Gerencia de Abastecimiento Estratégico\ncontratacion@positiva.gov.co\nPBX: (1)6502200 Ext: 10641","SI","SI","NO","SI",null,{"$f":"CONCATENATE(D219,\"-\",\"Tipo de información\",\" \",V219,\"-\",F219)","v":"C81042022-Tipo de información -PRESTACION DE SERVICIOS DE PROMOCION Y PREVENCION – SERVICIOS_ESPECIALIZADOS_CUENTA_FGN"}]
["PyP","Gerencia de administración del riesgo","No","C81052022",93141808,"PRESTACION DE SERVICIOS DE PROMOCION Y PREVENCION – SERVICIOS_ESPECIALIZADOS_CUENTA_FGN","1/01/2022",{"$f":"MONTH(G220)","v":1},"30/11/2022",{"$f":"(I220-G220)/30","v":11.1},"Invitación directa","GastosAdministrativos",1110000000,1110000000,"No","N/A","Gerencia de Abastecimiento Estratégico\ncontratacion@positiva.gov.co\nPBX: (1)6502200 Ext: 10641","SI","SI","NO","SI",null,{"$f":"CONCATENATE(D220,\"-\",\"Tipo de información\",\" \",V220,\"-\",F220)","v":"C81052022-Tipo de información -PRESTACION DE SERVICIOS DE PROMOCION Y PREVENCION – SERVICIOS_ESPECIALIZADOS_CUENTA_FGN"}]
["PyP","Gerencia de administración del riesgo","No","C81062022",93141808,"PRESTACION DE SERVICIOS DE PROMOCION Y PREVENCION – SERVICIOS_ESPECIALIZADOS_CUENTA_FGN","1/01/2022",{"$f":"MONTH(G221)","v":1},"30/11/2022",{"$f":"(I221-G221)/30","v":11.1},"Invitación directa","GastosAdministrativos",120000000,120000000,"No","N/A","Gerencia de Abastecimiento Estratégico\ncontratacion@positiva.gov.co\nPBX: (1)6502200 Ext: 10641","SI","SI","NO","SI",null,{"$f":"CONCATENATE(D221,\"-\",\"Tipo de información\",\" \",V221,\"-\",F221)","v":"C81062022-Tipo de información -PRESTACION DE SERVICIOS DE PROMOCION Y PREVENCION – SERVICIOS_ESPECIALIZADOS_CUENTA_FGN"}]
["PyP","Gerencia de administración del riesgo","No","C81072022",93141808,"PRESTACION DE SERVICIOS DE PROMOCION Y PREVENCION – SERVICIOS_ESPECIALIZADOS_CUENTA_FGN","1/01/2022",{"$f":"MONTH(G222)","v":1},"30/11/2022",{"$f":"(I222-G222)/30","v":11.1},"Invitación directa","GastosAdministrativos",1264000000,1264000000,"No","N/A","Gerencia de Abastecimiento Estratégico\ncontratacion@positiva.gov.co\nPBX: (1)6502200 Ext: 10641","SI","SI","NO","SI",null,{"$f":"CONCATENATE(D222,\"-\",\"Tipo de información\",\" \",V222,\"-\",F222)","v":"C81072022-Tipo de información -PRESTACION DE SERVICIOS DE PROMOCION Y PREVENCION – SERVICIOS_ESPECIALIZADOS_CUENTA_FGN"}]
["PyP","Gerencia de administración del riesgo","No","C81082022",93141808,"PRESTACION DE SERVICIOS DE PROMOCION Y PREVENCION – SERVICIOS_ESPECIALIZADOS_CUENTA_FGN","1/01/2022",{"$f":"MONTH(G223)","v":1},"30/11/2022",{"$f":"(I223-G223)/30","v":11.1},"Invitación directa","GastosAdministrativos",209000000,209000000,"No","N/A","Gerencia de Abastecimiento Estratégico\ncontratacion@positiva.gov.co\nPBX: (1)6502200 Ext: 10641","SI","SI","NO","SI",null,{"$f":"CONCATENATE(D223,\"-\",\"Tipo de información\",\" \",V223,\"-\",F223)","v":"C81082022-Tipo de información -PRESTACION DE SERVICIOS DE PROMOCION Y PREVENCION – SERVICIOS_ESPECIALIZADOS_CUENTA_FGN"}]
["PyP","Gerencia de administración del riesgo","No","C81092022",93141808,"PRESTACION DE SERVICIOS DE PROMOCION Y PREVENCION – SERVICIOS_ESPECIALIZADOS_CUENTA_FGN","1/01/2022",{"$f":"MONTH(G224)","v":1},"30/11/2022",{"$f":"(I224-G224)/30","v":11.1},"Invitación directa","GastosAdministrativos",121000000,121000000,"No","N/A","Gerencia de Abastecimiento Estratégico\ncontratacion@positiva.gov.co\nPBX: (1)6502200 Ext: 10641","SI","SI","NO","SI",null,{"$f":"CONCATENATE(D224,\"-\",\"Tipo de información\",\" \",V224,\"-\",F224)","v":"C81092022-Tipo de información -PRESTACION DE SERVICIOS DE PROMOCION Y PREVENCION – SERVICIOS_ESPECIALIZADOS_CUENTA_FGN"}]
["PyP","Gerencia de administración del riesgo","No","C81102022",93141808,"PRESTACION DE SERVICIOS DE PROMOCION Y PREVENCION – SERVICIOS_ESPECIALIZADOS_CUENTA_FGN","1/01/2022",{"$f":"MONTH(G225)","v":1},"30/11/2022",{"$f":"(I225-G225)/30","v":11.1},"Invitación directa","GastosAdministrativos",204811587,204811587,"No","N/A","Gerencia de Abastecimiento Estratégico\ncontratacion@positiva.gov.co\nPBX: (1)6502200 Ext: 10641","SI","SI","NO","SI",null,{"$f":"CONCATENATE(D225,\"-\",\"Tipo de información\",\" \",V225,\"-\",F225)","v":"C81102022-Tipo de información -PRESTACION DE SERVICIOS DE PROMOCION Y PREVENCION – SERVICIOS_ESPECIALIZADOS_CUENTA_FGN"}]
["PyP","Gerencia de administración del riesgo","No","C81112022",93141808,"PRESTACION DE SERVICIOS DE PROMOCION Y PREVENCION – SERVICIOS_ESPECIALIZADOS_CUENTA_FGN","1/01/2022",{"$f":"MONTH(G226)","v":1},"30/11/2022",{"$f":"(I226-G226)/30","v":11.1},"Invitación directa","GastosAdministrativos",167200000,167200000,"No","N/A","Gerencia de Abastecimiento Estratégico\ncontratacion@positiva.gov.co\nPBX: (1)6502200 Ext: 10641","SI","SI","NO","SI",null,{"$f":"CONCATENATE(D226,\"-\",\"Tipo de información\",\" \",V226,\"-\",F226)","v":"C81112022-Tipo de información -PRESTACION DE SERVICIOS DE PROMOCION Y PREVENCION – SERVICIOS_ESPECIALIZADOS_CUENTA_FGN"}]
["PyP","Gerencia de administración del riesgo","No","C81122022",93141808,"PRESTACION DE SERVICIOS DE PROMOCION Y PREVENCION – SERVICIOS_ESPECIALIZADOS_CUENTA_FGN","1/01/2022",{"$f":"MONTH(G227)","v":1},"30/11/2022",{"$f":"(I227-G227)/30","v":11.1},"Invitación directa","GastosAdministrativos",123200000,123200000,"No","N/A","Gerencia de Abastecimiento Estratégico\ncontratacion@positiva.gov.co\nPBX: (1)6502200 Ext: 10641","SI","SI","NO","SI",null,{"$f":"CONCATENATE(D227,\"-\",\"Tipo de información\",\" \",V227,\"-\",F227)","v":"C81122022-Tipo de información -PRESTACION DE SERVICIOS DE PROMOCION Y PREVENCION – SERVICIOS_ESPECIALIZADOS_CUENTA_FGN"}]
["PyP","Gerencia de administración del riesgo","No","C81132022",93141808,"PRESTACION DE SERVICIOS DE PROMOCION Y PREVENCION – SERVICIOS_ESPECIALIZADOS_CUENTA_FGN","1/01/2022",{"$f":"MONTH(G228)","v":1},"30/11/2022",{"$f":"(I228-G228)/30","v":11.1},"Invitación directa","GastosAdministrativos",200000000,200000000,"No","N/A","Gerencia de Abastecimiento Estratégico\ncontratacion@positiva.gov.co\nPBX: (1)6502200 Ext: 10641","SI","SI","NO","SI",null,{"$f":"CONCATENATE(D228,\"-\",\"Tipo de información\",\" \",V228,\"-\",F228)","v":"C81132022-Tipo de información -PRESTACION DE SERVICIOS DE PROMOCION Y PREVENCION – SERVICIOS_ESPECIALIZADOS_CUENTA_FGN"}]
["PyP","Gerencia de administración del riesgo","No","C81142022",93141808,"PRESTACION DE SERVICIOS DE PROMOCION Y PREVENCION – SERVICIOS_ESPECIALIZADOS_CUENTA_FGN","1/01/2022",{"$f":"MONTH(G229)","v":1},"30/11/2022",{"$f":"(I229-G229)/30","v":11.1},"Invitación directa","GastosAdministrativos",60000000,60000000,"No","N/A","Gerencia de Abastecimiento Estratégico\ncontratacion@positiva.gov.co\nPBX: (1)6502200 Ext: 10641","SI","SI","NO","SI",null,{"$f":"CONCATENATE(D229,\"-\",\"Tipo de información\",\" \",V229,\"-\",F229)","v":"C81142022-Tipo de información -PRESTACION DE SERVICIOS DE PROMOCION Y PREVENCION – SERVICIOS_ESPECIALIZADOS_CUENTA_FGN"}]
["PyP","Gerencia de administración del riesgo","No","C81152022",93141808,"PRESTACION DE SERVICIOS DE PROMOCION Y PREVENCION – SERVICIOS_ESPECIALIZADOS_CUENTA_FGN","1/01/2022",{"$f":"MONTH(G230)","v":1},"30/11/2022",{"$f":"(I230-G230)/30","v":11.1},"Invitación directa","GastosAdministrativos",120000000,120000000,"No","N/A","Gerencia de Abastecimiento Estratégico\ncontratacion@positiva.gov.co\nPBX: (1)6502200 Ext: 10641","SI","SI","NO","SI",null,{"$f":"CONCATENATE(D230,\"-\",\"Tipo de información\",\" \",V230,\"-\",F230)","v":"C81152022-Tipo de información -PRESTACION DE SERVICIOS DE PROMOCION Y PREVENCION – SERVICIOS_ESPECIALIZADOS_CUENTA_FGN"}]
["PyP","Gerencia de administración del riesgo","No","C81162022",93141808,"PRESTACION DE SERVICIOS DE PROMOCION Y PREVENCION – SERVICIOS_ESPECIALIZADOS_CUENTA_FGN","1/01/2022",{"$f":"MONTH(G231)","v":1},"30/11/2022",{"$f":"(I231-G231)/30","v":11.1},"Invitación directa","GastosAdministrativos",700000000,700000000,"No","N/A","Gerencia de Abastecimiento Estratégico\ncontratacion@positiva.gov.co\nPBX: (1)6502200 Ext: 10641","SI","SI","NO","SI",null,{"$f":"CONCATENATE(D231,\"-\",\"Tipo de información\",\" \",V231,\"-\",F231)","v":"C81162022-Tipo de información -PRESTACION DE SERVICIOS DE PROMOCION Y PREVENCION – SERVICIOS_ESPECIALIZADOS_CUENTA_FGN"}]
["PyP","Gerencia de administración del riesgo","No","C81172022",93141808,"PRESTACION DE SERVICIOS DE PROMOCION Y PREVENCION – SERVICIOS_ESPECIALIZADOS_CUENTA_FGN","1/01/2022",{"$f":"MONTH(G232)","v":1},"30/11/2022",{"$f":"(I232-G232)/30","v":11.1},"Invitación directa","GastosAdministrativos",140000000,140000000,"No","N/A","Gerencia de Abastecimiento Estratégico\ncontratacion@positiva.gov.co\nPBX: (1)6502200 Ext: 10641","SI","SI","NO","SI",null,{"$f":"CONCATENATE(D232,\"-\",\"Tipo de información\",\" \",V232,\"-\",F232)","v":"C81172022-Tipo de información -PRESTACION DE SERVICIOS DE PROMOCION Y PREVENCION – SERVICIOS_ESPECIALIZADOS_CUENTA_FGN"}]
["PyP","Gerencia de administración del riesgo","No","C84012022",93141808,"PRESTACION DE SERVICIOS DE PROMOCION Y PREVENCION – GRAN_MIPYME","1/01/2022",{"$f":"MONTH(G233)","v":1},"30/11/2022",{"$f":"(I233-G233)/30","v":11.1},"Invitación directa","GastosAdministrativos",1350000000,1350000000,"No","N/A","Gerencia de Abastecimiento Estratégico\ncontratacion@positiva.gov.co\nPBX: (1)6502200 Ext: 10641","SI","SI","NO","SI",null,{"$f":"CONCATENATE(D233,\"-\",\"Tipo de información\",\" \",V233,\"-\",F233)","v":"C84012022-Tipo de información -PRESTACION DE SERVICIOS DE PROMOCION Y PREVENCION – GRAN_MIPYME"}]
["PyP","Gerencia de administración del riesgo","No","C84022022",93141808,"PRESTACION DE SERVICIOS DE PROMOCION Y PREVENCION – GRAN_MIPYME","1/01/2022",{"$f":"MONTH(G234)","v":1},"30/11/2022",{"$f":"(I234-G234)/30","v":11.1},"Invitación directa","GastosAdministrativos",602382645,602382645,"No","N/A","Gerencia de Abastecimiento Estratégico\ncontratacion@positiva.gov.co\nPBX: (1)6502200 Ext: 10641","SI","SI","NO","SI",null,{"$f":"CONCATENATE(D234,\"-\",\"Tipo de información\",\" \",V234,\"-\",F234)","v":"C84022022-Tipo de información -PRESTACION DE SERVICIOS DE PROMOCION Y PREVENCION – GRAN_MIPYME"}]
["PyP","Gerencia de administración del riesgo","No","C84032022",93141808,"PRESTACION DE SERVICIOS DE PROMOCION Y PREVENCION – GRAN_MIPYME","1/01/2022",{"$f":"MONTH(G235)","v":1},"30/11/2022",{"$f":"(I235-G235)/30","v":11.1},"Invitación directa","GastosAdministrativos",700000000,700000000,"No","N/A","Gerencia de Abastecimiento Estratégico\ncontratacion@positiva.gov.co\nPBX: (1)6502200 Ext: 10641","SI","SI","NO","SI",null,{"$f":"CONCATENATE(D235,\"-\",\"Tipo de información\",\" \",V235,\"-\",F235)","v":"C84032022-Tipo de información -PRESTACION DE SERVICIOS DE PROMOCION Y PREVENCION – GRAN_MIPYME"}]
["PyP","Gerencia de administración del riesgo","No","C84042022",93141808,"PRESTACION DE SERVICIOS DE PROMOCION Y PREVENCION – GRAN_MIPYME","1/01/2022",{"$f":"MONTH(G236)","v":1},"30/11/2022",{"$f":"(I236-G236)/30","v":11.1},"Invitación directa","GastosAdministrativos",1350000000,1350000000,"No","N/A","Gerencia de Abastecimiento Estratégico\ncontratacion@positiva.gov.co\nPBX: (1)6502200 Ext: 10641","SI","SI","NO","SI",null,{"$f":"CONCATENATE(D236,\"-\",\"Tipo de información\",\" \",V236,\"-\",F236)","v":"C84042022-Tipo de información -PRESTACION DE SERVICIOS DE PROMOCION Y PREVENCION – GRAN_MIPYME"}]
["PyP","Gerencia de administración del riesgo","No","C84052022",93141808,"PRESTACION DE SERVICIOS DE PROMOCION Y PREVENCION – GRAN_MIPYME","1/01/2022",{"$f":"MONTH(G237)","v":1},"30/11/2022",{"$f":"(I237-G237)/30","v":11.1},"Invitación directa","GastosAdministrativos",1070000000,1070000000,"No","N/A","Gerencia de Abastecimiento Estratégico\ncontratacion@positiva.gov.co\nPBX: (1)6502200 Ext: 10641","SI","SI","NO","SI",null,{"$f":"CONCATENATE(D237,\"-\",\"Tipo de información\",\" \",V237,\"-\",F237)","v":"C84052022-Tipo de información -PRESTACION DE SERVICIOS DE PROMOCION Y PREVENCION – GRAN_MIPYME"}]
["PyP","Gerencia de administración del riesgo","No","C84062022",93141808,"PRESTACION DE SERVICIOS DE PROMOCION Y PREVENCION – GRAN_MIPYME","1/01/2022",{"$f":"MONTH(G238)","v":1},"30/11/2022",{"$f":"(I238-G238)/30","v":11.1},"Invitación directa","GastosAdministrativos",1070000000,1070000000,"No","N/A","Gerencia de Abastecimiento Estratégico\ncontratacion@positiva.gov.co\nPBX: (1)6502200 Ext: 10641","SI","SI","NO","SI",null,{"$f":"CONCATENATE(D238,\"-\",\"Tipo de información\",\" \",V238,\"-\",F238)","v":"C84062022-Tipo de información -PRESTACION DE SERVICIOS DE PROMOCION Y PREVENCION – GRAN_MIPYME"}]
["PyP","Gerencia de administración del riesgo","No","C84072022",93141808,"PRESTACION DE SERVICIOS DE PROMOCION Y PREVENCION – GRAN_MIPYME","1/01/2022",{"$f":"MONTH(G239)","v":1},"30/11/2022",{"$f":"(I239-G239)/30","v":11.1},"Invitación directa","GastosAdministrativos",1350000000,1350000000,"No","N/A","Gerencia de Abastecimiento Estratégico\ncontratacion@positiva.gov.co\nPBX: (1)6502200 Ext: 10641","SI","SI","NO","SI",null,{"$f":"CONCATENATE(D239,\"-\",\"Tipo de información\",\" \",V239,\"-\",F239)","v":"C84072022-Tipo de información -PRESTACION DE SERVICIOS DE PROMOCION Y PREVENCION – GRAN_MIPYME"}]
["PyP","Gerencia de administración del riesgo","No","C84082022",93141808,"PRESTACION DE SERVICIOS DE PROMOCION Y PREVENCION – INVESTIGACION_AT","1/01/2022",{"$f":"MONTH(G240)","v":1},"30/11/2022",{"$f":"(I240-G240)/30","v":11.1},"Invitación directa","GastosAdministrativos",950000000,950000000,"No","N/A","Gerencia de Abastecimiento Estratégico\ncontratacion@positiva.gov.co\nPBX: (1)6502200 Ext: 10641","SI","SI","NO","SI",null,{"$f":"CONCATENATE(D240,\"-\",\"Tipo de información\",\" \",V240,\"-\",F240)","v":"C84082022-Tipo de información -PRESTACION DE SERVICIOS DE PROMOCION Y PREVENCION – INVESTIGACION_AT"}]
["PyP","Gerencia de administración del riesgo","No","C75152022",93141808,"PRESTACION DE SERVICIOS DE PROMOCION Y PREVENCION – SERVICIOS_ESPECIALIZADOS_ZONA_ANTIOQUIA","1/01/2022",{"$f":"MONTH(G241)","v":1},"30/11/2022",{"$f":"(I241-G241)/30","v":11.1},"Invitación directa","GastosAdministrativos",280000000,280000000,"No","N/A","Gerencia de Abastecimiento Estratégico\ncontratacion@positiva.gov.co\nPBX: (1)6502200 Ext: 10641","SI","SI","NO","SI",null,{"$f":"CONCATENATE(D241,\"-\",\"Tipo de información\",\" \",V241,\"-\",F241)","v":"C75152022-Tipo de información -PRESTACION DE SERVICIOS DE PROMOCION Y PREVENCION – SERVICIOS_ESPECIALIZADOS_ZONA_ANTIOQUIA"}]
["PyP","Gerencia de administración del riesgo","No","C75162022",93141808,"PRESTACION DE SERVICIOS DE PROMOCION Y PREVENCION – SERVICIOS_ESPECIALIZADOS_ZONA_ANTIOQUIA","1/01/2022",{"$f":"MONTH(G242)","v":1},"30/11/2022",{"$f":"(I242-G242)/30","v":11.1},"Invitación directa","GastosAdministrativos",250000000,250000000,"No","N/A","Gerencia de Abastecimiento Estratégico\ncontratacion@positiva.gov.co\nPBX: (1)6502200 Ext: 10641","SI","SI","NO","SI",null,{"$f":"CONCATENATE(D242,\"-\",\"Tipo de información\",\" \",V242,\"-\",F242)","v":"C75162022-Tipo de información -PRESTACION DE SERVICIOS DE PROMOCION Y PREVENCION – SERVICIOS_ESPECIALIZADOS_ZONA_ANTIOQUIA"}]
["PyP","Gerencia de administración del riesgo","No","C75172022",93141808,"PRESTACION DE SERVICIOS DE PROMOCION Y PREVENCION – SERVICIOS_ESPECIALIZADOS_ZONA_ANTIOQUIA","1/01/2022",{"$f":"MONTH(G243)","v":1},"30/11/2022",{"$f":"(I243-G243)/30","v":11.1},"Invitación directa","GastosAdministrativos",100303951,100303951,"No","N/A","Gerencia de Abastecimiento Estratégico\ncontratacion@positiva.gov.co\nPBX: (1)6502200 Ext: 10641","SI","SI","NO","SI",null,{"$f":"CONCATENATE(D243,\"-\",\"Tipo de información\",\" \",V243,\"-\",F243)","v":"C75172022-Tipo de información -PRESTACION DE SERVICIOS DE PROMOCION Y PREVENCION – SERVICIOS_ESPECIALIZADOS_ZONA_ANTIOQUIA"}]
["PyP","Gerencia de administración del riesgo","No","C75182022",93141808,"PRESTACION DE SERVICIOS DE PROMOCION Y PREVENCION – SERVICIOS_ESPECIALIZADOS_ZONA_ANTIOQUIA","1/01/2022",{"$f":"MONTH(G244)","v":1},"30/11/2022",{"$f":"(I244-G244)/30","v":11.1},"Invitación directa","GastosAdministrativos",343488828,343488828,"No","N/A","Gerencia de Abastecimiento Estratégico\ncontratacion@positiva.gov.co\nPBX: (1)6502200 Ext: 10641","SI","SI","NO","SI",null,{"$f":"CONCATENATE(D244,\"-\",\"Tipo de información\",\" \",V244,\"-\",F244)","v":"C75182022-Tipo de información -PRESTACION DE SERVICIOS DE PROMOCION Y PREVENCION – SERVICIOS_ESPECIALIZADOS_ZONA_ANTIOQUIA"}]
["PyP","Gerencia de administración del riesgo","No","C75192022",93141808,"PRESTACION DE SERVICIOS DE PROMOCION Y PREVENCION – SERVICIOS_ESPECIALIZADOS_ZONA_ANTIOQUIA","1/01/2022",{"$f":"MONTH(G245)","v":1},"30/11/2022",{"$f":"(I245-G245)/30","v":11.1},"Invitación directa","GastosAdministrativos",150000000,150000000,"No","N/A","Gerencia de Abastecimiento Estratégico\ncontratacion@positiva.gov.co\nPBX: (1)6502200 Ext: 10641","SI","SI","NO","SI",null,{"$f":"CONCATENATE(D245,\"-\",\"Tipo de información\",\" \",V245,\"-\",F245)","v":"C75192022-Tipo de información -PRESTACION DE SERVICIOS DE PROMOCION Y PREVENCION – SERVICIOS_ESPECIALIZADOS_ZONA_ANTIOQUIA"}]
["PyP","Gerencia de administración del riesgo","No","C75202022",93141808,"PRESTACION DE SERVICIOS DE PROMOCION Y PREVENCION – SERVICIOS_ESPECIALIZADOS_ZONA_ANTIOQUIA","1/01/2022",{"$f":"MONTH(G246)","v":1},"30/11/2022",{"$f":"(I246-G246)/30","v":11.1},"Invitación directa","GastosAdministrativos",290000000,290000000,"No","N/A","Gerencia de Abastecimiento Estratégico\ncontratacion@positiva.gov.co\nPBX: (1)6502200 Ext: 10641","SI","SI","NO","SI",null,{"$f":"CONCATENATE(D246,\"-\",\"Tipo de información\",\" \",V246,\"-\",F246)","v":"C75202022-Tipo de información -PRESTACION DE SERVICIOS DE PROMOCION Y PREVENCION – SERVICIOS_ESPECIALIZADOS_ZONA_ANTIOQUIA"}]
["PyP","Gerencia de administración del riesgo","No","C75212022",93141808,"PRESTACION DE SERVICIOS DE PROMOCION Y PREVENCION – SERVICIOS_ESPECIALIZADOS_ZONA_ANTIOQUIA","1/01/2022",{"$f":"MONTH(G247)","v":1},"30/11/2022",{"$f":"(I247-G247)/30","v":11.1},"Invitación directa","GastosAdministrativos",100000000,100000000,"No","N/A","Gerencia de Abastecimiento Estratégico\ncontratacion@positiva.gov.co\nPBX: (1)6502200 Ext: 10641","SI","SI","NO","SI",null,{"$f":"CONCATENATE(D247,\"-\",\"Tipo de información\",\" \",V247,\"-\",F247)","v":"C75212022-Tipo de información -PRESTACION DE SERVICIOS DE PROMOCION Y PREVENCION – SERVICIOS_ESPECIALIZADOS_ZONA_ANTIOQUIA"}]
["PyP","Gerencia de administración del riesgo","No","C76332022",93141808,"PRESTACION DE SERVICIOS DE PROMOCION Y PREVENCION – SERVICIOS_ESPECIALIZADOS_ZONA_ATLANTICO","1/01/2022",{"$f":"MONTH(G248)","v":1},"30/11/2022",{"$f":"(I248-G248)/30","v":11.1},"Invitación directa","GastosAdministrativos",21505600,21505600,"No","N/A","Gerencia de Abastecimiento Estratégico\ncontratacion@positiva.gov.co\nPBX: (1)6502200 Ext: 10641","SI","SI","NO","SI",null,{"$f":"CONCATENATE(D248,\"-\",\"Tipo de información\",\" \",V248,\"-\",F248)","v":"C76332022-Tipo de información -PRESTACION DE SERVICIOS DE PROMOCION Y PREVENCION – SERVICIOS_ESPECIALIZADOS_ZONA_ATLANTICO"}]
["PyP","Gerencia de administración del riesgo","No","C77122022",93141808,"PRESTACION DE SERVICIOS DE PROMOCION Y PREVENCION – SERVICIOS_ESPECIALIZADOS_ZONA_BOGOTA","1/01/2022",{"$f":"MONTH(G249)","v":1},"30/11/2022",{"$f":"(I249-G249)/30","v":11.1},"Invitación directa","GastosAdministrativos",2500000000,2500000000,"No","N/A","Gerencia de Abastecimiento Estratégico\ncontratacion@positiva.gov.co\nPBX: (1)6502200 Ext: 10641","SI","SI","NO","SI",null,{"$f":"CONCATENATE(D249,\"-\",\"Tipo de información\",\" \",V249,\"-\",F249)","v":"C77122022-Tipo de información -PRESTACION DE SERVICIOS DE PROMOCION Y PREVENCION – SERVICIOS_ESPECIALIZADOS_ZONA_BOGOTA"}]
["PyP","Gerencia de administración del riesgo","No","C77132022",93141808,"PRESTACION DE SERVICIOS DE PROMOCION Y PREVENCION – SERVICIOS_ESPECIALIZADOS_ZONA_BOGOTA","1/01/2022",{"$f":"MONTH(G250)","v":1},"30/11/2022",{"$f":"(I250-G250)/30","v":11.1},"Invitación directa","GastosAdministrativos",280000000,280000000,"No","N/A","Gerencia de Abastecimiento Estratégico\ncontratacion@positiva.gov.co\nPBX: (1)6502200 Ext: 10641","SI","SI","NO","SI",null,{"$f":"CONCATENATE(D250,\"-\",\"Tipo de información\",\" \",V250,\"-\",F250)","v":"C77132022-Tipo de información -PRESTACION DE SERVICIOS DE PROMOCION Y PREVENCION – SERVICIOS_ESPECIALIZADOS_ZONA_BOGOTA"}]
["PyP","Gerencia de administración del riesgo","No","C77142022",93141808,"PRESTACION DE SERVICIOS DE PROMOCION Y PREVENCION – SERVICIOS_ESPECIALIZADOS_ZONA_BOGOTA","1/01/2022",{"$f":"MONTH(G251)","v":1},"30/11/2022",{"$f":"(I251-G251)/30","v":11.1},"Invitación directa","GastosAdministrativos",50000000,50000000,"No","N/A","Gerencia de Abastecimiento Estratégico\ncontratacion@positiva.gov.co\nPBX: (1)6502200 Ext: 10641","SI","SI","NO","SI",null,{"$f":"CONCATENATE(D251,\"-\",\"Tipo de información\",\" \",V251,\"-\",F251)","v":"C77142022-Tipo de información -PRESTACION DE SERVICIOS DE PROMOCION Y PREVENCION – SERVICIOS_ESPECIALIZADOS_ZONA_BOGOTA"}]
["PyP","Gerencia de administración del riesgo","No","C77152022",93141808,"PRESTACION DE SERVICIOS DE PROMOCION Y PREVENCION – SERVICIOS_ESPECIALIZADOS_ZONA_BOGOTA","1/01/2022",{"$f":"MONTH(G252)","v":1},"30/11/2022",{"$f":"(I252-G252)/30","v":11.1},"Invitación directa","GastosAdministrativos",2100000000,2100000000,"No","N/A","Gerencia de Abastecimiento Estratégico\ncontratacion@positiva.gov.co\nPBX: (1)6502200 Ext: 10641","SI","SI","NO","SI",null,{"$f":"CONCATENATE(D252,\"-\",\"Tipo de información\",\" \",V252,\"-\",F252)","v":"C77152022-Tipo de información -PRESTACION DE SERVICIOS DE PROMOCION Y PREVENCION – SERVICIOS_ESPECIALIZADOS_ZONA_BOGOTA"}]
["PyP","Gerencia de administración del riesgo","No","C77162022",93141808,"PRESTACION DE SERVICIOS DE PROMOCION Y PREVENCION – SERVICIOS_ESPECIALIZADOS_ZONA_BOGOTA","1/01/2022",{"$f":"MONTH(G253)","v":1},"30/11/2022",{"$f":"(I253-G253)/30","v":11.1},"Invitación directa","GastosAdministrativos",170000000,170000000,"No","N/A","Gerencia de Abastecimiento Estratégico\ncontratacion@positiva.gov.co\nPBX: (1)6502200 Ext: 10641","SI","SI","NO","SI",null,{"$f":"CONCATENATE(D253,\"-\",\"Tipo de información\",\" \",V253,\"-\",F253)","v":"C77162022-Tipo de información -PRESTACION DE SERVICIOS DE PROMOCION Y PREVENCION – SERVICIOS_ESPECIALIZADOS_ZONA_BOGOTA"}]
["PyP","Gerencia de administración del riesgo","No","C77172022",93141808,"PRESTACION DE SERVICIOS DE PROMOCION Y PREVENCION – SERVICIOS_ESPECIALIZADOS_ZONA_BOGOTA","1/01/2022",{"$f":"MONTH(G254)","v":1},"30/11/2022",{"$f":"(I254-G254)/30","v":11.1},"Invitación directa","GastosAdministrativos",270000000,270000000,"No","N/A","Gerencia de Abastecimiento Estratégico\ncontratacion@positiva.gov.co\nPBX: (1)6502200 Ext: 10641","SI","SI","NO","SI",null,{"$f":"CONCATENATE(D254,\"-\",\"Tipo de información\",\" \",V254,\"-\",F254)","v":"C77172022-Tipo de información -PRESTACION DE SERVICIOS DE PROMOCION Y PREVENCION – SERVICIOS_ESPECIALIZADOS_ZONA_BOGOTA"}]
["PyP","Gerencia de administración del riesgo","No","C77182022",93141808,"PRESTACION DE SERVICIOS DE PROMOCION Y PREVENCION – SERVICIOS_ESPECIALIZADOS_ZONA_BOGOTA","1/01/2022",{"$f":"MONTH(G255)","v":1},"30/11/2022",{"$f":"(I255-G255)/30","v":11.1},"Invitación directa","GastosAdministrativos",180000000,180000000,"No","N/A","Gerencia de Abastecimiento Estratégico\ncontratacion@positiva.gov.co\nPBX: (1)6502200 Ext: 10641","SI","SI","NO","SI",null,{"$f":"CONCATENATE(D255,\"-\",\"Tipo de información\",\" \",V255,\"-\",F255)","v":"C77182022-Tipo de información -PRESTACION DE SERVICIOS DE PROMOCION Y PREVENCION – SERVICIOS_ESPECIALIZADOS_ZONA_BOGOTA"}]
["PyP","Gerencia de administración del riesgo","No","C77192022",93141808,"PRESTACION DE SERVICIOS DE PROMOCION Y PREVENCION – SERVICIOS_ESPECIALIZADOS_ZONA_BOGOTA","1/01/2022",{"$f":"MONTH(G256)","v":1},"30/11/2022",{"$f":"(I256-G256)/30","v":11.1},"Invitación directa","GastosAdministrativos",350000000,350000000,"No","N/A","Gerencia de Abastecimiento Estratégico\ncontratacion@positiva.gov.co\nPBX: (1)6502200 Ext: 10641","SI","SI","NO","SI",null,{"$f":"CONCATENATE(D256,\"-\",\"Tipo de información\",\" \",V256,\"-\",F256)","v":"C77192022-Tipo de información -PRESTACION DE SERVICIOS DE PROMOCION Y PREVENCION – SERVICIOS_ESPECIALIZADOS_ZONA_BOGOTA"}]
["PyP","Gerencia de administración del riesgo","No","C77202022",93141808,"PRESTACION DE SERVICIOS DE PROMOCION Y PREVENCION – SERVICIOS_ESPECIALIZADOS_ZONA_BOGOTA","1/01/2022",{"$f":"MONTH(G257)","v":1},"30/11/2022",{"$f":"(I257-G257)/30","v":11.1},"Invitación directa","GastosAdministrativos",200000000,200000000,"No","N/A","Gerencia de Abastecimiento Estratégico\ncontratacion@positiva.gov.co\nPBX: (1)6502200 Ext: 10641","SI","SI","NO","SI",null,{"$f":"CONCATENATE(D257,\"-\",\"Tipo de información\",\" \",V257,\"-\",F257)","v":"C77202022-Tipo de información -PRESTACION DE SERVICIOS DE PROMOCION Y PREVENCION – SERVICIOS_ESPECIALIZADOS_ZONA_BOGOTA"}]
["PyP","Gerencia de administración del riesgo","No","C77212022",93141808,"PRESTACION DE SERVICIOS DE PROMOCION Y PREVENCION – SERVICIOS_ESPECIALIZADOS_ZONA_BOGOTA","1/01/2022",{"$f":"MONTH(G258)","v":1},"30/11/2022",{"$f":"(I258-G258)/30","v":11.1},"Invitación directa","GastosAdministrativos",206968641,206968641,"No","N/A","Gerencia de Abastecimiento Estratégico\ncontratacion@positiva.gov.co\nPBX: (1)6502200 Ext: 10641","SI","SI","NO","SI",null,{"$f":"CONCATENATE(D258,\"-\",\"Tipo de información\",\" \",V258,\"-\",F258)","v":"C77212022-Tipo de información -PRESTACION DE SERVICIOS DE PROMOCION Y PREVENCION – SERVICIOS_ESPECIALIZADOS_ZONA_BOGOTA"}]
["PyP","Gerencia de administración del riesgo","No","C77222022",93141808,"PRESTACION DE SERVICIOS DE PROMOCION Y PREVENCION – SERVICIOS_ESPECIALIZADOS_ZONA_BOGOTA","1/01/2022",{"$f":"MONTH(G259)","v":1},"30/11/2022",{"$f":"(I259-G259)/30","v":11.1},"Invitación directa","GastosAdministrativos",103846154,103846154,"No","N/A","Gerencia de Abastecimiento Estratégico\ncontratacion@positiva.gov.co\nPBX: (1)6502200 Ext: 10641","SI","SI","NO","SI",null,{"$f":"CONCATENATE(D259,\"-\",\"Tipo de información\",\" \",V259,\"-\",F259)","v":"C77222022-Tipo de información -PRESTACION DE SERVICIOS DE PROMOCION Y PREVENCION – SERVICIOS_ESPECIALIZADOS_ZONA_BOGOTA"}]
["PyP","Gerencia de administración del riesgo","No","C77232022",93141808,"PRESTACION DE SERVICIOS DE PROMOCION Y PREVENCION – SERVICIOS_ESPECIALIZADOS_ZONA_BOGOTA","1/01/2022",{"$f":"MONTH(G260)","v":1},"30/11/2022",{"$f":"(I260-G260)/30","v":11.1},"Invitación directa","GastosAdministrativos",250000000,250000000,"No","N/A","Gerencia de Abastecimiento Estratégico\ncontratacion@positiva.gov.co\nPBX: (1)6502200 Ext: 10641","SI","SI","NO","SI",null,{"$f":"CONCATENATE(D260,\"-\",\"Tipo de información\",\" \",V260,\"-\",F260)","v":"C77232022-Tipo de información -PRESTACION DE SERVICIOS DE PROMOCION Y PREVENCION – SERVICIOS_ESPECIALIZADOS_ZONA_BOGOTA"}]
["PyP","Gerencia de administración del riesgo","No","C77242022",93141808,"PRESTACION DE SERVICIOS DE PROMOCION Y PREVENCION – SERVICIOS_ESPECIALIZADOS_ZONA_BOGOTA","1/01/2022",{"$f":"MONTH(G261)","v":1},"30/11/2022",{"$f":"(I261-G261)/30","v":11.1},"Invitación directa","GastosAdministrativos",54214286,54214286,"No","N/A","Gerencia de Abastecimiento Estratégico\ncontratacion@positiva.gov.co\nPBX: (1)6502200 Ext: 10641","SI","SI","NO","SI",null,{"$f":"CONCATENATE(D261,\"-\",\"Tipo de información\",\" \",V261,\"-\",F261)","v":"C77242022-Tipo de información -PRESTACION DE SERVICIOS DE PROMOCION Y PREVENCION – SERVICIOS_ESPECIALIZADOS_ZONA_BOGOTA"}]
["PyP","Gerencia de administración del riesgo","No","C77252022",93141808,"PRESTACION DE SERVICIOS DE PROMOCION Y PREVENCION – SERVICIOS_ESPECIALIZADOS_ZONA_BOGOTA","1/01/2022",{"$f":"MONTH(G262)","v":1},"30/11/2022",{"$f":"(I262-G262)/30","v":11.1},"Invitación directa","GastosAdministrativos",95306859,95306859,"No","N/A","Gerencia de Abastecimiento Estratégico\ncontratacion@positiva.gov.co\nPBX: (1)6502200 Ext: 10641","SI","SI","NO","SI",null,{"$f":"CONCATENATE(D262,\"-\",\"Tipo de información\",\" \",V262,\"-\",F262)","v":"C77252022-Tipo de información -PRESTACION DE SERVICIOS DE PROMOCION Y PREVENCION – SERVICIOS_ESPECIALIZADOS_ZONA_BOGOTA"}]
["PyP","Gerencia de administración del riesgo","No","C77262022",93141808,"PRESTACION DE SERVICIOS DE PROMOCION Y PREVENCION – SERVICIOS_ESPECIALIZADOS_ZONA_BOGOTA","1/01/2022",{"$f":"MONTH(G263)","v":1},"30/11/2022",{"$f":"(I263-G263)/30","v":11.1},"Invitación directa","GastosAdministrativos",380000000,380000000,"No","N/A","Gerencia de Abastecimiento Estratégico\ncontratacion@positiva.gov.co\nPBX: (1)6502200 Ext: 10641","SI","SI","NO","SI",null,{"$f":"CONCATENATE(D263,\"-\",\"Tipo de información\",\" \",V263,\"-\",F263)","v":"C77262022-Tipo de información -PRESTACION DE SERVICIOS DE PROMOCION Y PREVENCION – SERVICIOS_ESPECIALIZADOS_ZONA_BOGOTA"}]
["PyP","Gerencia de administración del riesgo","No","C77272022",93141808,"PRESTACION DE SERVICIOS DE PROMOCION Y PREVENCION – SERVICIOS_ESPECIALIZADOS_ZONA_BOGOTA","1/01/2022",{"$f":"MONTH(G264)","v":1},"30/11/2022",{"$f":"(I264-G264)/30","v":11.1},"Invitación directa","GastosAdministrativos",320000000,320000000,"No","N/A","Gerencia de Abastecimiento Estratégico\ncontratacion@positiva.gov.co\nPBX: (1)6502200 Ext: 10641","SI","SI","NO","SI",null,{"$f":"CONCATENATE(D264,\"-\",\"Tipo de información\",\" \",V264,\"-\",F264)","v":"C77272022-Tipo de información -PRESTACION DE SERVICIOS DE PROMOCION Y PREVENCION – SERVICIOS_ESPECIALIZADOS_ZONA_BOGOTA"}]
["PyP","Gerencia de administración del riesgo","No","C77282022",93141808,"PRESTACION DE SERVICIOS DE PROMOCION Y PREVENCION – SERVICIOS_ESPECIALIZADOS_ZONA_BOGOTA","1/01/2022",{"$f":"MONTH(G265)","v":1},"30/11/2022",{"$f":"(I265-G265)/30","v":11.1},"Invitación directa","GastosAdministrativos",180000000,180000000,"No","N/A","Gerencia de Abastecimiento Estratégico\ncontratacion@positiva.gov.co\nPBX: (1)6502200 Ext: 10641","SI","SI","NO","SI",null,{"$f":"CONCATENATE(D265,\"-\",\"Tipo de información\",\" \",V265,\"-\",F265)","v":"C77282022-Tipo de información -PRESTACION DE SERVICIOS DE PROMOCION Y PREVENCION – SERVICIOS_ESPECIALIZADOS_ZONA_BOGOTA"}]
["PyP","Gerencia de administración del riesgo","No","C77292022",93141808,"PRESTACION DE SERVICIOS DE PROMOCION Y PREVENCION – SERVICIOS_ESPECIALIZADOS_ZONA_BOGOTA","1/01/2022",{"$f":"MONTH(G266)","v":1},"30/11/2022",{"$f":"(I266-G266)/30","v":11.1},"Invitación directa","GastosAdministrativos",800000000,800000000,"No","N/A","Gerencia de Abastecimiento Estratégico\ncontratacion@positiva.gov.co\nPBX: (1)6502200 Ext: 10641","SI","SI","NO","SI",null,{"$f":"CONCATENATE(D266,\"-\",\"Tipo de información\",\" \",V266,\"-\",F266)","v":"C77292022-Tipo de información -PRESTACION DE SERVICIOS DE PROMOCION Y PREVENCION – SERVICIOS_ESPECIALIZADOS_ZONA_BOGOTA"}]
["PyP","Gerencia de administración del riesgo","No","C77302022",93141808,"PRESTACION DE SERVICIOS DE PROMOCION Y PREVENCION – SERVICIOS_ESPECIALIZADOS_ZONA_BOGOTA","1/01/2022",{"$f":"MONTH(G267)","v":1},"30/11/2022",{"$f":"(I267-G267)/30","v":11.1},"Invitación directa","GastosAdministrativos",68041237,68041237,"No","N/A","Gerencia de Abastecimiento Estratégico\ncontratacion@positiva.gov.co\nPBX: (1)6502200 Ext: 10641","SI","SI","NO","SI",null,{"$f":"CONCATENATE(D267,\"-\",\"Tipo de información\",\" \",V267,\"-\",F267)","v":"C77302022-Tipo de información -PRESTACION DE SERVICIOS DE PROMOCION Y PREVENCION – SERVICIOS_ESPECIALIZADOS_ZONA_BOGOTA"}]
["PyP","Gerencia de administración del riesgo","No","C77312022",93141808,"PRESTACION DE SERVICIOS DE PROMOCION Y PREVENCION – SERVICIOS_ESPECIALIZADOS_ZONA_BOGOTA","1/01/2022",{"$f":"MONTH(G268)","v":1},"30/11/2022",{"$f":"(I268-G268)/30","v":11.1},"Invitación directa","GastosAdministrativos",400000000,400000000,"No","N/A","Gerencia de Abastecimiento Estratégico\ncontratacion@positiva.gov.co\nPBX: (1)6502200 Ext: 10641","SI","SI","NO","SI",null,{"$f":"CONCATENATE(D268,\"-\",\"Tipo de información\",\" \",V268,\"-\",F268)","v":"C77312022-Tipo de información -PRESTACION DE SERVICIOS DE PROMOCION Y PREVENCION – SERVICIOS_ESPECIALIZADOS_ZONA_BOGOTA"}]
["PyP","Gerencia de administración del riesgo","No","C77322022",93141808,"PRESTACION DE SERVICIOS DE PROMOCION Y PREVENCION – SERVICIOS_ESPECIALIZADOS_ZONA_BOGOTA","1/01/2022",{"$f":"MONTH(G269)","v":1},"30/11/2022",{"$f":"(I269-G269)/30","v":11.1},"Invitación directa","GastosAdministrativos",120000000,120000000,"No","N/A","Gerencia de Abastecimiento Estratégico\ncontratacion@positiva.gov.co\nPBX: (1)6502200 Ext: 10641","SI","SI","NO","SI",null,{"$f":"CONCATENATE(D269,\"-\",\"Tipo de información\",\" \",V269,\"-\",F269)","v":"C77322022-Tipo de información -PRESTACION DE SERVICIOS DE PROMOCION Y PREVENCION – SERVICIOS_ESPECIALIZADOS_ZONA_BOGOTA"}]
["PyP","Gerencia de administración del riesgo","No","C77332022",93141808,"PRESTACION DE SERVICIOS DE PROMOCION Y PREVENCION – SERVICIOS_ESPECIALIZADOS_ZONA_BOGOTA","1/01/2022",{"$f":"MONTH(G270)","v":1},"30/11/2022",{"$f":"(I270-G270)/30","v":11.1},"Invitación directa","GastosAdministrativos",89491525,89491525,"No","N/A","Gerencia de Abastecimiento Estratégico\ncontratacion@positiva.gov.co\nPBX: (1)6502200 Ext: 10641","SI","SI","NO","SI",null,{"$f":"CONCATENATE(D270,\"-\",\"Tipo de información\",\" \",V270,\"-\",F270)","v":"C77332022-Tipo de información -PRESTACION DE SERVICIOS DE PROMOCION Y PREVENCION – SERVICIOS_ESPECIALIZADOS_ZONA_BOGOTA"}]
["PyP","Gerencia de administración del riesgo","No","C77342022",93141808,"PRESTACION DE SERVICIOS DE PROMOCION Y PREVENCION – SERVICIOS_ESPECIALIZADOS_ZONA_BOGOTA","1/01/2022",{"$f":"MONTH(G271)","v":1},"30/11/2022",{"$f":"(I271-G271)/30","v":11.1},"Invitación directa","GastosAdministrativos",250000000,250000000,"No","N/A","Gerencia de Abastecimiento Estratégico\ncontratacion@positiva.gov.co\nPBX: (1)6502200 Ext: 10641","SI","SI","NO","SI",null,{"$f":"CONCATENATE(D271,\"-\",\"Tipo de información\",\" \",V271,\"-\",F271)","v":"C77342022-Tipo de información -PRESTACION DE SERVICIOS DE PROMOCION Y PREVENCION – SERVICIOS_ESPECIALIZADOS_ZONA_BOGOTA"}]
["PyP","Gerencia de administración del riesgo","No","C77352022",93141808,"PRESTACION DE SERVICIOS DE PROMOCION Y PREVENCION – SERVICIOS_ESPECIALIZADOS_ZONA_BOGOTA","1/01/2022",{"$f":"MONTH(G272)","v":1},"30/11/2022",{"$f":"(I272-G272)/30","v":11.1},"Invitación directa","GastosAdministrativos",800000000,800000000,"No","N/A","Gerencia de Abastecimiento Estratégico\ncontratacion@positiva.gov.co\nPBX: (1)6502200 Ext: 10641","SI","SI","NO","SI",null,{"$f":"CONCATENATE(D272,\"-\",\"Tipo de información\",\" \",V272,\"-\",F272)","v":"C77352022-Tipo de información -PRESTACION DE SERVICIOS DE PROMOCION Y PREVENCION – SERVICIOS_ESPECIALIZADOS_ZONA_BOGOTA"}]
["PyP","Gerencia de administración del riesgo","No","C77362022",93141808,"PRESTACION DE SERVICIOS DE PROMOCION Y PREVENCION – SERVICIOS_ESPECIALIZADOS_ZONA_BOGOTA","1/01/2022",{"$f":"MONTH(G273)","v":1},"30/11/2022",{"$f":"(I273-G273)/30","v":11.1},"Invitación directa","GastosAdministrativos",1800000000,1800000000,"No","N/A","Gerencia de Abastecimiento Estratégico\ncontratacion@positiva.gov.co\nPBX: (1)6502200 Ext: 10641","SI","SI","NO","SI",null,{"$f":"CONCATENATE(D273,\"-\",\"Tipo de información\",\" \",V273,\"-\",F273)","v":"C77362022-Tipo de información -PRESTACION DE SERVICIOS DE PROMOCION Y PREVENCION – SERVICIOS_ESPECIALIZADOS_ZONA_BOGOTA"}]
["PyP","Gerencia de administración del riesgo","No","C77372022",93141808,"PRESTACION DE SERVICIOS DE PROMOCION Y PREVENCION – SERVICIOS_ESPECIALIZADOS_ZONA_BOGOTA","1/01/2022",{"$f":"MONTH(G274)","v":1},"30/11/2022",{"$f":"(I274-G274)/30","v":11.1},"Invitación directa","GastosAdministrativos",33600000,33600000,"No","N/A","Gerencia de Abastecimiento Estratégico\ncontratacion@positiva.gov.co\nPBX: (1)6502200 Ext: 10641","SI","SI","NO","SI",null,{"$f":"CONCATENATE(D274,\"-\",\"Tipo de información\",\" \",V274,\"-\",F274)","v":"C77372022-Tipo de información -PRESTACION DE SERVICIOS DE PROMOCION Y PREVENCION – SERVICIOS_ESPECIALIZADOS_ZONA_BOGOTA"}]
["PyP","Gerencia de administración del riesgo","No","C77382022",93141808,"PRESTACION DE SERVICIOS DE PROMOCION Y PREVENCION – SERVICIOS_ESPECIALIZADOS_ZONA_BOGOTA","1/01/2022",{"$f":"MONTH(G275)","v":1},"30/11/2022",{"$f":"(I275-G275)/30","v":11.1},"Invitación directa","GastosAdministrativos",118972589,118972589,"No","N/A","Gerencia de Abastecimiento Estratégico\ncontratacion@positiva.gov.co\nPBX: (1)6502200 Ext: 10641","SI","SI","NO","SI",null,{"$f":"CONCATENATE(D275,\"-\",\"Tipo de información\",\" \",V275,\"-\",F275)","v":"C77382022-Tipo de información -PRESTACION DE SERVICIOS DE PROMOCION Y PREVENCION – SERVICIOS_ESPECIALIZADOS_ZONA_BOGOTA"}]
["PyP","Gerencia de administración del riesgo","No","C77392022",93141808,"PRESTACION DE SERVICIOS DE PROMOCION Y PREVENCION – SERVICIOS_ESPECIALIZADOS_ZONA_BOGOTA","1/01/2022",{"$f":"MONTH(G276)","v":1},"30/11/2022",{"$f":"(I276-G276)/30","v":11.1},"Invitación directa","GastosAdministrativos",250000000,250000000,"No","N/A","Gerencia de Abastecimiento Estratégico\ncontratacion@positiva.gov.co\nPBX: (1)6502200 Ext: 10641","SI","SI","NO","SI",null,{"$f":"CONCATENATE(D276,\"-\",\"Tipo de información\",\" \",V276,\"-\",F276)","v":"C77392022-Tipo de información -PRESTACION DE SERVICIOS DE PROMOCION Y PREVENCION – SERVICIOS_ESPECIALIZADOS_ZONA_BOGOTA"}]
["PyP","Gerencia de administración del riesgo","No","C77402022",93141808,"PRESTACION DE SERVICIOS DE PROMOCION Y PREVENCION – SERVICIOS_ESPECIALIZADOS_ZONA_BOGOTA","1/01/2022",{"$f":"MONTH(G277)","v":1},"30/11/2022",{"$f":"(I277-G277)/30","v":11.1},"Invitación directa","GastosAdministrativos",500000000,500000000,"No","N/A","Gerencia de Abastecimiento Estratégico\ncontratacion@positiva.gov.co\nPBX: (1)6502200 Ext: 10641","SI","SI","NO","SI",null,{"$f":"CONCATENATE(D277,\"-\",\"Tipo de información\",\" \",V277,\"-\",F277)","v":"C77402022-Tipo de información -PRESTACION DE SERVICIOS DE PROMOCION Y PREVENCION – SERVICIOS_ESPECIALIZADOS_ZONA_BOGOTA"}]
["PyP","Gerencia de administración del riesgo","No","C77412022",93141808,"PRESTACION DE SERVICIOS DE PROMOCION Y PREVENCION – SERVICIOS_ESPECIALIZADOS_ZONA_BOGOTA","1/01/2022",{"$f":"MONTH(G278)","v":1},"30/11/2022",{"$f":"(I278-G278)/30","v":11.1},"Invitación directa","GastosAdministrativos",210000000,210000000,"No","N/A","Gerencia de Abastecimiento Estratégico\ncontratacion@positiva.gov.co\nPBX: (1)6502200 Ext: 10641","SI","SI","NO","SI",null,{"$f":"CONCATENATE(D278,\"-\",\"Tipo de información\",\" \",V278,\"-\",F278)","v":"C77412022-Tipo de información -PRESTACION DE SERVICIOS DE PROMOCION Y PREVENCION – SERVICIOS_ESPECIALIZADOS_ZONA_BOGOTA"}]
["PyP","Gerencia de administración del riesgo","No","C77422022",93141808,"PRESTACION DE SERVICIOS DE PROMOCION Y PREVENCION – SERVICIOS_ESPECIALIZADOS_ZONA_BOGOTA","1/01/2022",{"$f":"MONTH(G279)","v":1},"30/11/2022",{"$f":"(I279-G279)/30","v":11.1},"Invitación directa","GastosAdministrativos",130000000,130000000,"No","N/A","Gerencia de Abastecimiento Estratégico\ncontratacion@positiva.gov.co\nPBX: (1)6502200 Ext: 10641","SI","SI","NO","SI",null,{"$f":"CONCATENATE(D279,\"-\",\"Tipo de información\",\" \",V279,\"-\",F279)","v":"C77422022-Tipo de información -PRESTACION DE SERVICIOS DE PROMOCION Y PREVENCION – SERVICIOS_ESPECIALIZADOS_ZONA_BOGOTA"}]
["PyP","Gerencia de administración del riesgo","No","C77432022",93141808,"PRESTACION DE SERVICIOS DE PROMOCION Y PREVENCION – SERVICIOS_ESPECIALIZADOS_ZONA_BOGOTA","1/01/2022",{"$f":"MONTH(G280)","v":1},"30/11/2022",{"$f":"(I280-G280)/30","v":11.1},"Invitación directa","GastosAdministrativos",140000000,140000000,"No","N/A","Gerencia de Abastecimiento Estratégico\ncontratacion@positiva.gov.co\nPBX: (1)6502200 Ext: 10641","SI","SI","NO","SI",null,{"$f":"CONCATENATE(D280,\"-\",\"Tipo de información\",\" \",V280,\"-\",F280)","v":"C77432022-Tipo de información -PRESTACION DE SERVICIOS DE PROMOCION Y PREVENCION – SERVICIOS_ESPECIALIZADOS_ZONA_BOGOTA"}]
["PyP","Gerencia de administración del riesgo","No","C77442022",93141808,"PRESTACION DE SERVICIOS DE PROMOCION Y PREVENCION – SERVICIOS_ESPECIALIZADOS_ZONA_BOGOTA","1/01/2022",{"$f":"MONTH(G281)","v":1},"30/11/2022",{"$f":"(I281-G281)/30","v":11.1},"Invitación directa","GastosAdministrativos",59000000,59000000,"No","N/A","Gerencia de Abastecimiento Estratégico\ncontratacion@positiva.gov.co\nPBX: (1)6502200 Ext: 10641","SI","SI","NO","SI",null,{"$f":"CONCATENATE(D281,\"-\",\"Tipo de información\",\" \",V281,\"-\",F281)","v":"C77442022-Tipo de información -PRESTACION DE SERVICIOS DE PROMOCION Y PREVENCION – SERVICIOS_ESPECIALIZADOS_ZONA_BOGOTA"}]
["PyP","Gerencia de administración del riesgo","No","C77452022",93141808,"PRESTACION DE SERVICIOS DE PROMOCION Y PREVENCION – SERVICIOS_ESPECIALIZADOS_ZONA_BOGOTA","1/01/2022",{"$f":"MONTH(G282)","v":1},"30/11/2022",{"$f":"(I282-G282)/30","v":11.1},"Invitación directa","GastosAdministrativos",470000000,470000000,"No","N/A","Gerencia de Abastecimiento Estratégico\ncontratacion@positiva.gov.co\nPBX: (1)6502200 Ext: 10641","SI","SI","NO","SI",null,{"$f":"CONCATENATE(D282,\"-\",\"Tipo de información\",\" \",V282,\"-\",F282)","v":"C77452022-Tipo de información -PRESTACION DE SERVICIOS DE PROMOCION Y PREVENCION – SERVICIOS_ESPECIALIZADOS_ZONA_BOGOTA"}]
["PyP","Gerencia de administración del riesgo","No","C77462022",93141808,"PRESTACION DE SERVICIOS DE PROMOCION Y PREVENCION – SERVICIOS_ESPECIALIZADOS_ZONA_BOGOTA","1/01/2022",{"$f":"MONTH(G283)","v":1},"30/11/2022",{"$f":"(I283-G283)/30","v":11.1},"Invitación directa","GastosAdministrativos",40000000,40000000,"No","N/A","Gerencia de Abastecimiento Estratégico\ncontratacion@positiva.gov.co\nPBX: (1)6502200 Ext: 10641","SI","SI","NO","SI",null,{"$f":"CONCATENATE(D283,\"-\",\"Tipo de información\",\" \",V283,\"-\",F283)","v":"C77462022-Tipo de información -PRESTACION DE SERVICIOS DE PROMOCION Y PREVENCION – SERVICIOS_ESPECIALIZADOS_ZONA_BOGOTA"}]
["PyP","Gerencia de administración del riesgo","No","C77472022",93141808,"PRESTACION DE SERVICIOS DE PROMOCION Y PREVENCION – SERVICIOS_ESPECIALIZADOS_ZONA_BOGOTA","1/01/2022",{"$f":"MONTH(G284)","v":1},"30/11/2022",{"$f":"(I284-G284)/30","v":11.1},"Invitación directa","GastosAdministrativos",67000000,67000000,"No","N/A","Gerencia de Abastecimiento Estratégico\ncontratacion@positiva.gov.co\nPBX: (1)6502200 Ext: 10641","SI","SI","NO","SI",null,{"$f":"CONCATENATE(D284,\"-\",\"Tipo de información\",\" \",V284,\"-\",F284)","v":"C77472022-Tipo de información -PRESTACION DE SERVICIOS DE PROMOCION Y PREVENCION – SERVICIOS_ESPECIALIZADOS_ZONA_BOGOTA"}]
["PyP","Gerencia de administración del riesgo","No","C77482022",93141808,"PRESTACION DE SERVICIOS DE PROMOCION Y PREVENCION – SERVICIOS_ESPECIALIZADOS_ZONA_BOGOTA","1/01/2022",{"$f":"MONTH(G285)","v":1},"30/11/2022",{"$f":"(I285-G285)/30","v":11.1},"Invitación directa","GastosAdministrativos",2500000000,2500000000,"No","N/A","Gerencia de Abastecimiento Estratégico\ncontratacion@positiva.gov.co\nPBX: (1)6502200 Ext: 10641","SI","SI","NO","SI",null,{"$f":"CONCATENATE(D285,\"-\",\"Tipo de información\",\" \",V285,\"-\",F285)","v":"C77482022-Tipo de información -PRESTACION DE SERVICIOS DE PROMOCION Y PREVENCION – SERVICIOS_ESPECIALIZADOS_ZONA_BOGOTA"}]
["PyP","Gerencia de administración del riesgo","No","C77492022",93141808,"PRESTACION DE SERVICIOS DE PROMOCION Y PREVENCION – SERVICIOS_ESPECIALIZADOS_ZONA_BOGOTA","1/01/2022",{"$f":"MONTH(G286)","v":1},"30/11/2022",{"$f":"(I286-G286)/30","v":11.1},"Invitación directa","GastosAdministrativos",400000000,400000000,"No","N/A","Gerencia de Abastecimiento Estratégico\ncontratacion@positiva.gov.co\nPBX: (1)6502200 Ext: 10641","SI","SI","NO","SI",null,{"$f":"CONCATENATE(D286,\"-\",\"Tipo de información\",\" \",V286,\"-\",F286)","v":"C77492022-Tipo de información -PRESTACION DE SERVICIOS DE PROMOCION Y PREVENCION – SERVICIOS_ESPECIALIZADOS_ZONA_BOGOTA"}]
["PyP","Gerencia de administración del riesgo","No","C77502022",93141808,"PRESTACION DE SERVICIOS DE PROMOCION Y PREVENCION – SERVICIOS_ESPECIALIZADOS_ZONA_BOGOTA","1/01/2022",{"$f":"MONTH(G287)","v":1},"30/11/2022",{"$f":"(I287-G287)/30","v":11.1},"Invitación directa","GastosAdministrativos",150000000,150000000,"No","N/A","Gerencia de Abastecimiento Estratégico\ncontratacion@positiva.gov.co\nPBX: (1)6502200 Ext: 10641","SI","SI","NO","SI",null,{"$f":"CONCATENATE(D287,\"-\",\"Tipo de información\",\" \",V287,\"-\",F287)","v":"C77502022-Tipo de información -PRESTACION DE SERVICIOS DE PROMOCION Y PREVENCION – SERVICIOS_ESPECIALIZADOS_ZONA_BOGOTA"}]
["PyP","Gerencia de administración del riesgo","No","C77512022",93141808,"PRESTACION DE SERVICIOS DE PROMOCION Y PREVENCION – SERVICIOS_ESPECIALIZADOS_ZONA_BOGOTA","1/01/2022",{"$f":"MONTH(G288)","v":1},"30/11/2022",{"$f":"(I288-G288)/30","v":11.1},"Invitación directa","GastosAdministrativos",500000000,500000000,"No","N/A","Gerencia de Abastecimiento Estratégico\ncontratacion@positiva.gov.co\nPBX: (1)6502200 Ext: 10641","SI","SI","NO","SI",null,{"$f":"CONCATENATE(D288,\"-\",\"Tipo de información\",\" \",V288,\"-\",F288)","v":"C77512022-Tipo de información -PRESTACION DE SERVICIOS DE PROMOCION Y PREVENCION – SERVICIOS_ESPECIALIZADOS_ZONA_BOGOTA"}]
["PyP","Gerencia de administración del riesgo","No","C77522022",93141808,"PRESTACION DE SERVICIOS DE PROMOCION Y PREVENCION – SERVICIOS_ESPECIALIZADOS_ZONA_BOGOTA","1/01/2022",{"$f":"MONTH(G289)","v":1},"30/11/2022",{"$f":"(I289-G289)/30","v":11.1},"Invitación directa","GastosAdministrativos",150000000,150000000,"No","N/A","Gerencia de Abastecimiento Estratégico\ncontratacion@positiva.gov.co\nPBX: (1)6502200 Ext: 10641","SI","SI","NO","SI",null,{"$f":"CONCATENATE(D289,\"-\",\"Tipo de información\",\" \",V289,\"-\",F289)","v":"C77522022-Tipo de información -PRESTACION DE SERVICIOS DE PROMOCION Y PREVENCION – SERVICIOS_ESPECIALIZADOS_ZONA_BOGOTA"}]
["PyP","Gerencia de administración del riesgo","No","C77532022",93141808,"PRESTACION DE SERVICIOS DE PROMOCION Y PREVENCION – SERVICIOS_ESPECIALIZADOS_ZONA_BOGOTA","1/01/2022",{"$f":"MONTH(G290)","v":1},"30/11/2022",{"$f":"(I290-G290)/30","v":11.1},"Invitación directa","GastosAdministrativos",56000000,56000000,"No","N/A","Gerencia de Abastecimiento Estratégico\ncontratacion@positiva.gov.co\nPBX: (1)6502200 Ext: 10641","SI","SI","NO","SI",null,{"$f":"CONCATENATE(D290,\"-\",\"Tipo de información\",\" \",V290,\"-\",F290)","v":"C77532022-Tipo de información -PRESTACION DE SERVICIOS DE PROMOCION Y PREVENCION – SERVICIOS_ESPECIALIZADOS_ZONA_BOGOTA"}]
["PyP","Gerencia de administración del riesgo","No","C79362022",93141808,"PRESTACION DE SERVICIOS DE PROMOCION Y PREVENCION – SERVICIOS_ESPECIALIZADOS_ZONA_SANTANDER","1/01/2022",{"$f":"MONTH(G291)","v":1},"30/11/2022",{"$f":"(I291-G291)/30","v":11.1},"Invitación directa","GastosAdministrativos",40000000,40000000,"No","N/A","Gerencia de Abastecimiento Estratégico\ncontratacion@positiva.gov.co\nPBX: (1)6502200 Ext: 10641","SI","SI","NO","SI",null,{"$f":"CONCATENATE(D291,\"-\",\"Tipo de información\",\" \",V291,\"-\",F291)","v":"C79362022-Tipo de información -PRESTACION DE SERVICIOS DE PROMOCION Y PREVENCION – SERVICIOS_ESPECIALIZADOS_ZONA_SANTANDER"}]
["PyP","Gerencia de administración del riesgo","No","C81182022",93141808,"PRESTACION DE SERVICIOS DE PROMOCION Y PREVENCION – SERVICIOS_ESPECIALIZADOS_CUENTA_FGN","1/01/2022",{"$f":"MONTH(G292)","v":1},"30/11/2022",{"$f":"(I292-G292)/30","v":11.1},"Invitación directa","GastosAdministrativos",40000000,40000000,"No","N/A","Gerencia de Abastecimiento Estratégico\ncontratacion@positiva.gov.co\nPBX: (1)6502200 Ext: 10641","SI","SI","NO","SI",null,{"$f":"CONCATENATE(D292,\"-\",\"Tipo de información\",\" \",V292,\"-\",F292)","v":"C81182022-Tipo de información -PRESTACION DE SERVICIOS DE PROMOCION Y PREVENCION – SERVICIOS_ESPECIALIZADOS_CUENTA_FGN"}]
["PyP","Gerencia de administración del riesgo","No","C81192022",93141808,"PRESTACION DE SERVICIOS DE PROMOCION Y PREVENCION – SERVICIOS_ESPECIALIZADOS_CUENTA_FGN","1/01/2022",{"$f":"MONTH(G293)","v":1},"30/11/2022",{"$f":"(I293-G293)/30","v":11.1},"Invitación directa","GastosAdministrativos",46000000,46000000,"No","N/A","Gerencia de Abastecimiento Estratégico\ncontratacion@positiva.gov.co\nPBX: (1)6502200 Ext: 10641","SI","SI","NO","SI",null,{"$f":"CONCATENATE(D293,\"-\",\"Tipo de información\",\" \",V293,\"-\",F293)","v":"C81192022-Tipo de información -PRESTACION DE SERVICIOS DE PROMOCION Y PREVENCION – SERVICIOS_ESPECIALIZADOS_CUENTA_FGN"}]
["PyP","Gerencia de administración del riesgo","No","C81202022",93141808,"PRESTACION DE SERVICIOS DE PROMOCION Y PREVENCION – SERVICIOS_ESPECIALIZADOS_CUENTA_FGN","1/01/2022",{"$f":"MONTH(G294)","v":1},"30/11/2022",{"$f":"(I294-G294)/30","v":11.1},"Invitación directa","GastosAdministrativos",75000000,75000000,"No","N/A","Gerencia de Abastecimiento Estratégico\ncontratacion@positiva.gov.co\nPBX: (1)6502200 Ext: 10641","SI","SI","NO","SI",null,{"$f":"CONCATENATE(D294,\"-\",\"Tipo de información\",\" \",V294,\"-\",F294)","v":"C81202022-Tipo de información -PRESTACION DE SERVICIOS DE PROMOCION Y PREVENCION – SERVICIOS_ESPECIALIZADOS_CUENTA_FGN"}]
["PyP","Gerencia de administración del riesgo","No","C81212022",93141808,"PRESTACION DE SERVICIOS DE PROMOCION Y PREVENCION – SERVICIOS_ESPECIALIZADOS_CUENTA_FGN","1/01/2022",{"$f":"MONTH(G295)","v":1},"30/11/2022",{"$f":"(I295-G295)/30","v":11.1},"Invitación directa","GastosAdministrativos",35000000,35000000,"No","N/A","Gerencia de Abastecimiento Estratégico\ncontratacion@positiva.gov.co\nPBX: (1)6502200 Ext: 10641","SI","SI","NO","SI",null,{"$f":"CONCATENATE(D295,\"-\",\"Tipo de información\",\" \",V295,\"-\",F295)","v":"C81212022-Tipo de información -PRESTACION DE SERVICIOS DE PROMOCION Y PREVENCION – SERVICIOS_ESPECIALIZADOS_CUENTA_FGN"}]
["PyP","Gerencia de administración del riesgo","No","C81222022",93141808,"PRESTACION DE SERVICIOS DE PROMOCION Y PREVENCION – SERVICIOS_ESPECIALIZADOS_CUENTA_FGN","1/01/2022",{"$f":"MONTH(G296)","v":1},"30/11/2022",{"$f":"(I296-G296)/30","v":11.1},"Invitación directa","GastosAdministrativos",75000000,75000000,"No","N/A","Gerencia de Abastecimiento Estratégico\ncontratacion@positiva.gov.co\nPBX: (1)6502200 Ext: 10641","SI","SI","NO","SI",null,{"$f":"CONCATENATE(D296,\"-\",\"Tipo de información\",\" \",V296,\"-\",F296)","v":"C81222022-Tipo de información -PRESTACION DE SERVICIOS DE PROMOCION Y PREVENCION – SERVICIOS_ESPECIALIZADOS_CUENTA_FGN"}]
["PyP","Gerencia de administración del riesgo","No","C81232022",93141808,"PRESTACION DE SERVICIOS DE PROMOCION Y PREVENCION – SERVICIOS_ESPECIALIZADOS_CUENTA_FGN","1/01/2022",{"$f":"MONTH(G297)","v":1},"30/11/2022",{"$f":"(I297-G297)/30","v":11.1},"Invitación directa","GastosAdministrativos",22000000,22000000,"No","N/A","Gerencia de Abastecimiento Estratégico\ncontratacion@positiva.gov.co\nPBX: (1)6502200 Ext: 10641","SI","SI","NO","SI",null,{"$f":"CONCATENATE(D297,\"-\",\"Tipo de información\",\" \",V297,\"-\",F297)","v":"C81232022-Tipo de información -PRESTACION DE SERVICIOS DE PROMOCION Y PREVENCION – SERVICIOS_ESPECIALIZADOS_CUENTA_FGN"}]
["PyP","Gerencia de administración del riesgo","No","C81242022",93141808,"PRESTACION DE SERVICIOS DE PROMOCION Y PREVENCION – SERVICIOS_ESPECIALIZADOS_CUENTA_FGN","1/01/2022",{"$f":"MONTH(G298)","v":1},"30/11/2022",{"$f":"(I298-G298)/30","v":11.1},"Invitación directa","GastosAdministrativos",45000000,45000000,"No","N/A","Gerencia de Abastecimiento Estratégico\ncontratacion@positiva.gov.co\nPBX: (1)6502200 Ext: 10641","SI","SI","NO","SI",null,{"$f":"CONCATENATE(D298,\"-\",\"Tipo de información\",\" \",V298,\"-\",F298)","v":"C81242022-Tipo de información -PRESTACION DE SERVICIOS DE PROMOCION Y PREVENCION – SERVICIOS_ESPECIALIZADOS_CUENTA_FGN"}]
["PyP","Gerencia de administración del riesgo","No","C81252022",93141808,"PRESTACION DE SERVICIOS DE PROMOCION Y PREVENCION – SERVICIOS_ESPECIALIZADOS_CUENTA_FGN","1/01/2022",{"$f":"MONTH(G299)","v":1},"30/11/2022",{"$f":"(I299-G299)/30","v":11.1},"Invitación directa","GastosAdministrativos",35000000,35000000,"No","N/A","Gerencia de Abastecimiento Estratégico\ncontratacion@positiva.gov.co\nPBX: (1)6502200 Ext: 10641","SI","SI","NO","SI",null,{"$f":"CONCATENATE(D299,\"-\",\"Tipo de información\",\" \",V299,\"-\",F299)","v":"C81252022-Tipo de información -PRESTACION DE SERVICIOS DE PROMOCION Y PREVENCION – SERVICIOS_ESPECIALIZADOS_CUENTA_FGN"}]
["PyP","Gerencia de administración del riesgo","No","C81262022",93141808,"PRESTACION DE SERVICIOS DE PROMOCION Y PREVENCION – SERVICIOS_ESPECIALIZADOS_CUENTA_FGN","1/01/2022",{"$f":"MONTH(G300)","v":1},"30/11/2022",{"$f":"(I300-G300)/30","v":11.1},"Invitación directa","GastosAdministrativos",23000000,23000000,"No","N/A","Gerencia de Abastecimiento Estratégico\ncontratacion@positiva.gov.co\nPBX: (1)6502200 Ext: 10641","SI","SI","NO","SI",null,{"$f":"CONCATENATE(D300,\"-\",\"Tipo de información\",\" \",V300,\"-\",F300)","v":"C81262022-Tipo de información -PRESTACION DE SERVICIOS DE PROMOCION Y PREVENCION – SERVICIOS_ESPECIALIZADOS_CUENTA_FGN"}]
["PyP","Gerencia de administración del riesgo","No","C81272022",93141808,"PRESTACION DE SERVICIOS DE PROMOCION Y PREVENCION – SERVICIOS_ESPECIALIZADOS_CUENTA_FGN","1/01/2022",{"$f":"MONTH(G301)","v":1},"30/11/2022",{"$f":"(I301-G301)/30","v":11.1},"Invitación directa","GastosAdministrativos",80000000,80000000,"No","N/A","Gerencia de Abastecimiento Estratégico\ncontratacion@positiva.gov.co\nPBX: (1)6502200 Ext: 10641","SI","SI","NO","SI",null,{"$f":"CONCATENATE(D301,\"-\",\"Tipo de información\",\" \",V301,\"-\",F301)","v":"C81272022-Tipo de información -PRESTACION DE SERVICIOS DE PROMOCION Y PREVENCION – SERVICIOS_ESPECIALIZADOS_CUENTA_FGN"}]
["PyP","Gerencia de administración del riesgo","No","C81282022",93141808,"PRESTACION DE SERVICIOS DE PROMOCION Y PREVENCION – SERVICIOS_ESPECIALIZADOS_CUENTA_FGN","1/01/2022",{"$f":"MONTH(G302)","v":1},"30/11/2022",{"$f":"(I302-G302)/30","v":11.1},"Invitación directa","GastosAdministrativos",200000000,200000000,"No","N/A","Gerencia de Abastecimiento Estratégico\ncontratacion@positiva.gov.co\nPBX: (1)6502200 Ext: 10641","SI","SI","NO","SI",null,{"$f":"CONCATENATE(D302,\"-\",\"Tipo de información\",\" \",V302,\"-\",F302)","v":"C81282022-Tipo de información -PRESTACION DE SERVICIOS DE PROMOCION Y PREVENCION – SERVICIOS_ESPECIALIZADOS_CUENTA_FGN"}]
["PyP","Gerencia de administración del riesgo","No","C75222022",93141808,"PRESTACION DE SERVICIOS DE PROMOCION Y PREVENCION – SERVICIOS_ESPECIALIZADOS_ZONA_ANTIOQUIA","1/01/2022",{"$f":"MONTH(G303)","v":1},"30/11/2022",{"$f":"(I303-G303)/30","v":11.1},"Invitación directa","GastosAdministrativos",30000000,30000000,"No","N/A","Gerencia de Abastecimiento Estratégico\ncontratacion@positiva.gov.co\nPBX: (1)6502200 Ext: 10641","SI","SI","NO","SI",null,{"$f":"CONCATENATE(D303,\"-\",\"Tipo de información\",\" \",V303,\"-\",F303)","v":"C75222022-Tipo de información -PRESTACION DE SERVICIOS DE PROMOCION Y PREVENCION – SERVICIOS_ESPECIALIZADOS_ZONA_ANTIOQUIA"}]
["PyP","Gerencia de administración del riesgo","No","C75232022",93141808,"PRESTACION DE SERVICIOS DE PROMOCION Y PREVENCION – SERVICIOS_ESPECIALIZADOS_ZONA_ANTIOQUIA","1/01/2022",{"$f":"MONTH(G304)","v":1},"30/11/2022",{"$f":"(I304-G304)/30","v":11.1},"Invitación directa","GastosAdministrativos",36000000,36000000,"No","N/A","Gerencia de Abastecimiento Estratégico\ncontratacion@positiva.gov.co\nPBX: (1)6502200 Ext: 10641","SI","SI","NO","SI",null,{"$f":"CONCATENATE(D304,\"-\",\"Tipo de información\",\" \",V304,\"-\",F304)","v":"C75232022-Tipo de información -PRESTACION DE SERVICIOS DE PROMOCION Y PREVENCION – SERVICIOS_ESPECIALIZADOS_ZONA_ANTIOQUIA"}]
["PyP","Gerencia de administración del riesgo","No","C75242022",93141808,"PRESTACION DE SERVICIOS DE PROMOCION Y PREVENCION – SERVICIOS_ESPECIALIZADOS_ZONA_ANTIOQUIA","1/01/2022",{"$f":"MONTH(G305)","v":1},"30/11/2022",{"$f":"(I305-G305)/30","v":11.1},"Invitación directa","GastosAdministrativos",160000000,160000000,"No","N/A","Gerencia de Abastecimiento Estratégico\ncontratacion@positiva.gov.co\nPBX: (1)6502200 Ext: 10641","SI","SI","NO","SI",null,{"$f":"CONCATENATE(D305,\"-\",\"Tipo de información\",\" \",V305,\"-\",F305)","v":"C75242022-Tipo de información -PRESTACION DE SERVICIOS DE PROMOCION Y PREVENCION – SERVICIOS_ESPECIALIZADOS_ZONA_ANTIOQUIA"}]
["PyP","Gerencia de administración del riesgo","No","C75252022",93141808,"PRESTACION DE SERVICIOS DE PROMOCION Y PREVENCION – SERVICIOS_ESPECIALIZADOS_ZONA_ANTIOQUIA","1/01/2022",{"$f":"MONTH(G306)","v":1},"30/11/2022",{"$f":"(I306-G306)/30","v":11.1},"Invitación directa","GastosAdministrativos",363392857,363392857,"No","N/A","Gerencia de Abastecimiento Estratégico\ncontratacion@positiva.gov.co\nPBX: (1)6502200 Ext: 10641","SI","SI","NO","SI",null,{"$f":"CONCATENATE(D306,\"-\",\"Tipo de información\",\" \",V306,\"-\",F306)","v":"C75252022-Tipo de información -PRESTACION DE SERVICIOS DE PROMOCION Y PREVENCION – SERVICIOS_ESPECIALIZADOS_ZONA_ANTIOQUIA"}]
["PyP","Gerencia de administración del riesgo","No","C75272022",93141808,"PRESTACION DE SERVICIOS DE PROMOCION Y PREVENCION – SERVICIOS_ESPECIALIZADOS_ZONA_ANTIOQUIA","1/01/2022",{"$f":"MONTH(G307)","v":1},"30/11/2022",{"$f":"(I307-G307)/30","v":11.1},"Invitación directa","GastosAdministrativos",80000000,80000000,"No","N/A","Gerencia de Abastecimiento Estratégico\ncontratacion@positiva.gov.co\nPBX: (1)6502200 Ext: 10641","SI","SI","NO","SI",null,{"$f":"CONCATENATE(D307,\"-\",\"Tipo de información\",\" \",V307,\"-\",F307)","v":"C75272022-Tipo de información -PRESTACION DE SERVICIOS DE PROMOCION Y PREVENCION – SERVICIOS_ESPECIALIZADOS_ZONA_ANTIOQUIA"}]
["PyP","Gerencia de administración del riesgo","No","C75282022",93141808,"PRESTACION DE SERVICIOS DE PROMOCION Y PREVENCION – SERVICIOS_ESPECIALIZADOS_ZONA_ANTIOQUIA","1/01/2022",{"$f":"MONTH(G308)","v":1},"30/11/2022",{"$f":"(I308-G308)/30","v":11.1},"Invitación directa","GastosAdministrativos",45000000,45000000,"No","N/A","Gerencia de Abastecimiento Estratégico\ncontratacion@positiva.gov.co\nPBX: (1)6502200 Ext: 10641","SI","SI","NO","SI",null,{"$f":"CONCATENATE(D308,\"-\",\"Tipo de información\",\" \",V308,\"-\",F308)","v":"C75282022-Tipo de información -PRESTACION DE SERVICIOS DE PROMOCION Y PREVENCION – SERVICIOS_ESPECIALIZADOS_ZONA_ANTIOQUIA"}]
["PyP","Gerencia de administración del riesgo","No","C75292022",93141808,"PRESTACION DE SERVICIOS DE PROMOCION Y PREVENCION – SERVICIOS_ESPECIALIZADOS_ZONA_ANTIOQUIA","1/01/2022",{"$f":"MONTH(G309)","v":1},"30/11/2022",{"$f":"(I309-G309)/30","v":11.1},"Invitación directa","GastosAdministrativos",60000000,60000000,"No","N/A","Gerencia de Abastecimiento Estratégico\ncontratacion@positiva.gov.co\nPBX: (1)6502200 Ext: 10641","SI","SI","NO","SI",null,{"$f":"CONCATENATE(D309,\"-\",\"Tipo de información\",\" \",V309,\"-\",F309)","v":"C75292022-Tipo de información -PRESTACION DE SERVICIOS DE PROMOCION Y PREVENCION – SERVICIOS_ESPECIALIZADOS_ZONA_ANTIOQUIA"}]
["PyP","Gerencia de administración del riesgo","No","C76342022",93141808,"PRESTACION DE SERVICIOS DE PROMOCION Y PREVENCION – SERVICIOS_ESPECIALIZADOS_ZONA_ATLANTICO","1/01/2022",{"$f":"MONTH(G310)","v":1},"30/11/2022",{"$f":"(I310-G310)/30","v":11.1},"Invitación directa","GastosAdministrativos",30645480,30645480,"No","N/A","Gerencia de Abastecimiento Estratégico\ncontratacion@positiva.gov.co\nPBX: (1)6502200 Ext: 10641","SI","SI","NO","SI",null,{"$f":"CONCATENATE(D310,\"-\",\"Tipo de información\",\" \",V310,\"-\",F310)","v":"C76342022-Tipo de información -PRESTACION DE SERVICIOS DE PROMOCION Y PREVENCION – SERVICIOS_ESPECIALIZADOS_ZONA_ATLANTICO"}]
["PyP","Gerencia de administración del riesgo","No","C76352022",93141808,"PRESTACION DE SERVICIOS DE PROMOCION Y PREVENCION – SERVICIOS_ESPECIALIZADOS_ZONA_ATLANTICO","1/01/2022",{"$f":"MONTH(G311)","v":1},"30/11/2022",{"$f":"(I311-G311)/30","v":11.1},"Invitación directa","GastosAdministrativos",40323000,40323000,"No","N/A","Gerencia de Abastecimiento Estratégico\ncontratacion@positiva.gov.co\nPBX: (1)6502200 Ext: 10641","SI","SI","NO","SI",null,{"$f":"CONCATENATE(D311,\"-\",\"Tipo de información\",\" \",V311,\"-\",F311)","v":"C76352022-Tipo de información -PRESTACION DE SERVICIOS DE PROMOCION Y PREVENCION – SERVICIOS_ESPECIALIZADOS_ZONA_ATLANTICO"}]
["PyP","Gerencia de administración del riesgo","No","C76362022",93141808,"PRESTACION DE SERVICIOS DE PROMOCION Y PREVENCION – SERVICIOS_ESPECIALIZADOS_ZONA_ATLANTICO","1/01/2022",{"$f":"MONTH(G312)","v":1},"30/11/2022",{"$f":"(I312-G312)/30","v":11.1},"Invitación directa","GastosAdministrativos",30750000,30750000,"No","N/A","Gerencia de Abastecimiento Estratégico\ncontratacion@positiva.gov.co\nPBX: (1)6502200 Ext: 10641","SI","SI","NO","SI",null,{"$f":"CONCATENATE(D312,\"-\",\"Tipo de información\",\" \",V312,\"-\",F312)","v":"C76362022-Tipo de información -PRESTACION DE SERVICIOS DE PROMOCION Y PREVENCION – SERVICIOS_ESPECIALIZADOS_ZONA_ATLANTICO"}]
["PyP","Gerencia de administración del riesgo","No","C77542022",93141808,"PRESTACION DE SERVICIOS DE PROMOCION Y PREVENCION – SERVICIOS_ESPECIALIZADOS_ZONA_BOGOTA","1/01/2022",{"$f":"MONTH(G313)","v":1},"30/11/2022",{"$f":"(I313-G313)/30","v":11.1},"Invitación directa","GastosAdministrativos",2100000000,2100000000,"No","N/A","Gerencia de Abastecimiento Estratégico\ncontratacion@positiva.gov.co\nPBX: (1)6502200 Ext: 10641","SI","SI","NO","SI",null,{"$f":"CONCATENATE(D313,\"-\",\"Tipo de información\",\" \",V313,\"-\",F313)","v":"C77542022-Tipo de información -PRESTACION DE SERVICIOS DE PROMOCION Y PREVENCION – SERVICIOS_ESPECIALIZADOS_ZONA_BOGOTA"}]
["PyP","Gerencia de administración del riesgo","No","C77552022",93141808,"PRESTACION DE SERVICIOS DE PROMOCION Y PREVENCION – SERVICIOS_ESPECIALIZADOS_ZONA_BOGOTA","1/01/2022",{"$f":"MONTH(G314)","v":1},"30/11/2022",{"$f":"(I314-G314)/30","v":11.1},"Invitación directa","GastosAdministrativos",500000000,500000000,"No","N/A","Gerencia de Abastecimiento Estratégico\ncontratacion@positiva.gov.co\nPBX: (1)6502200 Ext: 10641","SI","SI","NO","SI",null,{"$f":"CONCATENATE(D314,\"-\",\"Tipo de información\",\" \",V314,\"-\",F314)","v":"C77552022-Tipo de información -PRESTACION DE SERVICIOS DE PROMOCION Y PREVENCION – SERVICIOS_ESPECIALIZADOS_ZONA_BOGOTA"}]
["PyP","Gerencia de administración del riesgo","No","C77582022",93141808,"PRESTACION DE SERVICIOS DE PROMOCION Y PREVENCION – SERVICIOS_ESPECIALIZADOS_ZONA_BOGOTA","1/01/2022",{"$f":"MONTH(G315)","v":1},"30/11/2022",{"$f":"(I315-G315)/30","v":11.1},"Invitación directa","GastosAdministrativos",1500000000,1500000000,"No","N/A","Gerencia de Abastecimiento Estratégico\ncontratacion@positiva.gov.co\nPBX: (1)6502200 Ext: 10641","SI","SI","NO","SI",null,{"$f":"CONCATENATE(D315,\"-\",\"Tipo de información\",\" \",V315,\"-\",F315)","v":"C77582022-Tipo de información -PRESTACION DE SERVICIOS DE PROMOCION Y PREVENCION – SERVICIOS_ESPECIALIZADOS_ZONA_BOGOTA"}]
["PyP","Gerencia de administración del riesgo","No","C77592022",93141808,"PRESTACION DE SERVICIOS DE PROMOCION Y PREVENCION – SERVICIOS_ESPECIALIZADOS_ZONA_BOGOTA","1/01/2022",{"$f":"MONTH(G316)","v":1},"30/11/2022",{"$f":"(I316-G316)/30","v":11.1},"Invitación directa","GastosAdministrativos",700000000,700000000,"No","N/A","Gerencia de Abastecimiento Estratégico\ncontratacion@positiva.gov.co\nPBX: (1)6502200 Ext: 10641","SI","SI","NO","SI",null,{"$f":"CONCATENATE(D316,\"-\",\"Tipo de información\",\" \",V316,\"-\",F316)","v":"C77592022-Tipo de información -PRESTACION DE SERVICIOS DE PROMOCION Y PREVENCION – SERVICIOS_ESPECIALIZADOS_ZONA_BOGOTA"}]
["PyP","Gerencia de administración del riesgo","No","C77602022",93141808,"PRESTACION DE SERVICIOS DE PROMOCION Y PREVENCION – SERVICIOS_ESPECIALIZADOS_ZONA_BOGOTA","1/01/2022",{"$f":"MONTH(G317)","v":1},"30/11/2022",{"$f":"(I317-G317)/30","v":11.1},"Invitación directa","GastosAdministrativos",5200000000,5200000000,"No","N/A","Gerencia de Abastecimiento Estratégico\ncontratacion@positiva.gov.co\nPBX: (1)6502200 Ext: 10641","SI","SI","NO","SI",null,{"$f":"CONCATENATE(D317,\"-\",\"Tipo de información\",\" \",V317,\"-\",F317)","v":"C77602022-Tipo de información -PRESTACION DE SERVICIOS DE PROMOCION Y PREVENCION – SERVICIOS_ESPECIALIZADOS_ZONA_BOGOTA"}]
["PyP","Gerencia de administración del riesgo","No","C77612022",93141808,"PRESTACION DE SERVICIOS DE PROMOCION Y PREVENCION – SERVICIOS_ESPECIALIZADOS_ZONA_BOGOTA","1/01/2022",{"$f":"MONTH(G318)","v":1},"30/11/2022",{"$f":"(I318-G318)/30","v":11.1},"Invitación directa","GastosAdministrativos",37078653,37078653,"No","N/A","Gerencia de Abastecimiento Estratégico\ncontratacion@positiva.gov.co\nPBX: (1)6502200 Ext: 10641","SI","SI","NO","SI",null,{"$f":"CONCATENATE(D318,\"-\",\"Tipo de información\",\" \",V318,\"-\",F318)","v":"C77612022-Tipo de información -PRESTACION DE SERVICIOS DE PROMOCION Y PREVENCION – SERVICIOS_ESPECIALIZADOS_ZONA_BOGOTA"}]
["PyP","Gerencia de administración del riesgo","No","C77622022",93141808,"PRESTACION DE SERVICIOS DE PROMOCION Y PREVENCION – SERVICIOS_ESPECIALIZADOS_ZONA_BOGOTA","1/01/2022",{"$f":"MONTH(G319)","v":1},"30/11/2022",{"$f":"(I319-G319)/30","v":11.1},"Invitación directa","GastosAdministrativos",80000000,80000000,"No","N/A","Gerencia de Abastecimiento Estratégico\ncontratacion@positiva.gov.co\nPBX: (1)6502200 Ext: 10641","SI","SI","NO","SI",null,{"$f":"CONCATENATE(D319,\"-\",\"Tipo de información\",\" \",V319,\"-\",F319)","v":"C77622022-Tipo de información -PRESTACION DE SERVICIOS DE PROMOCION Y PREVENCION – SERVICIOS_ESPECIALIZADOS_ZONA_BOGOTA"}]
["PyP","Gerencia de administración del riesgo","No","C77632022",93141808,"PRESTACION DE SERVICIOS DE PROMOCION Y PREVENCION – SERVICIOS_ESPECIALIZADOS_ZONA_BOGOTA","1/01/2022",{"$f":"MONTH(G320)","v":1},"30/11/2022",{"$f":"(I320-G320)/30","v":11.1},"Invitación directa","GastosAdministrativos",60000000,60000000,"No","N/A","Gerencia de Abastecimiento Estratégico\ncontratacion@positiva.gov.co\nPBX: (1)6502200 Ext: 10641","SI","SI","NO","SI",null,{"$f":"CONCATENATE(D320,\"-\",\"Tipo de información\",\" \",V320,\"-\",F320)","v":"C77632022-Tipo de información -PRESTACION DE SERVICIOS DE PROMOCION Y PREVENCION – SERVICIOS_ESPECIALIZADOS_ZONA_BOGOTA"}]
["PyP","Gerencia de administración del riesgo","No","C77642022",93141808,"PRESTACION DE SERVICIOS DE PROMOCION Y PREVENCION – SERVICIOS_ESPECIALIZADOS_ZONA_BOGOTA","1/01/2022",{"$f":"MONTH(G321)","v":1},"30/11/2022",{"$f":"(I321-G321)/30","v":11.1},"Invitación directa","GastosAdministrativos",12000000,12000000,"No","N/A","Gerencia de Abastecimiento Estratégico\ncontratacion@positiva.gov.co\nPBX: (1)6502200 Ext: 10641","SI","SI","NO","SI",null,{"$f":"CONCATENATE(D321,\"-\",\"Tipo de información\",\" \",V321,\"-\",F321)","v":"C77642022-Tipo de información -PRESTACION DE SERVICIOS DE PROMOCION Y PREVENCION – SERVICIOS_ESPECIALIZADOS_ZONA_BOGOTA"}]
["PyP","Gerencia de administración del riesgo","No","C77652022",93141808,"PRESTACION DE SERVICIOS DE PROMOCION Y PREVENCION – SERVICIOS_ESPECIALIZADOS_ZONA_BOGOTA","1/01/2022",{"$f":"MONTH(G322)","v":1},"30/11/2022",{"$f":"(I322-G322)/30","v":11.1},"Invitación directa","GastosAdministrativos",236559140,236559140,"No","N/A","Gerencia de Abastecimiento Estratégico\ncontratacion@positiva.gov.co\nPBX: (1)6502200 Ext: 10641","SI","SI","NO","SI",null,{"$f":"CONCATENATE(D322,\"-\",\"Tipo de información\",\" \",V322,\"-\",F322)","v":"C77652022-Tipo de información -PRESTACION DE SERVICIOS DE PROMOCION Y PREVENCION – SERVICIOS_ESPECIALIZADOS_ZONA_BOGOTA"}]
["PyP","Gerencia de administración del riesgo","No","C77662022",93141808,"PRESTACION DE SERVICIOS DE PROMOCION Y PREVENCION – SERVICIOS_ESPECIALIZADOS_ZONA_BOGOTA","1/01/2022",{"$f":"MONTH(G323)","v":1},"30/11/2022",{"$f":"(I323-G323)/30","v":11.1},"Invitación directa","GastosAdministrativos",290000000,290000000,"No","N/A","Gerencia de Abastecimiento Estratégico\ncontratacion@positiva.gov.co\nPBX: (1)6502200 Ext: 10641","SI","SI","NO","SI",null,{"$f":"CONCATENATE(D323,\"-\",\"Tipo de información\",\" \",V323,\"-\",F323)","v":"C77662022-Tipo de información -PRESTACION DE SERVICIOS DE PROMOCION Y PREVENCION – SERVICIOS_ESPECIALIZADOS_ZONA_BOGOTA"}]
["PyP","Gerencia de administración del riesgo","No","C77672022",93141808,"PRESTACION DE SERVICIOS DE PROMOCION Y PREVENCION – SERVICIOS_ESPECIALIZADOS_ZONA_BOGOTA","1/01/2022",{"$f":"MONTH(G324)","v":1},"30/11/2022",{"$f":"(I324-G324)/30","v":11.1},"Invitación directa","GastosAdministrativos",35000000,35000000,"No","N/A","Gerencia de Abastecimiento Estratégico\ncontratacion@positiva.gov.co\nPBX: (1)6502200 Ext: 10641","SI","SI","NO","SI",null,{"$f":"CONCATENATE(D324,\"-\",\"Tipo de información\",\" \",V324,\"-\",F324)","v":"C77672022-Tipo de información -PRESTACION DE SERVICIOS DE PROMOCION Y PREVENCION – SERVICIOS_ESPECIALIZADOS_ZONA_BOGOTA"}]
["PyP","Gerencia de administración del riesgo","No","C77682022",93141808,"PRESTACION DE SERVICIOS DE PROMOCION Y PREVENCION – SERVICIOS_ESPECIALIZADOS_ZONA_BOGOTA","1/01/2022",{"$f":"MONTH(G325)","v":1},"30/11/2022",{"$f":"(I325-G325)/30","v":11.1},"Invitación directa","GastosAdministrativos",58000000,58000000,"No","N/A","Gerencia de Abastecimiento Estratégico\ncontratacion@positiva.gov.co\nPBX: (1)6502200 Ext: 10641","SI","SI","NO","SI",null,{"$f":"CONCATENATE(D325,\"-\",\"Tipo de información\",\" \",V325,\"-\",F325)","v":"C77682022-Tipo de información -PRESTACION DE SERVICIOS DE PROMOCION Y PREVENCION – SERVICIOS_ESPECIALIZADOS_ZONA_BOGOTA"}]
["PyP","Gerencia de administración del riesgo","No","C77692022",93141808,"PRESTACION DE SERVICIOS DE PROMOCION Y PREVENCION – SERVICIOS_ESPECIALIZADOS_ZONA_BOGOTA","1/01/2022",{"$f":"MONTH(G326)","v":1},"30/11/2022",{"$f":"(I326-G326)/30","v":11.1},"Invitación directa","GastosAdministrativos",100000000,100000000,"No","N/A","Gerencia de Abastecimiento Estratégico\ncontratacion@positiva.gov.co\nPBX: (1)6502200 Ext: 10641","SI","SI","NO","SI",null,{"$f":"CONCATENATE(D326,\"-\",\"Tipo de información\",\" \",V326,\"-\",F326)","v":"C77692022-Tipo de información -PRESTACION DE SERVICIOS DE PROMOCION Y PREVENCION – SERVICIOS_ESPECIALIZADOS_ZONA_BOGOTA"}]
["PyP","Gerencia de administración del riesgo","No","C77702022",93141808,"PRESTACION DE SERVICIOS DE PROMOCION Y PREVENCION – SERVICIOS_ESPECIALIZADOS_ZONA_BOGOTA","1/01/2022",{"$f":"MONTH(G327)","v":1},"30/11/2022",{"$f":"(I327-G327)/30","v":11.1},"Invitación directa","GastosAdministrativos",60000000,60000000,"No","N/A","Gerencia de Abastecimiento Estratégico\ncontratacion@positiva.gov.co\nPBX: (1)6502200 Ext: 10641","SI","SI","NO","SI",null,{"$f":"CONCATENATE(D327,\"-\",\"Tipo de información\",\" \",V327,\"-\",F327)","v":"C77702022-Tipo de información -PRESTACION DE SERVICIOS DE PROMOCION Y PREVENCION – SERVICIOS_ESPECIALIZADOS_ZONA_BOGOTA"}]
["PyP","Gerencia de administración del riesgo","No","C77712022",93141808,"PRESTACION DE SERVICIOS DE PROMOCION Y PREVENCION – SERVICIOS_ESPECIALIZADOS_ZONA_BOGOTA","1/01/2022",{"$f":"MONTH(G328)","v":1},"30/11/2022",{"$f":"(I328-G328)/30","v":11.1},"Invitación directa","GastosAdministrativos",100000000,100000000,"No","N/A","Gerencia de Abastecimiento Estratégico\ncontratacion@positiva.gov.co\nPBX: (1)6502200 Ext: 10641","SI","SI","NO","SI",null,{"$f":"CONCATENATE(D328,\"-\",\"Tipo de información\",\" \",V328,\"-\",F328)","v":"C77712022-Tipo de información -PRESTACION DE SERVICIOS DE PROMOCION Y PREVENCION – SERVICIOS_ESPECIALIZADOS_ZONA_BOGOTA"}]
["PyP","Gerencia de administración del riesgo","No","C77722022",93141808,"PRESTACION DE SERVICIOS DE PROMOCION Y PREVENCION – SERVICIOS_ESPECIALIZADOS_ZONA_BOGOTA","1/01/2022",{"$f":"MONTH(G329)","v":1},"30/11/2022",{"$f":"(I329-G329)/30","v":11.1},"Invitación directa","GastosAdministrativos",70000000,70000000,"No","N/A","Gerencia de Abastecimiento Estratégico\ncontratacion@positiva.gov.co\nPBX: (1)6502200 Ext: 10641","SI","SI","NO","SI",null,{"$f":"CONCATENATE(D329,\"-\",\"Tipo de información\",\" \",V329,\"-\",F329)","v":"C77722022-Tipo de información -PRESTACION DE SERVICIOS DE PROMOCION Y PREVENCION – SERVICIOS_ESPECIALIZADOS_ZONA_BOGOTA"}]
["PyP","Gerencia de administración del riesgo","No","C77732022",93141808,"PRESTACION DE SERVICIOS DE PROMOCION Y PREVENCION – SERVICIOS_ESPECIALIZADOS_ZONA_BOGOTA","1/01/2022",{"$f":"MONTH(G330)","v":1},"30/11/2022",{"$f":"(I330-G330)/30","v":11.1},"Invitación directa","GastosAdministrativos",100000000,100000000,"No","N/A","Gerencia de Abastecimiento Estratégico\ncontratacion@positiva.gov.co\nPBX: (1)6502200 Ext: 10641","SI","SI","NO","SI",null,{"$f":"CONCATENATE(D330,\"-\",\"Tipo de información\",\" \",V330,\"-\",F330)","v":"C77732022-Tipo de información -PRESTACION DE SERVICIOS DE PROMOCION Y PREVENCION – SERVICIOS_ESPECIALIZADOS_ZONA_BOGOTA"}]
["PyP","Gerencia de administración del riesgo","No","C77742022",93141808,"PRESTACION DE SERVICIOS DE PROMOCION Y PREVENCION – SERVICIOS_ESPECIALIZADOS_ZONA_BOGOTA","1/01/2022",{"$f":"MONTH(G331)","v":1},"30/11/2022",{"$f":"(I331-G331)/30","v":11.1},"Invitación directa","GastosAdministrativos",90000000,90000000,"No","N/A","Gerencia de Abastecimiento Estratégico\ncontratacion@positiva.gov.co\nPBX: (1)6502200 Ext: 10641","SI","SI","NO","SI",null,{"$f":"CONCATENATE(D331,\"-\",\"Tipo de información\",\" \",V331,\"-\",F331)","v":"C77742022-Tipo de información -PRESTACION DE SERVICIOS DE PROMOCION Y PREVENCION – SERVICIOS_ESPECIALIZADOS_ZONA_BOGOTA"}]
["PyP","Gerencia de administración del riesgo","No","C77752022",93141808,"PRESTACION DE SERVICIOS DE PROMOCION Y PREVENCION – SERVICIOS_ESPECIALIZADOS_ZONA_BOGOTA","1/01/2022",{"$f":"MONTH(G332)","v":1},"30/11/2022",{"$f":"(I332-G332)/30","v":11.1},"Invitación directa","GastosAdministrativos",450000000,450000000,"No","N/A","Gerencia de Abastecimiento Estratégico\ncontratacion@positiva.gov.co\nPBX: (1)6502200 Ext: 10641","SI","SI","NO","SI",null,{"$f":"CONCATENATE(D332,\"-\",\"Tipo de información\",\" \",V332,\"-\",F332)","v":"C77752022-Tipo de información -PRESTACION DE SERVICIOS DE PROMOCION Y PREVENCION – SERVICIOS_ESPECIALIZADOS_ZONA_BOGOTA"}]
["PyP","Gerencia de administración del riesgo","No","C77762022",93141808,"PRESTACION DE SERVICIOS DE PROMOCION Y PREVENCION – SERVICIOS_ESPECIALIZADOS_ZONA_BOGOTA","1/01/2022",{"$f":"MONTH(G333)","v":1},"30/11/2022",{"$f":"(I333-G333)/30","v":11.1},"Invitación directa","GastosAdministrativos",160000000,160000000,"No","N/A","Gerencia de Abastecimiento Estratégico\ncontratacion@positiva.gov.co\nPBX: (1)6502200 Ext: 10641","SI","SI","NO","SI",null,{"$f":"CONCATENATE(D333,\"-\",\"Tipo de información\",\" \",V333,\"-\",F333)","v":"C77762022-Tipo de información -PRESTACION DE SERVICIOS DE PROMOCION Y PREVENCION – SERVICIOS_ESPECIALIZADOS_ZONA_BOGOTA"}]
["PyP","Gerencia de administración del riesgo","No","C77772022",93141808,"PRESTACION DE SERVICIOS DE PROMOCION Y PREVENCION – SERVICIOS_ESPECIALIZADOS_ZONA_BOGOTA","1/01/2022",{"$f":"MONTH(G334)","v":1},"30/11/2022",{"$f":"(I334-G334)/30","v":11.1},"Invitación directa","GastosAdministrativos",300000000,300000000,"No","N/A","Gerencia de Abastecimiento Estratégico\ncontratacion@positiva.gov.co\nPBX: (1)6502200 Ext: 10641","SI","SI","NO","SI",null,{"$f":"CONCATENATE(D334,\"-\",\"Tipo de información\",\" \",V334,\"-\",F334)","v":"C77772022-Tipo de información -PRESTACION DE SERVICIOS DE PROMOCION Y PREVENCION – SERVICIOS_ESPECIALIZADOS_ZONA_BOGOTA"}]
["PyP","Gerencia de administración del riesgo","No","C77782022",93141808,"PRESTACION DE SERVICIOS DE PROMOCION Y PREVENCION – SERVICIOS_ESPECIALIZADOS_ZONA_BOGOTA","1/01/2022",{"$f":"MONTH(G335)","v":1},"30/11/2022",{"$f":"(I335-G335)/30","v":11.1},"Invitación directa","GastosAdministrativos",170000000,170000000,"No","N/A","Gerencia de Abastecimiento Estratégico\ncontratacion@positiva.gov.co\nPBX: (1)6502200 Ext: 10641","SI","SI","NO","SI",null,{"$f":"CONCATENATE(D335,\"-\",\"Tipo de información\",\" \",V335,\"-\",F335)","v":"C77782022-Tipo de información -PRESTACION DE SERVICIOS DE PROMOCION Y PREVENCION – SERVICIOS_ESPECIALIZADOS_ZONA_BOGOTA"}]
["PyP","Gerencia de administración del riesgo","No","C77792022",93141808,"PRESTACION DE SERVICIOS DE PROMOCION Y PREVENCION – SERVICIOS_ESPECIALIZADOS_ZONA_BOGOTA","1/01/2022",{"$f":"MONTH(G336)","v":1},"30/11/2022",{"$f":"(I336-G336)/30","v":11.1},"Invitación directa","GastosAdministrativos",100000000,100000000,"No","N/A","Gerencia de Abastecimiento Estratégico\ncontratacion@positiva.gov.co\nPBX: (1)6502200 Ext: 10641","SI","SI","NO","SI",null,{"$f":"CONCATENATE(D336,\"-\",\"Tipo de información\",\" \",V336,\"-\",F336)","v":"C77792022-Tipo de información -PRESTACION DE SERVICIOS DE PROMOCION Y PREVENCION – SERVICIOS_ESPECIALIZADOS_ZONA_BOGOTA"}]
["PyP","Gerencia de administración del riesgo","No","C77802022",93141808,"PRESTACION DE SERVICIOS DE PROMOCION Y PREVENCION – SERVICIOS_ESPECIALIZADOS_ZONA_BOGOTA","1/01/2022",{"$f":"MONTH(G337)","v":1},"30/11/2022",{"$f":"(I337-G337)/30","v":11.1},"Invitación directa","GastosAdministrativos",30000000,30000000,"No","N/A","Gerencia de Abastecimiento Estratégico\ncontratacion@positiva.gov.co\nPBX: (1)6502200 Ext: 10641","SI","SI","NO","SI",null,{"$f":"CONCATENATE(D337,\"-\",\"Tipo de información\",\" \",V337,\"-\",F337)","v":"C77802022-Tipo de información -PRESTACION DE SERVICIOS DE PROMOCION Y PREVENCION – SERVICIOS_ESPECIALIZADOS_ZONA_BOGOTA"}]
["PyP","Gerencia de administración del riesgo","No","C77812022",93141808,"PRESTACION DE SERVICIOS DE PROMOCION Y PREVENCION – SERVICIOS_ESPECIALIZADOS_ZONA_BOGOTA","1/01/2022",{"$f":"MONTH(G338)","v":1},"30/11/2022",{"$f":"(I338-G338)/30","v":11.1},"Invitación directa","GastosAdministrativos",107528000,107528000,"No","N/A","Gerencia de Abastecimiento Estratégico\ncontratacion@positiva.gov.co\nPBX: (1)6502200 Ext: 10641","SI","SI","NO","SI",null,{"$f":"CONCATENATE(D338,\"-\",\"Tipo de información\",\" \",V338,\"-\",F338)","v":"C77812022-Tipo de información -PRESTACION DE SERVICIOS DE PROMOCION Y PREVENCION – SERVICIOS_ESPECIALIZADOS_ZONA_BOGOTA"}]
["PyP","Gerencia de administración del riesgo","No","C77822022",93141808,"PRESTACION DE SERVICIOS DE PROMOCION Y PREVENCION – SERVICIOS_ESPECIALIZADOS_ZONA_BOGOTA","1/01/2022",{"$f":"MONTH(G339)","v":1},"30/11/2022",{"$f":"(I339-G339)/30","v":11.1},"Invitación directa","GastosAdministrativos",50000000,50000000,"No","N/A","Gerencia de Abastecimiento Estratégico\ncontratacion@positiva.gov.co\nPBX: (1)6502200 Ext: 10641","SI","SI","NO","SI",null,{"$f":"CONCATENATE(D339,\"-\",\"Tipo de información\",\" \",V339,\"-\",F339)","v":"C77822022-Tipo de información -PRESTACION DE SERVICIOS DE PROMOCION Y PREVENCION – SERVICIOS_ESPECIALIZADOS_ZONA_BOGOTA"}]
["PyP","Gerencia de administración del riesgo","No","C81292022",93141808,"PRESTACION DE SERVICIOS DE PROMOCION Y PREVENCION – SERVICIOS_ESPECIALIZADOS_CUENTA_FGN","1/01/2022",{"$f":"MONTH(G340)","v":1},"30/11/2022",{"$f":"(I340-G340)/30","v":11.1},"Invitación directa","GastosAdministrativos",3850000000,3850000000,"No","N/A","Gerencia de Abastecimiento Estratégico\ncontratacion@positiva.gov.co\nPBX: (1)6502200 Ext: 10641","SI","SI","NO","SI",null,{"$f":"CONCATENATE(D340,\"-\",\"Tipo de información\",\" \",V340,\"-\",F340)","v":"C81292022-Tipo de información -PRESTACION DE SERVICIOS DE PROMOCION Y PREVENCION – SERVICIOS_ESPECIALIZADOS_CUENTA_FGN"}]
["PyP","Gerencia de administración del riesgo","No","C81302022",93141808,"PRESTACION DE SERVICIOS DE PROMOCION Y PREVENCION – SERVICIOS_ESPECIALIZADOS_CUENTA_FGN","1/01/2022",{"$f":"MONTH(G341)","v":1},"30/11/2022",{"$f":"(I341-G341)/30","v":11.1},"Invitación directa","GastosAdministrativos",20000000,20000000,"No","N/A","Gerencia de Abastecimiento Estratégico\ncontratacion@positiva.gov.co\nPBX: (1)6502200 Ext: 10641","SI","SI","NO","SI",null,{"$f":"CONCATENATE(D341,\"-\",\"Tipo de información\",\" \",V341,\"-\",F341)","v":"C81302022-Tipo de información -PRESTACION DE SERVICIOS DE PROMOCION Y PREVENCION – SERVICIOS_ESPECIALIZADOS_CUENTA_FGN"}]
["PyP","Gerencia de administración del riesgo","No","C81312022",93141808,"PRESTACION DE SERVICIOS DE PROMOCION Y PREVENCION – SERVICIOS_ESPECIALIZADOS_CUENTA_FGN","1/01/2022",{"$f":"MONTH(G342)","v":1},"30/11/2022",{"$f":"(I342-G342)/30","v":11.1},"Invitación directa","GastosAdministrativos",36000000,36000000,"No","N/A","Gerencia de Abastecimiento Estratégico\ncontratacion@positiva.gov.co\nPBX: (1)6502200 Ext: 10641","SI","SI","NO","SI",null,{"$f":"CONCATENATE(D342,\"-\",\"Tipo de información\",\" \",V342,\"-\",F342)","v":"C81312022-Tipo de información -PRESTACION DE SERVICIOS DE PROMOCION Y PREVENCION – SERVICIOS_ESPECIALIZADOS_CUENTA_FGN"}]
["PyP","Gerencia de administración del riesgo","No","C79372022",93141808,"PRESTACION DE SERVICIOS DE PROMOCION Y PREVENCION – SERVICIOS_ESPECIALIZADOS_ZONA_SANTANDER","1/01/2022",{"$f":"MONTH(G343)","v":1},"30/11/2022",{"$f":"(I343-G343)/30","v":11.1},"Invitación directa","GastosAdministrativos",44692300,44692300,"No","N/A","Gerencia de Abastecimiento Estratégico\ncontratacion@positiva.gov.co\nPBX: (1)6502200 Ext: 10641","SI","SI","NO","SI",null,{"$f":"CONCATENATE(D343,\"-\",\"Tipo de información\",\" \",V343,\"-\",F343)","v":"C79372022-Tipo de información -PRESTACION DE SERVICIOS DE PROMOCION Y PREVENCION – SERVICIOS_ESPECIALIZADOS_ZONA_SANTANDER"}]
["PyP","Gerencia de administración del riesgo","No","C79382022",93141808,"PRESTACION DE SERVICIOS DE PROMOCION Y PREVENCION – SERVICIOS_ESPECIALIZADOS_ZONA_SANTANDER","1/01/2022",{"$f":"MONTH(G344)","v":1},"30/11/2022",{"$f":"(I344-G344)/30","v":11.1},"Invitación directa","GastosAdministrativos",46354412,46354412,"No","N/A","Gerencia de Abastecimiento Estratégico\ncontratacion@positiva.gov.co\nPBX: (1)6502200 Ext: 10641","SI","SI","NO","SI",null,{"$f":"CONCATENATE(D344,\"-\",\"Tipo de información\",\" \",V344,\"-\",F344)","v":"C79382022-Tipo de información -PRESTACION DE SERVICIOS DE PROMOCION Y PREVENCION – SERVICIOS_ESPECIALIZADOS_ZONA_SANTANDER"}]
["PyP","Gerencia de administración del riesgo","No","C79392022",93141808,"PRESTACION DE SERVICIOS DE PROMOCION Y PREVENCION – SERVICIOS_ESPECIALIZADOS_ZONA_SANTANDER","1/01/2022",{"$f":"MONTH(G345)","v":1},"30/11/2022",{"$f":"(I345-G345)/30","v":11.1},"Invitación directa","GastosAdministrativos",41000000,41000000,"No","N/A","Gerencia de Abastecimiento Estratégico\ncontratacion@positiva.gov.co\nPBX: (1)6502200 Ext: 10641","SI","SI","NO","SI",null,{"$f":"CONCATENATE(D345,\"-\",\"Tipo de información\",\" \",V345,\"-\",F345)","v":"C79392022-Tipo de información -PRESTACION DE SERVICIOS DE PROMOCION Y PREVENCION – SERVICIOS_ESPECIALIZADOS_ZONA_SANTANDER"}]
["PyP","Gerencia de administración del riesgo","No","C80322022",93141808,"PRESTACION DE SERVICIOS DE PROMOCION Y PREVENCION – SERVICIOS_ESPECIALIZADOS_ZONA_VALLE","1/01/2022",{"$f":"MONTH(G346)","v":1},"30/11/2022",{"$f":"(I346-G346)/30","v":11.1},"Invitación directa","GastosAdministrativos",94285714,94285714,"No","N/A","Gerencia de Abastecimiento Estratégico\ncontratacion@positiva.gov.co\nPBX: (1)6502200 Ext: 10641","SI","SI","NO","SI",null,{"$f":"CONCATENATE(D346,\"-\",\"Tipo de información\",\" \",V346,\"-\",F346)","v":"C80322022-Tipo de información -PRESTACION DE SERVICIOS DE PROMOCION Y PREVENCION – SERVICIOS_ESPECIALIZADOS_ZONA_VALLE"}]
["PyP","Gerencia de administración del riesgo","No","C80332022",93141808,"PRESTACION DE SERVICIOS DE PROMOCION Y PREVENCION – SERVICIOS_ESPECIALIZADOS_ZONA_VALLE","1/01/2022",{"$f":"MONTH(G347)","v":1},"30/11/2022",{"$f":"(I347-G347)/30","v":11.1},"Invitación directa","GastosAdministrativos",80208333,80208333,"No","N/A","Gerencia de Abastecimiento Estratégico\ncontratacion@positiva.gov.co\nPBX: (1)6502200 Ext: 10641","SI","SI","NO","SI",null,{"$f":"CONCATENATE(D347,\"-\",\"Tipo de información\",\" \",V347,\"-\",F347)","v":"C80332022-Tipo de información -PRESTACION DE SERVICIOS DE PROMOCION Y PREVENCION – SERVICIOS_ESPECIALIZADOS_ZONA_VALLE"}]
["PyP","Gerencia de administración del riesgo","No","C80342022",93141808,"PRESTACION DE SERVICIOS DE PROMOCION Y PREVENCION – SERVICIOS_ESPECIALIZADOS_ZONA_VALLE","1/01/2022",{"$f":"MONTH(G348)","v":1},"30/11/2022",{"$f":"(I348-G348)/30","v":11.1},"Invitación directa","GastosAdministrativos",23206423,23206423,"No","N/A","Gerencia de Abastecimiento Estratégico\ncontratacion@positiva.gov.co\nPBX: (1)6502200 Ext: 10641","SI","SI","NO","SI",null,{"$f":"CONCATENATE(D348,\"-\",\"Tipo de información\",\" \",V348,\"-\",F348)","v":"C80342022-Tipo de información -PRESTACION DE SERVICIOS DE PROMOCION Y PREVENCION – SERVICIOS_ESPECIALIZADOS_ZONA_VALLE"}]
["PyP","Gerencia de administración del riesgo","No","C80352022",93141808,"PRESTACION DE SERVICIOS DE PROMOCION Y PREVENCION – SERVICIOS_ESPECIALIZADOS_ZONA_VALLE","1/01/2022",{"$f":"MONTH(G349)","v":1},"30/11/2022",{"$f":"(I349-G349)/30","v":11.1},"Invitación directa","GastosAdministrativos",92438516,92438516,"No","N/A","Gerencia de Abastecimiento Estratégico\ncontratacion@positiva.gov.co\nPBX: (1)6502200 Ext: 10641","SI","SI","NO","SI",null,{"$f":"CONCATENATE(D349,\"-\",\"Tipo de información\",\" \",V349,\"-\",F349)","v":"C80352022-Tipo de información -PRESTACION DE SERVICIOS DE PROMOCION Y PREVENCION – SERVICIOS_ESPECIALIZADOS_ZONA_VALLE"}]
["PyP","Gerencia de administración del riesgo","No","C80362022",93141808,"PRESTACION DE SERVICIOS DE PROMOCION Y PREVENCION – SERVICIOS_ESPECIALIZADOS_ZONA_VALLE","1/01/2022",{"$f":"MONTH(G350)","v":1},"30/11/2022",{"$f":"(I350-G350)/30","v":11.1},"Invitación directa","GastosAdministrativos",65562914,65562914,"No","N/A","Gerencia de Abastecimiento Estratégico\ncontratacion@positiva.gov.co\nPBX: (1)6502200 Ext: 10641","SI","SI","NO","SI",null,{"$f":"CONCATENATE(D350,\"-\",\"Tipo de información\",\" \",V350,\"-\",F350)","v":"C80362022-Tipo de información -PRESTACION DE SERVICIOS DE PROMOCION Y PREVENCION – SERVICIOS_ESPECIALIZADOS_ZONA_VALLE"}]
["PyP","Gerencia de administración del riesgo","No","C75262022",93141808,"PRESTACION DE SERVICIOS DE PROMOCION Y PREVENCION – SERVICIOS_ESPECIALIZADOS_ZONA_ANTIOQUIA","1/01/2022",{"$f":"MONTH(G351)","v":1},"30/11/2022",{"$f":"(I351-G351)/30","v":11.1},"Invitación directa","GastosAdministrativos",136363636,136363636,"No","N/A","Gerencia de Abastecimiento Estratégico\ncontratacion@positiva.gov.co\nPBX: (1)6502200 Ext: 10641","SI","SI","NO","SI",null,{"$f":"CONCATENATE(D351,\"-\",\"Tipo de información\",\" \",V351,\"-\",F351)","v":"C75262022-Tipo de información -PRESTACION DE SERVICIOS DE PROMOCION Y PREVENCION – SERVICIOS_ESPECIALIZADOS_ZONA_ANTIOQUIA"}]
["PyP","Gerencia de administración del riesgo","No","C75302022",93141808,"PRESTACION DE SERVICIOS DE PROMOCION Y PREVENCION – SERVICIOS_ESPECIALIZADOS_ZONA_ANTIOQUIA","1/01/2022",{"$f":"MONTH(G352)","v":1},"30/11/2022",{"$f":"(I352-G352)/30","v":11.1},"Invitación directa","GastosAdministrativos",346663599,346663599,"No","N/A","Gerencia de Abastecimiento Estratégico\ncontratacion@positiva.gov.co\nPBX: (1)6502200 Ext: 10641","SI","SI","NO","SI",null,{"$f":"CONCATENATE(D352,\"-\",\"Tipo de información\",\" \",V352,\"-\",F352)","v":"C75302022-Tipo de información -PRESTACION DE SERVICIOS DE PROMOCION Y PREVENCION – SERVICIOS_ESPECIALIZADOS_ZONA_ANTIOQUIA"}]
["PyP","Gerencia de administración del riesgo","No","C75312022",93141808,"PRESTACION DE SERVICIOS DE PROMOCION Y PREVENCION – SERVICIOS_ESPECIALIZADOS_ZONA_ANTIOQUIA","1/01/2022",{"$f":"MONTH(G353)","v":1},"30/11/2022",{"$f":"(I353-G353)/30","v":11.1},"Invitación directa","GastosAdministrativos",47142857,47142857,"No","N/A","Gerencia de Abastecimiento Estratégico\ncontratacion@positiva.gov.co\nPBX: (1)6502200 Ext: 10641","SI","SI","NO","SI",null,{"$f":"CONCATENATE(D353,\"-\",\"Tipo de información\",\" \",V353,\"-\",F353)","v":"C75312022-Tipo de información -PRESTACION DE SERVICIOS DE PROMOCION Y PREVENCION – SERVICIOS_ESPECIALIZADOS_ZONA_ANTIOQUIA"}]
["PyP","Gerencia de administración del riesgo","No","C75322022",93141808,"PRESTACION DE SERVICIOS DE PROMOCION Y PREVENCION – SERVICIOS_ESPECIALIZADOS_ZONA_ANTIOQUIA","1/01/2022",{"$f":"MONTH(G354)","v":1},"30/11/2022",{"$f":"(I354-G354)/30","v":11.1},"Invitación directa","GastosAdministrativos",62857143,62857143,"No","N/A","Gerencia de Abastecimiento Estratégico\ncontratacion@positiva.gov.co\nPBX: (1)6502200 Ext: 10641","SI","SI","NO","SI",null,{"$f":"CONCATENATE(D354,\"-\",\"Tipo de información\",\" \",V354,\"-\",F354)","v":"C75322022-Tipo de información -PRESTACION DE SERVICIOS DE PROMOCION Y PREVENCION – SERVICIOS_ESPECIALIZADOS_ZONA_ANTIOQUIA"}]
["PyP","Gerencia de administración del riesgo","No","C75332022",93141808,"PRESTACION DE SERVICIOS DE PROMOCION Y PREVENCION – SERVICIOS_ESPECIALIZADOS_ZONA_ANTIOQUIA","1/01/2022",{"$f":"MONTH(G355)","v":1},"30/11/2022",{"$f":"(I355-G355)/30","v":11.1},"Invitación directa","GastosAdministrativos",47142857,47142857,"No","N/A","Gerencia de Abastecimiento Estratégico\ncontratacion@positiva.gov.co\nPBX: (1)6502200 Ext: 10641","SI","SI","NO","SI",null,{"$f":"CONCATENATE(D355,\"-\",\"Tipo de información\",\" \",V355,\"-\",F355)","v":"C75332022-Tipo de información -PRESTACION DE SERVICIOS DE PROMOCION Y PREVENCION – SERVICIOS_ESPECIALIZADOS_ZONA_ANTIOQUIA"}]
["PyP","Gerencia de administración del riesgo","No","C75342022",93141808,"PRESTACION DE SERVICIOS DE PROMOCION Y PREVENCION – SERVICIOS_ESPECIALIZADOS_ZONA_ANTIOQUIA","1/01/2022",{"$f":"MONTH(G356)","v":1},"30/11/2022",{"$f":"(I356-G356)/30","v":11.1},"Invitación directa","GastosAdministrativos",94285714,94285714,"No","N/A","Gerencia de Abastecimiento Estratégico\ncontratacion@positiva.gov.co\nPBX: (1)6502200 Ext: 10641","SI","SI","NO","SI",null,{"$f":"CONCATENATE(D356,\"-\",\"Tipo de información\",\" \",V356,\"-\",F356)","v":"C75342022-Tipo de información -PRESTACION DE SERVICIOS DE PROMOCION Y PREVENCION – SERVICIOS_ESPECIALIZADOS_ZONA_ANTIOQUIA"}]
["PyP","Gerencia de administración del riesgo","No","C75352022",93141808,"PRESTACION DE SERVICIOS DE PROMOCION Y PREVENCION – SERVICIOS_ESPECIALIZADOS_ZONA_ANTIOQUIA","1/01/2022",{"$f":"MONTH(G357)","v":1},"30/11/2022",{"$f":"(I357-G357)/30","v":11.1},"Invitación directa","GastosAdministrativos",125714286,125714286,"No","N/A","Gerencia de Abastecimiento Estratégico\ncontratacion@positiva.gov.co\nPBX: (1)6502200 Ext: 10641","SI","SI","NO","SI",null,{"$f":"CONCATENATE(D357,\"-\",\"Tipo de información\",\" \",V357,\"-\",F357)","v":"C75352022-Tipo de información -PRESTACION DE SERVICIOS DE PROMOCION Y PREVENCION – SERVICIOS_ESPECIALIZADOS_ZONA_ANTIOQUIA"}]
["PyP","Gerencia de administración del riesgo","No","C75362022",93141808,"PRESTACION DE SERVICIOS DE PROMOCION Y PREVENCION – SERVICIOS_ESPECIALIZADOS_ZONA_ANTIOQUIA","1/01/2022",{"$f":"MONTH(G358)","v":1},"30/11/2022",{"$f":"(I358-G358)/30","v":11.1},"Invitación directa","GastosAdministrativos",344505495,344505495,"No","N/A","Gerencia de Abastecimiento Estratégico\ncontratacion@positiva.gov.co\nPBX: (1)6502200 Ext: 10641","SI","SI","NO","SI",null,{"$f":"CONCATENATE(D358,\"-\",\"Tipo de información\",\" \",V358,\"-\",F358)","v":"C75362022-Tipo de información -PRESTACION DE SERVICIOS DE PROMOCION Y PREVENCION – SERVICIOS_ESPECIALIZADOS_ZONA_ANTIOQUIA"}]
["PyP","Gerencia de administración del riesgo","No","C75372022",93141808,"PRESTACION DE SERVICIOS DE PROMOCION Y PREVENCION – SERVICIOS_ESPECIALIZADOS_ZONA_ANTIOQUIA","1/01/2022",{"$f":"MONTH(G359)","v":1},"30/11/2022",{"$f":"(I359-G359)/30","v":11.1},"Invitación directa","GastosAdministrativos",254697987,254697987,"No","N/A","Gerencia de Abastecimiento Estratégico\ncontratacion@positiva.gov.co\nPBX: (1)6502200 Ext: 10641","SI","SI","NO","SI",null,{"$f":"CONCATENATE(D359,\"-\",\"Tipo de información\",\" \",V359,\"-\",F359)","v":"C75372022-Tipo de información -PRESTACION DE SERVICIOS DE PROMOCION Y PREVENCION – SERVICIOS_ESPECIALIZADOS_ZONA_ANTIOQUIA"}]
["PyP","Gerencia de administración del riesgo","No","C76372022",93141808,"PRESTACION DE SERVICIOS DE PROMOCION Y PREVENCION – SERVICIOS_ESPECIALIZADOS_ZONA_ATLANTICO","1/01/2022",{"$f":"MONTH(G360)","v":1},"30/11/2022",{"$f":"(I360-G360)/30","v":11.1},"Invitación directa","GastosAdministrativos",13978640,13978640,"No","N/A","Gerencia de Abastecimiento Estratégico\ncontratacion@positiva.gov.co\nPBX: (1)6502200 Ext: 10641","SI","SI","NO","SI",null,{"$f":"CONCATENATE(D360,\"-\",\"Tipo de información\",\" \",V360,\"-\",F360)","v":"C76372022-Tipo de información -PRESTACION DE SERVICIOS DE PROMOCION Y PREVENCION – SERVICIOS_ESPECIALIZADOS_ZONA_ATLANTICO"}]
["PyP","Gerencia de administración del riesgo","No","C82012022",93141808,"PRESTACION DE SERVICIOS DE PROMOCION Y PREVENCION – SERVICIOS_ESPECIALIZADOS_NIVEL_NACIONAL","1/01/2022",{"$f":"MONTH(G361)","v":1},"30/11/2022",{"$f":"(I361-G361)/30","v":11.1},"Invitación directa","GastosAdministrativos",875796329,875796329,"No","N/A","Gerencia de Abastecimiento Estratégico\ncontratacion@positiva.gov.co\nPBX: (1)6502200 Ext: 10641","SI","SI","NO","SI",null,{"$f":"CONCATENATE(D361,\"-\",\"Tipo de información\",\" \",V361,\"-\",F361)","v":"C82012022-Tipo de información -PRESTACION DE SERVICIOS DE PROMOCION Y PREVENCION – SERVICIOS_ESPECIALIZADOS_NIVEL_NACIONAL"}]
["PyP","Gerencia de administración del riesgo","No","C82022022",93141808,"PRESTACION DE SERVICIOS DE PROMOCION Y PREVENCION – SERVICIOS_ESPECIALIZADOS_NIVEL_NACIONAL","1/01/2022",{"$f":"MONTH(G362)","v":1},"30/11/2022",{"$f":"(I362-G362)/30","v":11.1},"Invitación directa","GastosAdministrativos",504386591,504386591,"No","N/A","Gerencia de Abastecimiento Estratégico\ncontratacion@positiva.gov.co\nPBX: (1)6502200 Ext: 10641","SI","SI","NO","SI",null,{"$f":"CONCATENATE(D362,\"-\",\"Tipo de información\",\" \",V362,\"-\",F362)","v":"C82022022-Tipo de información -PRESTACION DE SERVICIOS DE PROMOCION Y PREVENCION – SERVICIOS_ESPECIALIZADOS_NIVEL_NACIONAL"}]
["PyP","Gerencia de administración del riesgo","No","C82032022",93141808,"PRESTACION DE SERVICIOS DE PROMOCION Y PREVENCION – SERVICIOS_ESPECIALIZADOS_NIVEL_NACIONAL","1/01/2022",{"$f":"MONTH(G363)","v":1},"30/11/2022",{"$f":"(I363-G363)/30","v":11.1},"Invitación directa","GastosAdministrativos",335698925,335698925,"No","N/A","Gerencia de Abastecimiento Estratégico\ncontratacion@positiva.gov.co\nPBX: (1)6502200 Ext: 10641","SI","SI","NO","SI",null,{"$f":"CONCATENATE(D363,\"-\",\"Tipo de información\",\" \",V363,\"-\",F363)","v":"C82032022-Tipo de información -PRESTACION DE SERVICIOS DE PROMOCION Y PREVENCION – SERVICIOS_ESPECIALIZADOS_NIVEL_NACIONAL"}]
["PyP","Gerencia de administración del riesgo","No","C77832022",93141808,"PRESTACION DE SERVICIOS DE PROMOCION Y PREVENCION – SERVICIOS_ESPECIALIZADOS_ZONA_BOGOTA","1/01/2022",{"$f":"MONTH(G364)","v":1},"30/11/2022",{"$f":"(I364-G364)/30","v":11.1},"Invitación directa","GastosAdministrativos",250000000,250000000,"No","N/A","Gerencia de Abastecimiento Estratégico\ncontratacion@positiva.gov.co\nPBX: (1)6502200 Ext: 10641","SI","SI","NO","SI",null,{"$f":"CONCATENATE(D364,\"-\",\"Tipo de información\",\" \",V364,\"-\",F364)","v":"C77832022-Tipo de información -PRESTACION DE SERVICIOS DE PROMOCION Y PREVENCION – SERVICIOS_ESPECIALIZADOS_ZONA_BOGOTA"}]
["PyP","Gerencia de administración del riesgo","No","C82522022",93141808,"PRESTACION DE SERVICIOS DE PROMOCION Y PREVENCION – SUMINISTRO_EPP","28/10/2021",{"$f":"MONTH(G365)","v":10},"31/03/2022",{"$f":"(I365-G365)/30","v":5.1333333333333337},"Invitación directa","GastosAdministrativos",3951510826,3951510826,"No","N/A","Gerencia de Abastecimiento Estratégico\ncontratacion@positiva.gov.co\nPBX: (1)6502200 Ext: 10641","SI","SI","NO","SI",null,{"$f":"CONCATENATE(D365,\"-\",\"Tipo de información\",\" \",V365,\"-\",F365)","v":"C82522022-Tipo de información -PRESTACION DE SERVICIOS DE PROMOCION Y PREVENCION – SUMINISTRO_EPP"}]
["PyP","Gerencia de administración del riesgo","No","C82532022",93141808,"PRESTACION DE SERVICIOS DE PROMOCION Y PREVENCION – SUMINISTRO_EPP","2/11/2021",{"$f":"MONTH(G366)","v":11},"31/03/2022",{"$f":"(I366-G366)/30","v":4.9666666666666668},"Invitación directa","GastosAdministrativos",1219020540,1219020540,"No","N/A","Gerencia de Abastecimiento Estratégico\ncontratacion@positiva.gov.co\nPBX: (1)6502200 Ext: 10641","SI","SI","NO","SI",null,{"$f":"CONCATENATE(D366,\"-\",\"Tipo de información\",\" \",V366,\"-\",F366)","v":"C82532022-Tipo de información -PRESTACION DE SERVICIOS DE PROMOCION Y PREVENCION – SUMINISTRO_EPP"}]
["PyP","Gerencia de administración del riesgo","No","C82542022",93141808,"PRESTACION DE SERVICIOS DE PROMOCION Y PREVENCION – SUMINISTRO_EPP","29/10/2021",{"$f":"MONTH(G367)","v":10},"31/03/2022",{"$f":"(I367-G367)/30","v":5.0999999999999996},"Invitación directa","GastosAdministrativos",1109387700,1109387700,"No","N/A","Gerencia de Abastecimiento Estratégico\ncontratacion@positiva.gov.co\nPBX: (1)6502200 Ext: 10641","SI","SI","NO","SI",null,{"$f":"CONCATENATE(D367,\"-\",\"Tipo de información\",\" \",V367,\"-\",F367)","v":"C82542022-Tipo de información -PRESTACION DE SERVICIOS DE PROMOCION Y PREVENCION – SUMINISTRO_EPP"}]
["PyP","Gerencia de administración del riesgo","No","C82552022",93141808,"PRESTACION DE SERVICIOS DE PROMOCION Y PREVENCION – SUMINISTRO_EPP","8/11/2021",{"$f":"MONTH(G368)","v":11},"31/03/2022",{"$f":"(I368-G368)/30","v":4.7666666666666666},"Invitación directa","GastosAdministrativos",1143844625,1143844625,"No","N/A","Gerencia de Abastecimiento Estratégico\ncontratacion@positiva.gov.co\nPBX: (1)6502200 Ext: 10641","SI","SI","NO","SI",null,{"$f":"CONCATENATE(D368,\"-\",\"Tipo de información\",\" \",V368,\"-\",F368)","v":"C82552022-Tipo de información -PRESTACION DE SERVICIOS DE PROMOCION Y PREVENCION – SUMINISTRO_EPP"}]
["PyP","Gerencia de administración del riesgo","No","C82562022",93141808,"PRESTACION DE SERVICIOS DE PROMOCION Y PREVENCION – SUMINISTRO_EPP","2021-10-29",{"$f":"MONTH(G369)","v":10},"31/03/2022",{"$f":"(I369-G369)/30","v":5.0999999999999996},"Invitación directa","GastosAdministrativos",755689722,755689722,"No","N/A","Gerencia de Abastecimiento Estratégico\ncontratacion@positiva.gov.co\nPBX: (1)6502200 Ext: 10641","SI","SI","NO","SI",null,{"$f":"CONCATENATE(D369,\"-\",\"Tipo de información\",\" \",V369,\"-\",F369)","v":"C82562022-Tipo de información -PRESTACION DE SERVICIOS DE PROMOCION Y PREVENCION – SUMINISTRO_EPP"}]
["PyP","Gerencia de administración del riesgo","No","C75382022",93141808,"PRESTACION DE SERVICIOS DE PROMOCION Y PREVENCION – SERVICIOS_ESPECIALIZADOS_ZONA_ANTIOQUIA","1/01/2022",{"$f":"MONTH(G370)","v":1},"30/11/2022",{"$f":"(I370-G370)/30","v":11.1},"Invitación directa","GastosAdministrativos",52258608,52258608,"No","N/A","Gerencia de Abastecimiento Estratégico\ncontratacion@positiva.gov.co\nPBX: (1)6502200 Ext: 10641","SI","SI","NO","SI",null,{"$f":"CONCATENATE(D370,\"-\",\"Tipo de información\",\" \",V370,\"-\",F370)","v":"C75382022-Tipo de información -PRESTACION DE SERVICIOS DE PROMOCION Y PREVENCION – SERVICIOS_ESPECIALIZADOS_ZONA_ANTIOQUIA"}]
["PyP","Gerencia de administración del riesgo","No","C75392022",93141808,"PRESTACION DE SERVICIOS DE PROMOCION Y PREVENCION – SERVICIOS_ESPECIALIZADOS_ZONA_ANTIOQUIA","1/01/2022",{"$f":"MONTH(G371)","v":1},"30/11/2022",{"$f":"(I371-G371)/30","v":11.1},"Invitación directa","GastosAdministrativos",157142857,157142857,"No","N/A","Gerencia de Abastecimiento Estratégico\ncontratacion@positiva.gov.co\nPBX: (1)6502200 Ext: 10641","SI","SI","NO","SI",null,{"$f":"CONCATENATE(D371,\"-\",\"Tipo de información\",\" \",V371,\"-\",F371)","v":"C75392022-Tipo de información -PRESTACION DE SERVICIOS DE PROMOCION Y PREVENCION – SERVICIOS_ESPECIALIZADOS_ZONA_ANTIOQUIA"}]
["PyP","Gerencia de administración del riesgo","No","C75402022",93141808,"PRESTACION DE SERVICIOS DE PROMOCION Y PREVENCION – SERVICIOS_ESPECIALIZADOS_ZONA_ANTIOQUIA","1/01/2022",{"$f":"MONTH(G372)","v":1},"30/11/2022",{"$f":"(I372-G372)/30","v":11.1},"Invitación directa","GastosAdministrativos",36407543,36407543,"No","N/A","Gerencia de Abastecimiento Estratégico\ncontratacion@positiva.gov.co\nPBX: (1)6502200 Ext: 10641","SI","SI","NO","SI",null,{"$f":"CONCATENATE(D372,\"-\",\"Tipo de información\",\" \",V372,\"-\",F372)","v":"C75402022-Tipo de información -PRESTACION DE SERVICIOS DE PROMOCION Y PREVENCION – SERVICIOS_ESPECIALIZADOS_ZONA_ANTIOQUIA"}]
["PyP","Gerencia de administración del riesgo","No","C77562022",93141808,"PRESTACION DE SERVICIOS DE PROMOCION Y PREVENCION – SERVICIOS_ESPECIALIZADOS_ZONA_BOGOTA","1/01/2022",{"$f":"MONTH(G373)","v":1},"30/11/2022",{"$f":"(I373-G373)/30","v":11.1},"Invitación directa","GastosAdministrativos",230000000,230000000,"No","N/A","Gerencia de Abastecimiento Estratégico\ncontratacion@positiva.gov.co\nPBX: (1)6502200 Ext: 10641","SI","SI","NO","SI",null,{"$f":"CONCATENATE(D373,\"-\",\"Tipo de información\",\" \",V373,\"-\",F373)","v":"C77562022-Tipo de información -PRESTACION DE SERVICIOS DE PROMOCION Y PREVENCION – SERVICIOS_ESPECIALIZADOS_ZONA_BOGOTA"}]
["PyP","Gerencia de administración del riesgo","No","C75412022",93141808,"PRESTACION DE SERVICIOS DE PROMOCION Y PREVENCION – SERVICIOS_ESPECIALIZADOS_ZONA_ANTIOQUIA","1/01/2022",{"$f":"MONTH(G374)","v":1},"30/11/2022",{"$f":"(I374-G374)/30","v":11.1},"Invitación directa","GastosAdministrativos",56838906,56838906,"No","N/A","Gerencia de Abastecimiento Estratégico\ncontratacion@positiva.gov.co\nPBX: (1)6502200 Ext: 10641","SI","SI","NO","SI",null,{"$f":"CONCATENATE(D374,\"-\",\"Tipo de información\",\" \",V374,\"-\",F374)","v":"C75412022-Tipo de información -PRESTACION DE SERVICIOS DE PROMOCION Y PREVENCION – SERVICIOS_ESPECIALIZADOS_ZONA_ANTIOQUIA"}]
["PyP","Gerencia de administración del riesgo","No","C82042022",93141808,"PRESTACION DE SERVICIOS DE PROMOCION Y PREVENCION – ASESORES_POR_PROYECTO","16/01/2022",{"$f":"MONTH(G375)","v":1},"30/09/2022",{"$f":"(I375-G375)/30","v":8.5666666666666664},"Invitación cerrada","GastosAdministrativos",7873886855,7873886855,"No","N/A","Gerencia de Abastecimiento Estratégico\ncontratacion@positiva.gov.co\nPBX: (1)6502200 Ext: 10641","SI","SI","NO","SI",null,{"$f":"CONCATENATE(D375,\"-\",\"Tipo de información\",\" \",V375,\"-\",F375)","v":"C82042022-Tipo de información -PRESTACION DE SERVICIOS DE PROMOCION Y PREVENCION – ASESORES_POR_PROYECTO"}]
["PyP","Gerencia de administración del riesgo","No","C82052022",93141808,"PRESTACION DE SERVICIOS DE PROMOCION Y PREVENCION – ASESORES_POR_PROYECTO","16/01/2022",{"$f":"MONTH(G376)","v":1},"30/09/2022",{"$f":"(I376-G376)/30","v":8.5666666666666664},"Invitación cerrada","GastosAdministrativos",6496005600,6496005600,"No","N/A","Gerencia de Abastecimiento Estratégico\ncontratacion@positiva.gov.co\nPBX: (1)6502200 Ext: 10641","SI","SI","NO","SI",null,{"$f":"CONCATENATE(D376,\"-\",\"Tipo de información\",\" \",V376,\"-\",F376)","v":"C82052022-Tipo de información -PRESTACION DE SERVICIOS DE PROMOCION Y PREVENCION – ASESORES_POR_PROYECTO"}]
["PyP","Gerencia de administración del riesgo","No","C82062022",93141808,"PRESTACION DE SERVICIOS DE PROMOCION Y PREVENCION – ASESORES_POR_PROYECTO","1/01/2022",{"$f":"MONTH(G377)","v":1},"24/01/2022",{"$f":"(I377-G377)/30","v":0.76666666666666672},"Invitación cerrada","GastosAdministrativos",348464130,348464130,"No","N/A","Gerencia de Abastecimiento Estratégico\ncontratacion@positiva.gov.co\nPBX: (1)6502200 Ext: 10641","SI","SI","NO","SI",null,{"$f":"CONCATENATE(D377,\"-\",\"Tipo de información\",\" \",V377,\"-\",F377)","v":"C82062022-Tipo de información -PRESTACION DE SERVICIOS DE PROMOCION Y PREVENCION – ASESORES_POR_PROYECTO"}]
["PyP","Gerencia de administración del riesgo","No","C82072022",93141808,"PRESTACION DE SERVICIOS DE PROMOCION Y PREVENCION – ASESORES_POR_PROYECTO","1/01/2022",{"$f":"MONTH(G378)","v":1},"24/01/2022",{"$f":"(I378-G378)/30","v":0.76666666666666672},"Invitación cerrada","GastosAdministrativos",825367200,825367200,"No","N/A","Gerencia de Abastecimiento Estratégico\ncontratacion@positiva.gov.co\nPBX: (1)6502200 Ext: 10641","SI","SI","NO","SI",null,{"$f":"CONCATENATE(D378,\"-\",\"Tipo de información\",\" \",V378,\"-\",F378)","v":"C82072022-Tipo de información -PRESTACION DE SERVICIOS DE PROMOCION Y PREVENCION – ASESORES_POR_PROYECTO"}]
["PyP","Gerencia de administración del riesgo","No","C82082022",93141808,"PRESTACION DE SERVICIOS DE PROMOCION Y PREVENCION – ASESORES_POR_PROYECTO","1/01/2022",{"$f":"MONTH(G379)","v":1},"24/01/2022",{"$f":"(I379-G379)/30","v":0.76666666666666672},"Invitación cerrada","GastosAdministrativos",871496600,871496600,"No","N/A","Gerencia de Abastecimiento Estratégico\ncontratacion@positiva.gov.co\nPBX: (1)6502200 Ext: 10641","SI","SI","NO","SI",null,{"$f":"CONCATENATE(D379,\"-\",\"Tipo de información\",\" \",V379,\"-\",F379)","v":"C82082022-Tipo de información -PRESTACION DE SERVICIOS DE PROMOCION Y PREVENCION – ASESORES_POR_PROYECTO"}]
["PyP","Gerencia de administración del riesgo","No","C82092022",93141808,"PRESTACION DE SERVICIOS DE PROMOCION Y PREVENCION – ASESORES_POR_PROYECTO","1/01/2022",{"$f":"MONTH(G380)","v":1},"24/01/2022",{"$f":"(I380-G380)/30","v":0.76666666666666672},"Invitación cerrada","GastosAdministrativos",80896973,80896973,"No","N/A","Gerencia de Abastecimiento Estratégico\ncontratacion@positiva.gov.co\nPBX: (1)6502200 Ext: 10641","SI","SI","NO","SI",null,{"$f":"CONCATENATE(D380,\"-\",\"Tipo de información\",\" \",V380,\"-\",F380)","v":"C82092022-Tipo de información -PRESTACION DE SERVICIOS DE PROMOCION Y PREVENCION – ASESORES_POR_PROYECTO"}]
["PyP","Gerencia de administración del riesgo","No","C82102022",93141808,"PRESTACION DE SERVICIOS DE PROMOCION Y PREVENCION – ASESORES_POR_PROYECTO","1/01/2022",{"$f":"MONTH(G381)","v":1},"24/01/2022",{"$f":"(I381-G381)/30","v":0.76666666666666672},"Invitación cerrada","GastosAdministrativos",175680000,175680000,"No","N/A","Gerencia de Abastecimiento Estratégico\ncontratacion@positiva.gov.co\nPBX: (1)6502200 Ext: 10641","SI","SI","NO","SI",null,{"$f":"CONCATENATE(D381,\"-\",\"Tipo de información\",\" \",V381,\"-\",F381)","v":"C82102022-Tipo de información -PRESTACION DE SERVICIOS DE PROMOCION Y PREVENCION – ASESORES_POR_PROYECTO"}]
["PyP","Gerencia de administración del riesgo","No","C82112022",93141808,"PRESTACION DE SERVICIOS DE PROMOCION Y PREVENCION – ASESORES_POR_PROYECTO","1/01/2022",{"$f":"MONTH(G382)","v":1},"24/01/2022",{"$f":"(I382-G382)/30","v":0.76666666666666672},"Invitación cerrada","GastosAdministrativos",390578560,390578560,"No","N/A","Gerencia de Abastecimiento Estratégico\ncontratacion@positiva.gov.co\nPBX: (1)6502200 Ext: 10641","SI","SI","NO","SI",null,{"$f":"CONCATENATE(D382,\"-\",\"Tipo de información\",\" \",V382,\"-\",F382)","v":"C82112022-Tipo de información -PRESTACION DE SERVICIOS DE PROMOCION Y PREVENCION – ASESORES_POR_PROYECTO"}]
["PyP","Gerencia de administración del riesgo","No","C82122022",93141808,"PRESTACION DE SERVICIOS DE PROMOCION Y PREVENCION – ASESORES_POR_PROYECTO","16/01/2022",{"$f":"MONTH(G383)","v":1},"30/09/2022",{"$f":"(I383-G383)/30","v":8.5666666666666664},"Invitación cerrada","GastosAdministrativos",360960264,360960264,"No","N/A","Gerencia de Abastecimiento Estratégico\ncontratacion@positiva.gov.co\nPBX: (1)6502200 Ext: 10641","SI","SI","NO","SI",null,{"$f":"CONCATENATE(D383,\"-\",\"Tipo de información\",\" \",V383,\"-\",F383)","v":"C82122022-Tipo de información -PRESTACION DE SERVICIOS DE PROMOCION Y PREVENCION – ASESORES_POR_PROYECTO"}]
["PyP","Gerencia de administración del riesgo","No","C82132022",93141808,"PRESTACION DE SERVICIOS DE PROMOCION Y PREVENCION – EIS_NIVEL_NACIONAL","16/01/2022",{"$f":"MONTH(G384)","v":1},"30/09/2022",{"$f":"(I384-G384)/30","v":8.5666666666666664},"Invitación cerrada","GastosAdministrativos",906022016,906022016,"No","N/A","Gerencia de Abastecimiento Estratégico\ncontratacion@positiva.gov.co\nPBX: (1)6502200 Ext: 10641","SI","SI","NO","SI",null,{"$f":"CONCATENATE(D384,\"-\",\"Tipo de información\",\" \",V384,\"-\",F384)","v":"C82132022-Tipo de información -PRESTACION DE SERVICIOS DE PROMOCION Y PREVENCION – EIS_NIVEL_NACIONAL"}]
["PyP","Gerencia de administración del riesgo","No","C82142022",93141808,"PRESTACION DE SERVICIOS DE PROMOCION Y PREVENCION – ASESORES_POR_PROYECTO","25/01/2022",{"$f":"MONTH(G385)","v":1},"30/09/2022",{"$f":"(I385-G385)/30","v":8.2666666666666675},"Invitación cerrada","GastosAdministrativos",4027841400,4027841400,"No","N/A","Gerencia de Abastecimiento Estratégico\ncontratacion@positiva.gov.co\nPBX: (1)6502200 Ext: 10641","SI","SI","NO","SI",null,{"$f":"CONCATENATE(D385,\"-\",\"Tipo de información\",\" \",V385,\"-\",F385)","v":"C82142022-Tipo de información -PRESTACION DE SERVICIOS DE PROMOCION Y PREVENCION – ASESORES_POR_PROYECTO"}]
["PyP","Gerencia de administración del riesgo","No","C82152022",93141808,"PRESTACION DE SERVICIOS DE PROMOCION Y PREVENCION – ASESORES_POR_PROYECTO","25/01/2022",{"$f":"MONTH(G386)","v":1},"30/09/2022",{"$f":"(I386-G386)/30","v":8.2666666666666675},"Invitación cerrada","GastosAdministrativos",3200886400,3200886400,"No","N/A","Gerencia de Abastecimiento Estratégico\ncontratacion@positiva.gov.co\nPBX: (1)6502200 Ext: 10641","SI","SI","NO","SI",null,{"$f":"CONCATENATE(D386,\"-\",\"Tipo de información\",\" \",V386,\"-\",F386)","v":"C82152022-Tipo de información -PRESTACION DE SERVICIOS DE PROMOCION Y PREVENCION – ASESORES_POR_PROYECTO"}]
["PyP","Gerencia de administración del riesgo","No","C82162022",93141808,"PRESTACION DE SERVICIOS DE PROMOCION Y PREVENCION – ASESORES_POR_PROYECTO","25/01/2022",{"$f":"MONTH(G387)","v":1},"30/09/2022",{"$f":"(I387-G387)/30","v":8.2666666666666675},"Invitación cerrada","GastosAdministrativos",3179451000,3179451000,"No","N/A","Gerencia de Abastecimiento Estratégico\ncontratacion@positiva.gov.co\nPBX: (1)6502200 Ext: 10641","SI","SI","NO","SI",null,{"$f":"CONCATENATE(D387,\"-\",\"Tipo de información\",\" \",V387,\"-\",F387)","v":"C82162022-Tipo de información -PRESTACION DE SERVICIOS DE PROMOCION Y PREVENCION – ASESORES_POR_PROYECTO"}]
["PyP","Gerencia de administración del riesgo","No","C82172022",93141808,"PRESTACION DE SERVICIOS DE PROMOCION Y PREVENCION – ASESORES_POR_PROYECTO","25/01/2022",{"$f":"MONTH(G388)","v":1},"30/09/2022",{"$f":"(I388-G388)/30","v":8.2666666666666675},"Invitación cerrada","GastosAdministrativos",1811700000,1811700000,"No","N/A","Gerencia de Abastecimiento Estratégico\ncontratacion@positiva.gov.co\nPBX: (1)6502200 Ext: 10641","SI","SI","NO","SI",null,{"$f":"CONCATENATE(D388,\"-\",\"Tipo de información\",\" \",V388,\"-\",F388)","v":"C82172022-Tipo de información -PRESTACION DE SERVICIOS DE PROMOCION Y PREVENCION – ASESORES_POR_PROYECTO"}]
["PyP","Gerencia de administración del riesgo","No","C82182022",93141808,"PRESTACION DE SERVICIOS DE PROMOCION Y PREVENCION – ASESORES_POR_PROYECTO","25/01/2022",{"$f":"MONTH(G389)","v":1},"30/09/2022",{"$f":"(I389-G389)/30","v":8.2666666666666675},"Invitación cerrada","GastosAdministrativos",834250032,834250032,"No","N/A","Gerencia de Abastecimiento Estratégico\ncontratacion@positiva.gov.co\nPBX: (1)6502200 Ext: 10641","SI","SI","NO","SI",null,{"$f":"CONCATENATE(D389,\"-\",\"Tipo de información\",\" \",V389,\"-\",F389)","v":"C82182022-Tipo de información -PRESTACION DE SERVICIOS DE PROMOCION Y PREVENCION – ASESORES_POR_PROYECTO"}]
["PyP","Gerencia de administración del riesgo","No","C80372022",93141808,"PRESTACION DE SERVICIOS DE PROMOCION Y PREVENCION – SERVICIOS_ESPECIALIZADOS_ZONA_VALLE","1/01/2022",{"$f":"MONTH(G390)","v":1},"30/11/2022",{"$f":"(I390-G390)/30","v":11.1},"Invitación cerrada","GastosAdministrativos",230000000,230000000,"No","N/A","Gerencia de Abastecimiento Estratégico\ncontratacion@positiva.gov.co\nPBX: (1)6502200 Ext: 10641","SI","SI","NO","SI",null,{"$f":"CONCATENATE(D390,\"-\",\"Tipo de información\",\" \",V390,\"-\",F390)","v":"C80372022-Tipo de información -PRESTACION DE SERVICIOS DE PROMOCION Y PREVENCION – SERVICIOS_ESPECIALIZADOS_ZONA_VALLE"}]
["PyP","Gerencia de administración del riesgo","No","C82192022",93141808,"PRESTACION DE SERVICIOS DE PROMOCION Y PREVENCION – ASESORES_POR_PROYECTO","25/01/2022",{"$f":"MONTH(G391)","v":1},"30/09/2022",{"$f":"(I391-G391)/30","v":8.2666666666666675},"Invitación cerrada","GastosAdministrativos",7553568000,7553568000,"No","N/A","Gerencia de Abastecimiento Estratégico\ncontratacion@positiva.gov.co\nPBX: (1)6502200 Ext: 10641","SI","SI","NO","SI",null,{"$f":"CONCATENATE(D391,\"-\",\"Tipo de información\",\" \",V391,\"-\",F391)","v":"C82192022-Tipo de información -PRESTACION DE SERVICIOS DE PROMOCION Y PREVENCION – ASESORES_POR_PROYECTO"}]
["PyP","Gerencia de administración del riesgo","No","C82202022",93141808,"PRESTACION DE SERVICIOS DE PROMOCION Y PREVENCION – EIS_NIVEL_NACIONAL","25/01/2022",{"$f":"MONTH(G392)","v":1},"30/09/2022",{"$f":"(I392-G392)/30","v":8.2666666666666675},"Invitación cerrada","GastosAdministrativos",9343352040,9343352040,"No","N/A","Gerencia de Abastecimiento Estratégico\ncontratacion@positiva.gov.co\nPBX: (1)6502200 Ext: 10641","SI","SI","NO","SI",null,{"$f":"CONCATENATE(D392,\"-\",\"Tipo de información\",\" \",V392,\"-\",F392)","v":"C82202022-Tipo de información -PRESTACION DE SERVICIOS DE PROMOCION Y PREVENCION – EIS_NIVEL_NACIONAL"}]
["PyP","Gerencia de administración del riesgo","No","C76382022",93141808,"PRESTACION DE SERVICIOS DE PROMOCION Y PREVENCION – SERVICIOS_ESPECIALIZADOS_ZONA_ATLANTICO","25/01/2022",{"$f":"MONTH(G393)","v":1},"30/11/2022",{"$f":"(I393-G393)/30","v":10.3},"Invitación directa","GastosAdministrativos",104302160,104302160,"No","N/A","Gerencia de Abastecimiento Estratégico\ncontratacion@positiva.gov.co\nPBX: (1)6502200 Ext: 10641","SI","SI","NO","SI",null,{"$f":"CONCATENATE(D393,\"-\",\"Tipo de información\",\" \",V393,\"-\",F393)","v":"C76382022-Tipo de información -PRESTACION DE SERVICIOS DE PROMOCION Y PREVENCION – SERVICIOS_ESPECIALIZADOS_ZONA_ATLANTICO"}]
["PyP","Gerencia de administración del riesgo","No","C77842022",93141808,"PRESTACION DE SERVICIOS DE PROMOCION Y PREVENCION – SERVICIOS_ESPECIALIZADOS_ZONA_BOGOTA","15/01/2022",{"$f":"MONTH(G394)","v":1},"30/11/2022",{"$f":"(I394-G394)/30","v":10.633333333333333},"Invitación directa","GastosAdministrativos",100000000,100000000,"No","N/A","Gerencia de Abastecimiento Estratégico\ncontratacion@positiva.gov.co\nPBX: (1)6502200 Ext: 10641","SI","SI","NO","SI",null,{"$f":"CONCATENATE(D394,\"-\",\"Tipo de información\",\" \",V394,\"-\",F394)","v":"C77842022-Tipo de información -PRESTACION DE SERVICIOS DE PROMOCION Y PREVENCION – SERVICIOS_ESPECIALIZADOS_ZONA_BOGOTA"}]
["PyP","Gerencia de administración del riesgo","No","C77852022",93141808,"PRESTACION DE SERVICIOS DE PROMOCION Y PREVENCION – SERVICIOS_ESPECIALIZADOS_ZONA_BOGOTA","15/01/2022",{"$f":"MONTH(G395)","v":1},"30/11/2022",{"$f":"(I395-G395)/30","v":10.633333333333333},"Invitación directa","GastosAdministrativos",100000000,100000000,"No","N/A","Gerencia de Abastecimiento Estratégico\ncontratacion@positiva.gov.co\nPBX: (1)6502200 Ext: 10641","SI","SI","NO","SI",null,{"$f":"CONCATENATE(D395,\"-\",\"Tipo de información\",\" \",V395,\"-\",F395)","v":"C77852022-Tipo de información -PRESTACION DE SERVICIOS DE PROMOCION Y PREVENCION – SERVICIOS_ESPECIALIZADOS_ZONA_BOGOTA"}]
["PyP","Gerencia de administración del riesgo","No","C77572022",93141808,"PRESTACION DE SERVICIOS DE PROMOCION Y PREVENCION – SERVICIOS_ESPECIALIZADOS_ZONA_BOGOTA","15/01/2022",{"$f":"MONTH(G396)","v":1},"30/11/2022",{"$f":"(I396-G396)/30","v":10.633333333333333},"Invitación directa","GastosAdministrativos",230000000,230000000,"No","N/A","Gerencia de Abastecimiento Estratégico\ncontratacion@positiva.gov.co\nPBX: (1)6502200 Ext: 10641","SI","SI","NO","SI",null,{"$f":"CONCATENATE(D396,\"-\",\"Tipo de información\",\" \",V396,\"-\",F396)","v":"C77572022-Tipo de información -PRESTACION DE SERVICIOS DE PROMOCION Y PREVENCION – SERVICIOS_ESPECIALIZADOS_ZONA_BOGOTA"}]
["PyP","Gerencia de administración del riesgo","No","C77862022",93141808,"PRESTACION DE SERVICIOS DE PROMOCION Y PREVENCION – SERVICIOS_ESPECIALIZADOS_ZONA_BOGOTA","1/02/2022",{"$f":"MONTH(G397)","v":2},"31/12/2022",{"$f":"(I397-G397)/30","v":11.1},"Invitación directa","GastosAdministrativos",250000000,250000000,"No","N/A","Gerencia de Abastecimiento Estratégico\ncontratacion@positiva.gov.co\nPBX: (1)6502200 Ext: 10641","SI","SI","NO","SI",null,{"$f":"CONCATENATE(D397,\"-\",\"Tipo de información\",\" \",V397,\"-\",F397)","v":"C77862022-Tipo de información -PRESTACION DE SERVICIOS DE PROMOCION Y PREVENCION – SERVICIOS_ESPECIALIZADOS_ZONA_BOGOTA"}]
["PyP","Gerencia de administración del riesgo","No","C77872022",93141808,"PRESTACION DE SERVICIOS DE PROMOCION Y PREVENCION – SERVICIOS_ESPECIALIZADOS_ZONA_BOGOTA","1/02/2022",{"$f":"MONTH(G398)","v":2},"31/12/2022",{"$f":"(I398-G398)/30","v":11.1},"Invitación directa","GastosAdministrativos",250000000,250000000,"No","N/A","Gerencia de Abastecimiento Estratégico\ncontratacion@positiva.gov.co\nPBX: (1)6502200 Ext: 10641","SI","SI","NO","SI",null,{"$f":"CONCATENATE(D398,\"-\",\"Tipo de información\",\" \",V398,\"-\",F398)","v":"C77872022-Tipo de información -PRESTACION DE SERVICIOS DE PROMOCION Y PREVENCION – SERVICIOS_ESPECIALIZADOS_ZONA_BOGOTA"}]
["PyP","Gerencia de administración del riesgo","No","C75422022",93141808,"PRESTACION DE SERVICIOS DE PROMOCION Y PREVENCION – SERVICIOS_ESPECIALIZADOS_ZONA_ANTIOQUIA","1/02/2022",{"$f":"MONTH(G399)","v":2},"30/11/2022",{"$f":"(I399-G399)/30","v":10.066666666666666},"Invitación directa","GastosAdministrativos",120000000,120000000,"No","N/A","Gerencia de Abastecimiento Estratégico\ncontratacion@positiva.gov.co\nPBX: (1)6502200 Ext: 10641","SI","SI","NO","SI",null,{"$f":"CONCATENATE(D399,\"-\",\"Tipo de información\",\" \",V399,\"-\",F399)","v":"C75422022-Tipo de información -PRESTACION DE SERVICIOS DE PROMOCION Y PREVENCION – SERVICIOS_ESPECIALIZADOS_ZONA_ANTIOQUIA"}]
["PyP","Gerencia de administración del riesgo","No","C80382022",93141808,"PRESTACION DE SERVICIOS DE PROMOCION Y PREVENCION – SERVICIOS_ESPECIALIZADOS_ZONA_VALLE","1/02/2022",{"$f":"MONTH(G400)","v":2},"31/12/2022",{"$f":"(I400-G400)/30","v":11.1},"Invitación directa","GastosAdministrativos",31900000,31900000,"No","N/A","Gerencia de Abastecimiento Estratégico\ncontratacion@positiva.gov.co\nPBX: (1)6502200 Ext: 10641","SI","SI","NO","SI",null,{"$f":"CONCATENATE(D400,\"-\",\"Tipo de información\",\" \",V400,\"-\",F400)","v":"C80382022-Tipo de información -PRESTACION DE SERVICIOS DE PROMOCION Y PREVENCION – SERVICIOS_ESPECIALIZADOS_ZONA_VALLE"}]
["PyP","Gerencia de administración del riesgo","No","C81322022",93141808,"PRESTACION DE SERVICIOS DE PROMOCION Y PREVENCION – SERVICIOS_ESPECIALIZADOS_CUENTA_FGN","25/01/2022",{"$f":"MONTH(G401)","v":1},"30/11/2022",{"$f":"(I401-G401)/30","v":10.3},"Invitación directa","GastosAdministrativos",258000000,258000000,"No","N/A","Gerencia de Abastecimiento Estratégico\ncontratacion@positiva.gov.co\nPBX: (1)6502200 Ext: 10641","SI","SI","NO","SI",null,{"$f":"CONCATENATE(D401,\"-\",\"Tipo de información\",\" \",V401,\"-\",F401)","v":"C81322022-Tipo de información -PRESTACION DE SERVICIOS DE PROMOCION Y PREVENCION – SERVICIOS_ESPECIALIZADOS_CUENTA_FGN"}]
["PyP","Gerencia de administración del riesgo","No","C82212022",93141808,"PRESTACION DE SERVICIOS DE PROMOCION Y PREVENCION – SERVICIOS_ESPECIALIZADOS_NIVEL_NACIONAL","1/02/2022",{"$f":"MONTH(G402)","v":2},"31/12/2022",{"$f":"(I402-G402)/30","v":11.1},"Invitación directa","GastosAdministrativos",250000000,250000000,"No","N/A","Gerencia de Abastecimiento Estratégico\ncontratacion@positiva.gov.co\nPBX: (1)6502200 Ext: 10641","SI","SI","NO","SI",null,{"$f":"CONCATENATE(D402,\"-\",\"Tipo de información\",\" \",V402,\"-\",F402)","v":"C82212022-Tipo de información -PRESTACION DE SERVICIOS DE PROMOCION Y PREVENCION – SERVICIOS_ESPECIALIZADOS_NIVEL_NACIONAL"}]
["PyP","Gerencia de administración del riesgo","No","C82222022",93141808,"PRESTACION DE SERVICIOS DE PROMOCION Y PREVENCION – SERVICIOS_ESPECIALIZADOS_NIVEL_NACIONAL","1/02/2022",{"$f":"MONTH(G403)","v":2},"30/11/2022",{"$f":"(I403-G403)/30","v":10.066666666666666},"Invitación directa","GastosAdministrativos",3452348230,3452348230,"No","N/A","Gerencia de Abastecimiento Estratégico\ncontratacion@positiva.gov.co\nPBX: (1)6502200 Ext: 10641","SI","SI","NO","SI",null,{"$f":"CONCATENATE(D403,\"-\",\"Tipo de información\",\" \",V403,\"-\",F403)","v":"C82222022-Tipo de información -PRESTACION DE SERVICIOS DE PROMOCION Y PREVENCION – SERVICIOS_ESPECIALIZADOS_NIVEL_NACIONAL"}]
["PyP","Gerencia de Investigación del riesgo","No","C83012022",93141808,"PRESTACION DE SERVICIOS DE PROMOCION Y PREVENCION – EDUCA","1/01/2022",{"$f":"MONTH(G404)","v":1},"30/11/2022",{"$f":"(I404-G404)/30","v":11.1},"Invitación directa","GastosAdministrativos",90000000,90000000,"No","N/A","Gerencia de Abastecimiento Estratégico\ncontratacion@positiva.gov.co\nPBX: (1)6502200 Ext: 10641","SI","SI","NO","SI",null,{"$f":"CONCATENATE(D404,\"-\",\"Tipo de información\",\" \",V404,\"-\",F404)","v":"C83012022-Tipo de información -PRESTACION DE SERVICIOS DE PROMOCION Y PREVENCION – EDUCA"}]
["PyP","Gerencia de Investigación del riesgo","No","C83022022",93141808,"PRESTACION DE SERVICIOS DE PROMOCION Y PREVENCION – EDUCA","1/01/2022",{"$f":"MONTH(G405)","v":1},"30/11/2022",{"$f":"(I405-G405)/30","v":11.1},"Invitación directa","GastosAdministrativos",730000000,730000000,"No","N/A","Gerencia de Abastecimiento Estratégico\ncontratacion@positiva.gov.co\nPBX: (1)6502200 Ext: 10641","SI","SI","NO","SI",null,{"$f":"CONCATENATE(D405,\"-\",\"Tipo de información\",\" \",V405,\"-\",F405)","v":"C83022022-Tipo de información -PRESTACION DE SERVICIOS DE PROMOCION Y PREVENCION – EDUCA"}]
["PyP","Gerencia de Investigación del riesgo","No","C83032022",93141808,"PRESTACION DE SERVICIOS DE PROMOCION Y PREVENCION – EDUCA","1/01/2022",{"$f":"MONTH(G406)","v":1},"30/11/2022",{"$f":"(I406-G406)/30","v":11.1},"Invitación directa","GastosAdministrativos",40000000,40000000,"No","N/A","Gerencia de Abastecimiento Estratégico\ncontratacion@positiva.gov.co\nPBX: (1)6502200 Ext: 10641","SI","SI","NO","SI",null,{"$f":"CONCATENATE(D406,\"-\",\"Tipo de información\",\" \",V406,\"-\",F406)","v":"C83032022-Tipo de información -PRESTACION DE SERVICIOS DE PROMOCION Y PREVENCION – EDUCA"}]
["PyP","Gerencia de Investigación del riesgo","No","C83042022",93141808,"PRESTACION DE SERVICIOS DE PROMOCION Y PREVENCION – EDUCA","1/01/2022",{"$f":"MONTH(G407)","v":1},"30/11/2022",{"$f":"(I407-G407)/30","v":11.1},"Invitación directa","GastosAdministrativos",120000000,120000000,"No","N/A","Gerencia de Abastecimiento Estratégico\ncontratacion@positiva.gov.co\nPBX: (1)6502200 Ext: 10641","SI","SI","NO","SI",null,{"$f":"CONCATENATE(D407,\"-\",\"Tipo de información\",\" \",V407,\"-\",F407)","v":"C83042022-Tipo de información -PRESTACION DE SERVICIOS DE PROMOCION Y PREVENCION – EDUCA"}]
["PyP","Gerencia de Investigación del riesgo","No","C83052022",93141808,"PRESTACION DE SERVICIOS DE PROMOCION Y PREVENCION – EDUCA","1/01/2022",{"$f":"MONTH(G408)","v":1},"30/11/2022",{"$f":"(I408-G408)/30","v":11.1},"Invitación directa","GastosAdministrativos",200000000,200000000,"No","N/A","Gerencia de Abastecimiento Estratégico\ncontratacion@positiva.gov.co\nPBX: (1)6502200 Ext: 10641","SI","SI","NO","SI",null,{"$f":"CONCATENATE(D408,\"-\",\"Tipo de información\",\" \",V408,\"-\",F408)","v":"C83052022-Tipo de información -PRESTACION DE SERVICIOS DE PROMOCION Y PREVENCION – EDUCA"}]
["PyP","Gerencia de Investigación del riesgo","No","C83062022",93141808,"PRESTACION DE SERVICIOS DE PROMOCION Y PREVENCION – EDUCA","1/01/2022",{"$f":"MONTH(G409)","v":1},"30/11/2022",{"$f":"(I409-G409)/30","v":11.1},"Invitación directa","GastosAdministrativos",100000000,100000000,"No","N/A","Gerencia de Abastecimiento Estratégico\ncontratacion@positiva.gov.co\nPBX: (1)6502200 Ext: 10641","SI","SI","NO","SI",null,{"$f":"CONCATENATE(D409,\"-\",\"Tipo de información\",\" \",V409,\"-\",F409)","v":"C83062022-Tipo de información -PRESTACION DE SERVICIOS DE PROMOCION Y PREVENCION – EDUCA"}]
["PyP","Gerencia de Investigación del riesgo","No","C83072022",93141808,"PRESTACION DE SERVICIOS DE PROMOCION Y PREVENCION – EDUCA","1/01/2022",{"$f":"MONTH(G410)","v":1},"30/11/2022",{"$f":"(I410-G410)/30","v":11.1},"Invitación directa","GastosAdministrativos",220000000,220000000,"No","N/A","Gerencia de Abastecimiento Estratégico\ncontratacion@positiva.gov.co\nPBX: (1)6502200 Ext: 10641","SI","SI","NO","SI",null,{"$f":"CONCATENATE(D410,\"-\",\"Tipo de información\",\" \",V410,\"-\",F410)","v":"C83072022-Tipo de información -PRESTACION DE SERVICIOS DE PROMOCION Y PREVENCION – EDUCA"}]
["PyP","Gerencia de Investigación del riesgo","No","C83082022",93141808,"PRESTACION DE SERVICIOS DE PROMOCION Y PREVENCION – EDUCA","1/01/2022",{"$f":"MONTH(G411)","v":1},"30/11/2022",{"$f":"(I411-G411)/30","v":11.1},"Invitación directa","GastosAdministrativos",100000000,100000000,"No","N/A","Gerencia de Abastecimiento Estratégico\ncontratacion@positiva.gov.co\nPBX: (1)6502200 Ext: 10641","SI","SI","NO","SI",null,{"$f":"CONCATENATE(D411,\"-\",\"Tipo de información\",\" \",V411,\"-\",F411)","v":"C83082022-Tipo de información -PRESTACION DE SERVICIOS DE PROMOCION Y PREVENCION – EDUCA"}]
["PyP","Gerencia de Investigación del riesgo","No","C83092022",93141808,"PRESTACION DE SERVICIOS DE PROMOCION Y PREVENCION – EDUCA","1/01/2022",{"$f":"MONTH(G412)","v":1},"30/11/2022",{"$f":"(I412-G412)/30","v":11.1},"Invitación directa","GastosAdministrativos",258611472,258611472,"No","N/A","Gerencia de Abastecimiento Estratégico\ncontratacion@positiva.gov.co\nPBX: (1)6502200 Ext: 10641","SI","SI","NO","SI",null,{"$f":"CONCATENATE(D412,\"-\",\"Tipo de información\",\" \",V412,\"-\",F412)","v":"C83092022-Tipo de información -PRESTACION DE SERVICIOS DE PROMOCION Y PREVENCION – EDUCA"}]
["PyP","Gerencia de Investigación del riesgo","No","C83102022",93141808,"PRESTACION DE SERVICIOS DE PROMOCION Y PREVENCION – EDUCA","1/01/2022",{"$f":"MONTH(G413)","v":1},"30/11/2022",{"$f":"(I413-G413)/30","v":11.1},"Invitación directa","GastosAdministrativos",100000000,100000000,"No","N/A","Gerencia de Abastecimiento Estratégico\ncontratacion@positiva.gov.co\nPBX: (1)6502200 Ext: 10641","SI","SI","NO","SI",null,{"$f":"CONCATENATE(D413,\"-\",\"Tipo de información\",\" \",V413,\"-\",F413)","v":"C83102022-Tipo de información -PRESTACION DE SERVICIOS DE PROMOCION Y PREVENCION – EDUCA"}]
["PyP","Gerencia de Investigación del riesgo","No","C83112022",93141808,"PRESTACION DE SERVICIOS DE PROMOCION Y PREVENCION – EDUCA","1/01/2022",{"$f":"MONTH(G414)","v":1},"30/11/2022",{"$f":"(I414-G414)/30","v":11.1},"Invitación directa","GastosAdministrativos",150000000,150000000,"No","N/A","Gerencia de Abastecimiento Estratégico\ncontratacion@positiva.gov.co\nPBX: (1)6502200 Ext: 10641","SI","SI","NO","SI",null,{"$f":"CONCATENATE(D414,\"-\",\"Tipo de información\",\" \",V414,\"-\",F414)","v":"C83112022-Tipo de información -PRESTACION DE SERVICIOS DE PROMOCION Y PREVENCION – EDUCA"}]
["PyP","Gerencia de Investigación del riesgo","No","C83122022",93141808,"PRESTACION DE SERVICIOS DE PROMOCION Y PREVENCION – EDUCA","1/01/2022",{"$f":"MONTH(G415)","v":1},"30/11/2022",{"$f":"(I415-G415)/30","v":11.1},"Invitación directa","GastosAdministrativos",75489515,75489515,"No","N/A","Gerencia de Abastecimiento Estratégico\ncontratacion@positiva.gov.co\nPBX: (1)6502200 Ext: 10641","SI","SI","NO","SI",null,{"$f":"CONCATENATE(D415,\"-\",\"Tipo de información\",\" \",V415,\"-\",F415)","v":"C83122022-Tipo de información -PRESTACION DE SERVICIOS DE PROMOCION Y PREVENCION – EDUCA"}]
["PyP","Gerencia de Investigación del riesgo","No","C83132022",93141808,"PRESTACION DE SERVICIOS DE PROMOCION Y PREVENCION – EDUCA","1/01/2022",{"$f":"MONTH(G416)","v":1},"30/11/2022",{"$f":"(I416-G416)/30","v":11.1},"Invitación directa","GastosAdministrativos",180000000,180000000,"No","N/A","Gerencia de Abastecimiento Estratégico\ncontratacion@positiva.gov.co\nPBX: (1)6502200 Ext: 10641","SI","SI","NO","SI",null,{"$f":"CONCATENATE(D416,\"-\",\"Tipo de información\",\" \",V416,\"-\",F416)","v":"C83132022-Tipo de información -PRESTACION DE SERVICIOS DE PROMOCION Y PREVENCION – EDUCA"}]
["PyP","Gerencia de Investigación del riesgo","No","C83142022",93141808,"PRESTACION DE SERVICIOS DE PROMOCION Y PREVENCION – EDUCA","1/02/2022",{"$f":"MONTH(G417)","v":2},"31/12/2022",{"$f":"(I417-G417)/30","v":11.1},"Invitación directa","GastosAdministrativos",230000000,230000000,"No","N/A","Gerencia de Abastecimiento Estratégico\ncontratacion@positiva.gov.co\nPBX: (1)6502200 Ext: 10641","SI","SI","NO","SI",null,{"$f":"CONCATENATE(D417,\"-\",\"Tipo de información\",\" \",V417,\"-\",F417)","v":"C83142022-Tipo de información -PRESTACION DE SERVICIOS DE PROMOCION Y PREVENCION – EDUCA"}]
["PyP","Gerencia de Investigación del riesgo","No","C83152022",93141808,"PRESTACION DE SERVICIOS DE PROMOCION Y PREVENCION – EDUCA","1/01/2022",{"$f":"MONTH(G418)","v":1},"30/11/2022",{"$f":"(I418-G418)/30","v":11.1},"Invitación directa","GastosAdministrativos",400000000,400000000,"No","N/A","Gerencia de Abastecimiento Estratégico\ncontratacion@positiva.gov.co\nPBX: (1)6502200 Ext: 10641","SI","SI","NO","SI",null,{"$f":"CONCATENATE(D418,\"-\",\"Tipo de información\",\" \",V418,\"-\",F418)","v":"C83152022-Tipo de información -PRESTACION DE SERVICIOS DE PROMOCION Y PREVENCION – EDUCA"}]
["PyP","Gerencia de Investigación del riesgo","No","C83162022",93141808,"PRESTACION DE SERVICIOS DE PROMOCION Y PREVENCION – EDUCA","1/01/2022",{"$f":"MONTH(G419)","v":1},"30/11/2022",{"$f":"(I419-G419)/30","v":11.1},"Invitación directa","GastosAdministrativos",2100000000,2100000000,"No","N/A","Gerencia de Abastecimiento Estratégico\ncontratacion@positiva.gov.co\nPBX: (1)6502200 Ext: 10641","SI","SI","NO","SI",null,{"$f":"CONCATENATE(D419,\"-\",\"Tipo de información\",\" \",V419,\"-\",F419)","v":"C83162022-Tipo de información -PRESTACION DE SERVICIOS DE PROMOCION Y PREVENCION – EDUCA"}]
["PyP","Gerencia de Investigación del riesgo","No","C83512022",93141808,"PRESTACION DE SERVICIOS DE PROMOCION Y PREVENCION – ALISSTA","1/01/2022",{"$f":"MONTH(G420)","v":1},"30/11/2022",{"$f":"(I420-G420)/30","v":11.1},"Invitación directa","GastosAdministrativos",1699992615,1699992615,"No","N/A","Gerencia de Abastecimiento Estratégico\ncontratacion@positiva.gov.co\nPBX: (1)6502200 Ext: 10641","SI","SI","NO","SI",null,{"$f":"CONCATENATE(D420,\"-\",\"Tipo de información\",\" \",V420,\"-\",F420)","v":"C83512022-Tipo de información -PRESTACION DE SERVICIOS DE PROMOCION Y PREVENCION – ALISSTA"}]
["PyP","Gerencia de Investigación del riesgo","No","C83522022",93141808,"PRESTACION DE SERVICIOS DE PROMOCION Y PREVENCION – GICR_COMUNICA","1/01/2022",{"$f":"MONTH(G421)","v":1},"30/11/2022",{"$f":"(I421-G421)/30","v":11.1},"Invitación directa","GastosAdministrativos",350000000,350000000,"No","N/A","Gerencia de Abastecimiento Estratégico\ncontratacion@positiva.gov.co\nPBX: (1)6502200 Ext: 10641","SI","SI","NO","SI",null,{"$f":"CONCATENATE(D421,\"-\",\"Tipo de información\",\" \",V421,\"-\",F421)","v":"C83522022-Tipo de información -PRESTACION DE SERVICIOS DE PROMOCION Y PREVENCION – GICR_COMUNICA"}]
["PyP","Gerencia de Investigación del riesgo","No","C83532022",93141808,"PRESTACION DE SERVICIOS DE PROMOCION Y PREVENCION – GICR","1/01/2022",{"$f":"MONTH(G422)","v":1},"30/11/2022",{"$f":"(I422-G422)/30","v":11.1},"Invitación directa","GastosAdministrativos",300991815,300991815,"No","N/A","Gerencia de Abastecimiento Estratégico\ncontratacion@positiva.gov.co\nPBX: (1)6502200 Ext: 10641","SI","SI","NO","SI",null,{"$f":"CONCATENATE(D422,\"-\",\"Tipo de información\",\" \",V422,\"-\",F422)","v":"C83532022-Tipo de información -PRESTACION DE SERVICIOS DE PROMOCION Y PREVENCION – GICR"}]
["PyP","Gerencia de Investigación del riesgo","No","C82512022",93141808,"PRESTACION DE SERVICIOS DE PROMOCION Y PREVENCION – CHEQUEOS_MEDICOS_PREVENTIVOS","5/11/2021",{"$f":"MONTH(G423)","v":11},"31/03/2022",{"$f":"(I423-G423)/30","v":4.8666666666666663},"Invitación directa","GastosAdministrativos",2181187910,2181187910,"No","N/A","Gerencia de Abastecimiento Estratégico\ncontratacion@positiva.gov.co\nPBX: (1)6502200 Ext: 10641","SI","SI","NO","SI",null,{"$f":"CONCATENATE(D423,\"-\",\"Tipo de información\",\" \",V423,\"-\",F423)","v":"C82512022-Tipo de información -PRESTACION DE SERVICIOS DE PROMOCION Y PREVENCION – CHEQUEOS_MEDICOS_PREVENTIVOS"}]
["PyP","Gerencia de Investigación del riesgo","No","C83542022",93141808,"PRESTACION DE SERVICIOS DE PROMOCION Y PREVENCION – GICR_COMUNICA","1/05/2022",{"$f":"MONTH(G424)","v":5},"31/12/2022",{"$f":"(I424-G424)/30","v":8.1333333333333329},"Invitación pública","GastosAdministrativos",1150000000,1150000000,"No","N/A","Gerencia de Abastecimiento Estratégico\ncontratacion@positiva.gov.co\nPBX: (1)6502200 Ext: 10641","SI","SI","NO","SI",null,{"$f":"CONCATENATE(D424,\"-\",\"Tipo de información\",\" \",V424,\"-\",F424)","v":"C83542022-Tipo de información -PRESTACION DE SERVICIOS DE PROMOCION Y PREVENCION – GICR_COMUNICA"}]
["PyP","Gerencia de Investigación del riesgo","No","C83552022",93141808,"PRESTACION DE SERVICIOS DE PROMOCION Y PREVENCION – GICR_LHTI","1/01/2022",{"$f":"MONTH(G425)","v":1},"30/06/2022",{"$f":"(I425-G425)/30","v":6},"Invitación directa","GastosAdministrativos",470000000,470000000,"No","N/A","Gerencia de Abastecimiento Estratégico\ncontratacion@positiva.gov.co\nPBX: (1)6502200 Ext: 10641","SI","SI","NO","SI",null,{"$f":"CONCATENATE(D425,\"-\",\"Tipo de información\",\" \",V425,\"-\",F425)","v":"C83552022-Tipo de información -PRESTACION DE SERVICIOS DE PROMOCION Y PREVENCION – GICR_LHTI"}]
["PyP","Vicepresidencia de PYP","No","C85502022",93141808,"PRESTACION DE SERVICIOS DE PROMOCION Y PREVENCION – VIATICOS_TIQUETES","1/01/2022",{"$f":"MONTH(G426)","v":1},"30/11/2022",{"$f":"(I426-G426)/30","v":11.1},"Invitación cerrada","GastosAdministrativos",94585987,94585987,"No","N/A","Gerencia de Abastecimiento Estratégico\ncontratacion@positiva.gov.co\nPBX: (1)6502200 Ext: 10641","SI","SI","NO","SI",null,{"$f":"CONCATENATE(D426,\"-\",\"Tipo de información\",\" \",V426,\"-\",F426)","v":"C85502022-Tipo de información -PRESTACION DE SERVICIOS DE PROMOCION Y PREVENCION – VIATICOS_TIQUETES"}]
["PyP","Vicepresidencia de PYP","No","C85512022",93141808,"PRESTACION DE SERVICIOS DE PROMOCION Y PREVENCION – VIATICOS_TIQUETES","1/01/2022",{"$f":"MONTH(G427)","v":1},"30/11/2022",{"$f":"(I427-G427)/30","v":11.1},"Invitación cerrada","GastosAdministrativos",25414013,25414013,"No","N/A","Gerencia de Abastecimiento Estratégico\ncontratacion@positiva.gov.co\nPBX: (1)6502200 Ext: 10641","SI","SI","NO","SI",null,{"$f":"CONCATENATE(D427,\"-\",\"Tipo de información\",\" \",V427,\"-\",F427)","v":"C85512022-Tipo de información -PRESTACION DE SERVICIOS DE PROMOCION Y PREVENCION – VIATICOS_TIQUETES"}]
["PyP","Vicepresidencia de PYP","No","C86012022",93141808,"PRESTACION DE SERVICIOS DE PROMOCION Y PREVENCION – UNIDAD_DE_NEGOCIO_VICE_PYP","24/01/2022",{"$f":"MONTH(G428)","v":1},"31/12/2022",{"$f":"(I428-G428)/30","v":11.366666666666667},"Invitación directa","GastosAdministrativos",256000000,256000000,"No","N/A","Gerencia de Abastecimiento Estratégico\ncontratacion@positiva.gov.co\nPBX: (1)6502200 Ext: 10641","SI","SI","NO","SI",null,{"$f":"CONCATENATE(D428,\"-\",\"Tipo de información\",\" \",V428,\"-\",F428)","v":"C86012022-Tipo de información -PRESTACION DE SERVICIOS DE PROMOCION Y PREVENCION – UNIDAD_DE_NEGOCIO_VICE_PYP"}]
["PyP","Vicepresidencia de PYP","No","C86022022",93141808,"PRESTACION DE SERVICIOS DE PROMOCION Y PREVENCION – UNIDAD_DE_NEGOCIO_VICE_PYP","24/01/2022",{"$f":"MONTH(G429)","v":1},"2022-09-30",{"$f":"(I429-G429)/30","v":8.3000000000000007},"Invitación directa","GastosAdministrativos",5577600,5577600,"No","N/A","Gerencia de Abastecimiento Estratégico\ncontratacion@positiva.gov.co\nPBX: (1)6502200 Ext: 10641","SI","SI","NO","SI",null,{"$f":"CONCATENATE(D429,\"-\",\"Tipo de información\",\" \",V429,\"-\",F429)","v":"C86022022-Tipo de información -PRESTACION DE SERVICIOS DE PROMOCION Y PREVENCION – UNIDAD_DE_NEGOCIO_VICE_PYP"}]
["PyP","Vicepresidencia de PYP","No","C86032022",93141808,"PRESTACION DE SERVICIOS DE PROMOCION Y PREVENCION – UNIDAD_DE_NEGOCIO_VICE_PYP","24/01/2022",{"$f":"MONTH(G430)","v":1},"2022-09-30",{"$f":"(I430-G430)/30","v":8.3000000000000007},"Invitación directa","GastosAdministrativos",11844000,11844000,"No","N/A","Gerencia de Abastecimiento Estratégico\ncontratacion@positiva.gov.co\nPBX: (1)6502200 Ext: 10641","SI","SI","NO","SI",null,{"$f":"CONCATENATE(D430,\"-\",\"Tipo de información\",\" \",V430,\"-\",F430)","v":"C86032022-Tipo de información -PRESTACION DE SERVICIOS DE PROMOCION Y PREVENCION – UNIDAD_DE_NEGOCIO_VICE_PYP"}]
["PyP","Vicepresidencia de PYP","No","C86042022",93141808,"PRESTACION DE SERVICIOS DE PROMOCION Y PREVENCION – UNIDAD_DE_NEGOCIO_VICE_PYP","24/01/2022",{"$f":"MONTH(G431)","v":1},"2022-09-30",{"$f":"(I431-G431)/30","v":8.3000000000000007},"Invitación directa","GastosAdministrativos",6289920,6289920,"No","N/A","Gerencia de Abastecimiento Estratégico\ncontratacion@positiva.gov.co\nPBX: (1)6502200 Ext: 10641","SI","SI","NO","SI",null,{"$f":"CONCATENATE(D431,\"-\",\"Tipo de información\",\" \",V431,\"-\",F431)","v":"C86042022-Tipo de información -PRESTACION DE SERVICIOS DE PROMOCION Y PREVENCION – UNIDAD_DE_NEGOCIO_VICE_PYP"}]
["Financiera y Administrativa","Gcia. Gestión Financiera","No",null,"84111802","Prestación de servicios profesionales de Revisoría Fiscal","2022-04-01",{"$f":"MONTH(G432)","v":4},"2023-03-31",{"$f":"(I432-G432)/30","v":12.133333333333333},"Invitación de Méritos","GastosAdministrativos",589108680,441831510,"SI","En trámite","Gerencia de Abastecimiento Estratégico\ncontratacion@positiva.gov.co\nPBX: (1)6502200 Ext: 10641","SI","NO","NO","SI","Pública clasificada","-Tipo de información Pública clasificada-Prestación de servicios profesionales de Revisoría Fiscal"]
["Financiera y Administrativa","Gcia. Gestión Financiera","No","C55762022",80101500,"Prestación de servicios profesionales especializados para el soporte, acompañamiento y socialización en la implementación de las Normas Internacionales de Información Financiera y sus interpretaciones sobre todas las áreas de impacto en POSITIVA","2022-01-11",{"$f":"MONTH(G433)","v":1},"2022-12-31",{"$f":"(I433-G433)/30","v":11.8},"Invitación directa","GastosAdministrativos",80470284,80470284,"SI","Aprobadas","Gerencia de Abastecimiento Estratégico\ncontratacion@positiva.gov.co\nPBX: (1)6502200 Ext: 10641","SI","NO","NO","SI","Pública clasificada","C55762022-Tipo de información Pública clasificada-Prestación de servicios profesionales especializados para el soporte, acompañamiento y socialización en la implementación de las Normas Internacionales de Información Financiera y sus interpretaciones sobre todas las áreas de impacto en POSITIVA"]
["Financiera y Administrativa","Gcia. Gestión Financiera","No","C55772022",80101500,"Prestación del servicio de acompañamiento tributario integral y permanente (soporte tributario, cumplimiento e información exógena), de conformidad con la normatividad nacional, distrital y municipal para POSITIVA.","2022-01-11",{"$f":"MONTH(G434)","v":1},"2022-12-31",{"$f":"(I434-G434)/30","v":11.8},"Invitación directa","GastosAdministrativos",257040000,257040000,"SI","Aprobadas","Gerencia de Abastecimiento Estratégico\ncontratacion@positiva.gov.co\nPBX: (1)6502200 Ext: 10641","SI","NO","NO","SI","Pública clasificada","C55772022-Tipo de información Pública clasificada-Prestación del servicio de acompañamiento tributario integral y permanente (soporte tributario, cumplimiento e información exógena), de conformidad con la normatividad nacional, distrital y municipal para POSITIVA."]
["Financiera y Administrativa","Gcia. Gestión Financiera","No","C55892022",80101500,"Prestación de servicios - para la calificación de la fortaleza financiera y capacidad de pago de siniestros derivados de la suscripción de pólizas y otras obligaciones contractuales de POSITIVA.","2022-04-10",{"$f":"MONTH(G435)","v":4},"2023-04-09",{"$f":"(I435-G435)/30","v":12.133333333333333},"Invitación directa","GastosAdministrativos",36399176,36399176,"NO",null,"Gerencia de Abastecimiento Estratégico\ncontratacion@positiva.gov.co\nPBX: (1)6502200 Ext: 10641","SI","NO","NO","SI","Pública clasificada","C55892022-Tipo de información Pública clasificada-Prestación de servicios - para la calificación de la fortaleza financiera y capacidad de pago de siniestros derivados de la suscripción de pólizas y otras obligaciones contractuales de POSITIVA."]
["Financiera y Administrativa","Gcia. Gestión Financiera","No",null,81112501,"Prestación de servicios para la renovación de la garantía, soporte y actualizaciones de la licencia adicional del software GaussProfit Edición Advanced.","2022-10-01",{"$f":"MONTH(G436)","v":10},"2023-09-30",{"$f":"(I436-G436)/30","v":12.133333333333333},"Invitación directa","GastosAdministrativos",15257922,15257922,"NO",null,"Gerencia de Abastecimiento Estratégico\ncontratacion@positiva.gov.co\nPBX: (1)6502200 Ext: 10641","SI","NO","NO","SI","Pública clasificada","-Tipo de información Pública clasificada-Prestación de servicios para la renovación de la garantía, soporte y actualizaciones de la licencia adicional del software GaussProfit Edición Advanced."]
["Financiera y Administrativa","Gcia. Gestión Financiera","No",null,80101500,"Prestación de servicios - para la estimación de la prueba de deterioro de la plusvalía (Crédito Mercantil) adquirida de la cesión de activos, pasivos y contratos del negocio de riesgos laborales del Instituto Seguro Social, de conformidad con los lineamientos establecidos en las Normas Internacionales de Información Financiera (NIIF) y la NIC36 - deterioro del valor de los activos ","2022-10-01",{"$f":"MONTH(G437)","v":10},"2022-12-31",{"$f":"(I437-G437)/30","v":3.0333333333333332},"Invitación directa","GastosAdministrativos",47415195,47415195,"NO",null,"Gerencia de Abastecimiento Estratégico\ncontratacion@positiva.gov.co\nPBX: (1)6502200 Ext: 10641","SI","NO","NO","SI","Pública clasificada","-Tipo de información Pública clasificada-Prestación de servicios - para la estimación de la prueba de deterioro de la plusvalía (Crédito Mercantil) adquirida de la cesión de activos, pasivos y contratos del negocio de riesgos laborales del Instituto Seguro Social, de conformidad con los lineamientos establecidos en las Normas Internacionales de Información Financiera (NIIF) y la NIC36 - deterioro del valor de los activos "]
["SECRETARIA GENERAL Y JURÍDICA","GERENCIA DE TALENTO HUMANO","SI","C20252022 -C20642022",81112200,"PRESTACIÓN DE SERVICIOS  Plataforma indicadores de gestión","2021-12-01",{"$f":"MONTH(G438)","v":12},"2022-12-31",{"$f":"(I438-G438)/30","v":13.166666666666666},"Invitación directa","GastosAdministrativos",30286076,{"$f":"M438","v":30286076},"SI","Aprobadas y en ejecución","Gerencia de Abastecimiento Estratégico\ncontratacion@positiva.gov.co\nPBX: (1)6502200 Ext: 10641","NO","NO","SI","NO",{"$f":"IF(U438=\"SI\",\"Pública clasificada\",\"Pública\")","v":"Pública"},{"$f":"CONCATENATE(D438,\"-\",\"Tipo de información\",\" \",V438,\"-\",F438)","v":"C20252022 -C20642022-Tipo de información Pública-PRESTACIÓN DE SERVICIOS  Plataforma indicadores de gestión"}]
["SECRETARIA GENERAL Y JURÍDICA","GERENCIA DE TALENTO HUMANO","SI","C20142022",93141808,"PRESTACIÓN DE SERVICIOS PROCESO DE SST - DME","2022-01-01",{"$f":"MONTH(G439)","v":1},"2022-12-31",{"$f":"(I439-G439)/30","v":12.133333333333333},"Invitación directa","GastosAdministrativos",90100000,{"$f":"M439","v":90100000},"NO",null,"Gerencia de Abastecimiento Estratégico\ncontratacion@positiva.gov.co\nPBX: (1)6502200 Ext: 10641","NO","NO","NO","NO",{"$f":"IF(U439=\"SI\",\"Pública clasificada\",\"Pública\")","v":"Pública"},{"$f":"CONCATENATE(D439,\"-\",\"Tipo de información\",\" \",V439,\"-\",F439)","v":"C20142022-Tipo de información Pública-PRESTACIÓN DE SERVICIOS PROCESO DE SST - DME"}]
["SECRETARIA GENERAL Y JURÍDICA","GERENCIA DE TALENTO HUMANO","SI","C20092022",86101808,"PRESTACIÓN DE SERVICIOS PROCESO DE CAPACITACIÓN DE PERSONAL - COMPETENCIAS TECNICAS","2022-01-01",{"$f":"MONTH(G440)","v":1},"2022-12-31",{"$f":"(I440-G440)/30","v":12.133333333333333},"Invitación directa","GastosAdministrativos",41844000,{"$f":"M440","v":41844000},"NO",null,"Gerencia de Abastecimiento Estratégico\ncontratacion@positiva.gov.co\nPBX: (1)6502200 Ext: 10641","NO","NO","NO","NO",{"$f":"IF(U440=\"SI\",\"Pública clasificada\",\"Pública\")","v":"Pública"},{"$f":"CONCATENATE(D440,\"-\",\"Tipo de información\",\" \",V440,\"-\",F440)","v":"C20092022-Tipo de información Pública-PRESTACIÓN DE SERVICIOS PROCESO DE CAPACITACIÓN DE PERSONAL - COMPETENCIAS TECNICAS"}]
["SECRETARIA GENERAL Y JURÍDICA","GERENCIA DE TALENTO HUMANO","SI","C20672022",80111502,"PRESTACIÓN DE SERVICIOS  Gastos administrativos dotación","2022-01-01",{"$f":"MONTH(G441)","v":1},"2022-12-31",{"$f":"(I441-G441)/30","v":12.133333333333333},"Invitación directa","GastosAdministrativos",4500000,4500000,"NO",null,"Gerencia de Abastecimiento Estratégico\ncontratacion@positiva.gov.co\nPBX: (1)6502200 Ext: 10641","NO","NO","NO","NO",{"$f":"IF(U441=\"SI\",\"Pública clasificada\",\"Pública\")","v":"Pública"},{"$f":"CONCATENATE(D441,\"-\",\"Tipo de información\",\" \",V441,\"-\",F441)","v":"C20672022-Tipo de información Pública-PRESTACIÓN DE SERVICIOS  Gastos administrativos dotación"}]
["SECRETARIA GENERAL Y JURÍDICA","GERENCIA DE TALENTO HUMANO","SI","C20032022 - C20082022 - C20152022","94121505-80141607-93141808-60105610 -80111500 - 80101511","PRESTACIÓN DE SERVICIOS  POSITIVA COMPAÑÍA DE SEGUROS S.A. aliado estratégico ","2022-01-01",{"$f":"MONTH(G442)","v":1},"2022-12-31",{"$f":"(I442-G442)/30","v":12.133333333333333},"Invitación directa","GastosAdministrativos",420000000,{"$f":"M442","v":420000000},"NO",null,"Gerencia de Abastecimiento Estratégico\ncontratacion@positiva.gov.co\nPBX: (1)6502200 Ext: 10641","NO","NO","NO","NO",{"$f":"IF(U442=\"SI\",\"Pública clasificada\",\"Pública\")","v":"Pública"},{"$f":"CONCATENATE(D442,\"-\",\"Tipo de información\",\" \",V442,\"-\",F442)","v":"C20032022 - C20082022 - C20152022-Tipo de información Pública-PRESTACIÓN DE SERVICIOS  POSITIVA COMPAÑÍA DE SEGUROS S.A. aliado estratégico "}]
["SECRETARIA GENERAL Y JURÍDICA","GERENCIA DE TALENTO HUMANO","SI","C20112022",86101808,"PRESTACIÓN DE SERVICIOS PROCESO DE CAPACITACIÓN DE PERSONAL - COMPETENCIAS TECNICAS","2022-01-01",{"$f":"MONTH(G443)","v":1},"2022-12-31",{"$f":"(I443-G443)/30","v":12.133333333333333},"Invitación directa","GastosAdministrativos",10461000,{"$f":"M443","v":10461000},"NO",null,"Gerencia de Abastecimiento Estratégico\ncontratacion@positiva.gov.co\nPBX: (1)6502200 Ext: 10641","NO","NO","NO","NO",{"$f":"IF(U443=\"SI\",\"Pública clasificada\",\"Pública\")","v":"Pública"},{"$f":"CONCATENATE(D443,\"-\",\"Tipo de información\",\" \",V443,\"-\",F443)","v":"C20112022-Tipo de información Pública-PRESTACIÓN DE SERVICIOS PROCESO DE CAPACITACIÓN DE PERSONAL - COMPETENCIAS TECNICAS"}]
["SECRETARIA GENERAL Y JURÍDICA","GERENCIA DE TALENTO HUMANO","SI","C20052022","93141506-86101808","PRESTACIÓN DE SERVICIOS - Riesgo Psicosocial","2022-01-01",{"$f":"MONTH(G444)","v":1},"2022-12-31",{"$f":"(I444-G444)/30","v":12.133333333333333},"Invitación directa","GastosAdministrativos",16000000,{"$f":"M444","v":16000000},"NO",null,"Gerencia de Abastecimiento Estratégico\ncontratacion@positiva.gov.co\nPBX: (1)6502200 Ext: 10641","NO","NO","NO","NO",{"$f":"IF(U444=\"SI\",\"Pública clasificada\",\"Pública\")","v":"Pública"},{"$f":"CONCATENATE(D444,\"-\",\"Tipo de información\",\" \",V444,\"-\",F444)","v":"C20052022-Tipo de información Pública-PRESTACIÓN DE SERVICIOS - Riesgo Psicosocial"}]
["SECRETARIA GENERAL Y JURÍDICA","GERENCIA DE TALENTO HUMANO","SI","C20652022",86101808,"PRESTACIÓN DE SERVICIOS PROCESO DE CAPACITACIÓN DE PERSONAL - COMPETENCIAS TECNICAS","2022-01-01",{"$f":"MONTH(G445)","v":1},"2022-12-31",{"$f":"(I445-G445)/30","v":12.133333333333333},"Invitación directa","GastosAdministrativos",10461000,{"$f":"M445","v":10461000},"NO",null,"Gerencia de Abastecimiento Estratégico\ncontratacion@positiva.gov.co\nPBX: (1)6502200 Ext: 10641","NO","NO","NO","NO",{"$f":"IF(U445=\"SI\",\"Pública clasificada\",\"Pública\")","v":"Pública"},{"$f":"CONCATENATE(D445,\"-\",\"Tipo de información\",\" \",V445,\"-\",F445)","v":"C20652022-Tipo de información Pública-PRESTACIÓN DE SERVICIOS PROCESO DE CAPACITACIÓN DE PERSONAL - COMPETENCIAS TECNICAS"}]
["SECRETARIA GENERAL Y JURÍDICA","GERENCIA DE TALENTO HUMANO","SI","C20012022 - C20062022 - C20122022",93141514,"PRESTACIÓN DE SERVICIOS  Planeación e Implementación de estrategias de mercadeo y comunicaciones, ","2021-12-01",{"$f":"MONTH(G446)","v":12},"2022-03-31",{"$f":"(I446-G446)/30","v":4},"Invitación cerrada","GastosAdministrativos",60786785.766000003,{"$f":"M446","v":60786785.766000003},"SI","Aprobadas y en ejecución","Gerencia de Abastecimiento Estratégico\ncontratacion@positiva.gov.co\nPBX: (1)6502200 Ext: 10641","NO","NO","NO","NO",{"$f":"IF(U446=\"SI\",\"Pública clasificada\",\"Pública\")","v":"Pública"},{"$f":"CONCATENATE(D446,\"-\",\"Tipo de información\",\" \",V446,\"-\",F446)","v":"C20012022 - C20062022 - C20122022-Tipo de información Pública-PRESTACIÓN DE SERVICIOS  Planeación e Implementación de estrategias de mercadeo y comunicaciones, "}]
["SECRETARIA GENERAL Y JURÍDICA","GERENCIA DE TALENTO HUMANO","SI","C20022022 - C20072022 - C20132022","80111500 - 80101511","PRESTACIÓN DE SERVICIOS  Planeación e Implementación de estrategias de mercadeo y comunicaciones, ","2022-01-01",{"$f":"MONTH(G447)","v":1},"2022-12-31",{"$f":"(I447-G447)/30","v":12.133333333333333},"Invitación cerrada","GastosAdministrativos",206000000,{"$f":"M447","v":206000000},"NO",null,"Gerencia de Abastecimiento Estratégico\ncontratacion@positiva.gov.co\nPBX: (1)6502200 Ext: 10641","NO","NO","NO","NO",{"$f":"IF(U447=\"SI\",\"Pública clasificada\",\"Pública\")","v":"Pública"},{"$f":"CONCATENATE(D447,\"-\",\"Tipo de información\",\" \",V447,\"-\",F447)","v":"C20022022 - C20072022 - C20132022-Tipo de información Pública-PRESTACIÓN DE SERVICIOS  Planeación e Implementación de estrategias de mercadeo y comunicaciones, "}]
["SECRETARIA GENERAL Y JURÍDICA","GERENCIA DE TALENTO HUMANO","SI","C20272022",80111502,"PRESTACIÓN DE SERVICIOS  plataforma de incentivos","2022-01-01",{"$f":"MONTH(G448)","v":1},"2022-12-31",{"$f":"(I448-G448)/30","v":12.133333333333333},"Invitación directa","GastosAdministrativos",112045526,{"$f":"M448","v":112045526},"NO",null,"Gerencia de Abastecimiento Estratégico\ncontratacion@positiva.gov.co\nPBX: (1)6502200 Ext: 10641","NO","NO","NO","NO",{"$f":"IF(U448=\"SI\",\"Pública clasificada\",\"Pública\")","v":"Pública"},{"$f":"CONCATENATE(D448,\"-\",\"Tipo de información\",\" \",V448,\"-\",F448)","v":"C20272022-Tipo de información Pública-PRESTACIÓN DE SERVICIOS  plataforma de incentivos"}]
["SECRETARIA GENERAL Y JURÍDICA","GERENCIA DE TALENTO HUMANO","SI","C20042022-C20282022","80111500 - 80101511","PRESTACIÓN DE SERVICIOS - Great place to work","2022-01-01",{"$f":"MONTH(G449)","v":1},"2022-12-31",{"$f":"(I449-G449)/30","v":12.133333333333333},"Invitación directa","GastosAdministrativos",160000000,160000000,"NO",null,"Gerencia de Abastecimiento Estratégico\ncontratacion@positiva.gov.co\nPBX: (1)6502200 Ext: 10641","NO","NO","NO","NO",{"$f":"IF(U449=\"SI\",\"Pública clasificada\",\"Pública\")","v":"Pública"},{"$f":"CONCATENATE(D449,\"-\",\"Tipo de información\",\" \",V449,\"-\",F449)","v":"C20042022-C20282022-Tipo de información Pública-PRESTACIÓN DE SERVICIOS - Great place to work"}]
["SECRETARIA GENERAL Y JURÍDICA","GERENCIA DE TALENTO HUMANO","SI","C20292022",80111606,"PRESTACIÓN DE SERVICIOS  Selección de personal","2021-12-01",{"$f":"MONTH(G450)","v":12},"2022-12-31",{"$f":"(I450-G450)/30","v":13.166666666666666},"Invitación directa","GastosAdministrativos",127264764,{"$f":"M450","v":127264764},"SI","Aprobadas y en ejecución","Gerencia de Abastecimiento Estratégico\ncontratacion@positiva.gov.co\nPBX: (1)6502200 Ext: 10641","NO","NO","NO","NO",{"$f":"IF(U450=\"SI\",\"Pública clasificada\",\"Pública\")","v":"Pública"},{"$f":"CONCATENATE(D450,\"-\",\"Tipo de información\",\" \",V450,\"-\",F450)","v":"C20292022-Tipo de información Pública-PRESTACIÓN DE SERVICIOS  Selección de personal"}]
["SECRETARIA GENERAL Y JURÍDICA","GERENCIA DE TALENTO HUMANO","SI","C20312022",84111505,"PRESTACIÓN DE SERVICIOS  Administración nómina","2021-12-01",{"$f":"MONTH(G451)","v":12},"2022-12-31",{"$f":"(I451-G451)/30","v":13.166666666666666},"Invitación directa","GastosAdministrativos",356508739,{"$f":"M451","v":356508739},"SI","Aprobadas y en ejecución","Gerencia de Abastecimiento Estratégico\ncontratacion@positiva.gov.co\nPBX: (1)6502200 Ext: 10641","NO","NO","SI","NO",{"$f":"IF(U451=\"SI\",\"Pública clasificada\",\"Pública\")","v":"Pública"},{"$f":"CONCATENATE(D451,\"-\",\"Tipo de información\",\" \",V451,\"-\",F451)","v":"C20312022-Tipo de información Pública-PRESTACIÓN DE SERVICIOS  Administración nómina"}]
["SECRETARIA GENERAL Y JURÍDICA","GERENCIA DE TALENTO HUMANO","SI","C20362022",80111509,"PRESTACIÓN DE SERVICIOS - Soporte y mantenimiento plataforma cargas laborales","2022-01-01",{"$f":"MONTH(G452)","v":1},"2022-12-31",{"$f":"(I452-G452)/30","v":12.133333333333333},"Invitación directa","GastosAdministrativos",137085063,{"$f":"M452","v":137085063},"NO",null,"Gerencia de Abastecimiento Estratégico\ncontratacion@positiva.gov.co\nPBX: (1)6502200 Ext: 10641","NO","NO","NO","NO",{"$f":"IF(U452=\"SI\",\"Pública clasificada\",\"Pública\")","v":"Pública"},{"$f":"CONCATENATE(D452,\"-\",\"Tipo de información\",\" \",V452,\"-\",F452)","v":"C20362022-Tipo de información Pública-PRESTACIÓN DE SERVICIOS - Soporte y mantenimiento plataforma cargas laborales"}]
["SECRETARIA GENERAL Y JURÍDICA","GERENCIA DE TALENTO HUMANO","SI","C20162022","46182200-93141808","PRESTACIÓN DE SERVICIOS PROCESO DE SST - DEA NIVEL SUCUSAL","2022-01-01",{"$f":"MONTH(G453)","v":1},"2022-12-31",{"$f":"(I453-G453)/30","v":12.133333333333333},"Invitación directa","GastosAdministrativos",41044400,{"$f":"M453","v":41044400},"NO",null,"Gerencia de Abastecimiento Estratégico\ncontratacion@positiva.gov.co\nPBX: (1)6502200 Ext: 10641","NO","NO","NO","NO",{"$f":"IF(U453=\"SI\",\"Pública clasificada\",\"Pública\")","v":"Pública"},{"$f":"CONCATENATE(D453,\"-\",\"Tipo de información\",\" \",V453,\"-\",F453)","v":"C20162022-Tipo de información Pública-PRESTACIÓN DE SERVICIOS PROCESO DE SST - DEA NIVEL SUCUSAL"}]
["SECRETARIA GENERAL Y JURÍDICA","GERENCIA DE TALENTO HUMANO","SI","C20172022",93141808,"PRESTACIÓN DE SERVICIOS PROCESO DE SISTEMA DE SEGURIDAD Y SALUD EN EL TRABAJO - Examenes de salud ocupacional","2021-12-01",{"$f":"MONTH(G454)","v":12},"2022-12-31",{"$f":"(I454-G454)/30","v":13.166666666666666},"Invitación directa","GastosAdministrativos",55000000,{"$f":"M454","v":55000000},"SI","Aprobadas y en ejecución","Gerencia de Abastecimiento Estratégico\ncontratacion@positiva.gov.co\nPBX: (1)6502200 Ext: 10641","NO","NO","NO","NO",{"$f":"IF(U454=\"SI\",\"Pública clasificada\",\"Pública\")","v":"Pública"},{"$f":"CONCATENATE(D454,\"-\",\"Tipo de información\",\" \",V454,\"-\",F454)","v":"C20172022-Tipo de información Pública-PRESTACIÓN DE SERVICIOS PROCESO DE SISTEMA DE SEGURIDAD Y SALUD EN EL TRABAJO - Examenes de salud ocupacional"}]
["SECRETARIA GENERAL Y JURÍDICA","GERENCIA DE TALENTO HUMANO","SI","C20182022",93141808,"PRESTACIÓN DE SERVICIOS PROCESO DE SST -SISTEMA DE GESTIÓN Y ATENCIÓN DE EMERGENCIAS","2022-01-01",{"$f":"MONTH(G455)","v":1},"2022-12-31",{"$f":"(I455-G455)/30","v":12.133333333333333},"Invitación directa","GastosAdministrativos",50000000,{"$f":"M455","v":50000000},"NO",null,"Gerencia de Abastecimiento Estratégico\ncontratacion@positiva.gov.co\nPBX: (1)6502200 Ext: 10641","NO","NO","NO","NO",{"$f":"IF(U455=\"SI\",\"Pública clasificada\",\"Pública\")","v":"Pública"},{"$f":"CONCATENATE(D455,\"-\",\"Tipo de información\",\" \",V455,\"-\",F455)","v":"C20182022-Tipo de información Pública-PRESTACIÓN DE SERVICIOS PROCESO DE SST -SISTEMA DE GESTIÓN Y ATENCIÓN DE EMERGENCIAS"}]
["SECRETARIA GENERAL Y JURÍDICA","GERENCIA DE TALENTO HUMANO","SI","C20202022","46182200-93141808","PRESTACIÓN DE SERVICIOS PROCESO DE SST - BOTIQUINES","2022-01-01",{"$f":"MONTH(G456)","v":1},"2022-12-31",{"$f":"(I456-G456)/30","v":12.133333333333333},"Invitación directa","GastosAdministrativos",20966400,{"$f":"M456","v":20966400},"NO",null,"Gerencia de Abastecimiento Estratégico\ncontratacion@positiva.gov.co\nPBX: (1)6502200 Ext: 10641","NO","NO","NO","NO",{"$f":"IF(U456=\"SI\",\"Pública clasificada\",\"Pública\")","v":"Pública"},{"$f":"CONCATENATE(D456,\"-\",\"Tipo de información\",\" \",V456,\"-\",F456)","v":"C20202022-Tipo de información Pública-PRESTACIÓN DE SERVICIOS PROCESO DE SST - BOTIQUINES"}]
["SECRETARIA GENERAL Y JURÍDICA","GERENCIA DE TALENTO HUMANO","SI","C20212022","46182200-93141808","PRESTACIÓN DE SERVICIOS PROCESO DE SST - EPP","2022-01-01",{"$f":"MONTH(G457)","v":1},"2022-12-31",{"$f":"(I457-G457)/30","v":12.133333333333333},"Invitación directa","GastosAdministrativos",17935680,{"$f":"M457","v":17935680},"NO",null,"Gerencia de Abastecimiento Estratégico\ncontratacion@positiva.gov.co\nPBX: (1)6502200 Ext: 10641","NO","NO","NO","NO",{"$f":"IF(U457=\"SI\",\"Pública clasificada\",\"Pública\")","v":"Pública"},{"$f":"CONCATENATE(D457,\"-\",\"Tipo de información\",\" \",V457,\"-\",F457)","v":"C20212022-Tipo de información Pública-PRESTACIÓN DE SERVICIOS PROCESO DE SST - EPP"}]
["SECRETARIA GENERAL Y JURÍDICA","GERENCIA DE TALENTO HUMANO","SI","C20222022",93141808,"PRESTACIÓN DE SERVICIOS PROCESO DE SST PARA LA ATENCIÓN DE LA EMERGENCIA SANITARIA","2022-01-01",{"$f":"MONTH(G458)","v":1},"2022-12-31",{"$f":"(I458-G458)/30","v":12.133333333333333},"Invitación directa","GastosAdministrativos",12453520,{"$f":"M458","v":12453520},"NO",null,"Gerencia de Abastecimiento Estratégico\ncontratacion@positiva.gov.co\nPBX: (1)6502200 Ext: 10641","NO","NO","NO","NO",{"$f":"IF(U458=\"SI\",\"Pública clasificada\",\"Pública\")","v":"Pública"},{"$f":"CONCATENATE(D458,\"-\",\"Tipo de información\",\" \",V458,\"-\",F458)","v":"C20222022-Tipo de información Pública-PRESTACIÓN DE SERVICIOS PROCESO DE SST PARA LA ATENCIÓN DE LA EMERGENCIA SANITARIA"}]
["SECRETARIA GENERAL Y JURÍDICA","GERENCIA DE TALENTO HUMANO","SI","C20232022",93141808,"PRESTACIÓN DE SERVICIOS PROCESO DE SST - PROGRAMA DE HABITOS SALUDABLES","2022-01-01",{"$f":"MONTH(G459)","v":1},"2022-12-31",{"$f":"(I459-G459)/30","v":12.133333333333333},"Invitación directa","GastosAdministrativos",140000000,{"$f":"M459","v":140000000},"NO",null,"Gerencia de Abastecimiento Estratégico\ncontratacion@positiva.gov.co\nPBX: (1)6502200 Ext: 10641","NO","NO","NO","NO",{"$f":"IF(U459=\"SI\",\"Pública clasificada\",\"Pública\")","v":"Pública"},{"$f":"CONCATENATE(D459,\"-\",\"Tipo de información\",\" \",V459,\"-\",F459)","v":"C20232022-Tipo de información Pública-PRESTACIÓN DE SERVICIOS PROCESO DE SST - PROGRAMA DE HABITOS SALUDABLES"}]
["SECRETARIA GENERAL Y JURÍDICA","GERENCIA DE TALENTO HUMANO","SI","C20262022",44103100,"PRESTACIÓN DE SERVICIOS  proceso de carnetización. ","2022-01-01",{"$f":"MONTH(G460)","v":1},"2022-03-31",{"$f":"(I460-G460)/30","v":2.9666666666666668},"Invitación directa","GastosAdministrativos",7692528.7790999999,{"$f":"M460","v":7692528.7790999999},"NO",null,"Gerencia de Abastecimiento Estratégico\ncontratacion@positiva.gov.co\nPBX: (1)6502200 Ext: 10641","NO","NO","NO","NO",{"$f":"IF(U460=\"SI\",\"Pública clasificada\",\"Pública\")","v":"Pública"},{"$f":"CONCATENATE(D460,\"-\",\"Tipo de información\",\" \",V460,\"-\",F460)","v":"C20262022-Tipo de información Pública-PRESTACIÓN DE SERVICIOS  proceso de carnetización. "}]
["SECRETARIA GENERAL Y JURÍDICA","GERENCIA DE TALENTO HUMANO","NO","C20662022",86101808,"PRESTACIÓN DE SERVICIOS PROCESO DE CAPACITACIÓN DE PERSONAL TRANSFORMACION DIGITAL","2022-07-01",{"$f":"MONTH(G461)","v":7},"2022-12-31",{"$f":"(I461-G461)/30","v":6.1},"Invitación directa","GastosAdministrativos",57673290,{"$f":"M461","v":57673290},"NO",null,"Gerencia de Abastecimiento Estratégico\ncontratacion@positiva.gov.co\nPBX: (1)6502200 Ext: 10641","NO","NO","NO","NO",{"$f":"IF(U461=\"SI\",\"Pública clasificada\",\"Pública\")","v":"Pública"},{"$f":"CONCATENATE(D461,\"-\",\"Tipo de información\",\" \",V461,\"-\",F461)","v":"C20662022-Tipo de información Pública-PRESTACIÓN DE SERVICIOS PROCESO DE CAPACITACIÓN DE PERSONAL TRANSFORMACION DIGITAL"}]
["SECRETARIA GENERAL Y JURÍDICA","GERENCIA DE TALENTO HUMANO","NO","C20692022",86101808,"PRESTACIÓN DE SERVICIOS PLAN DE CAPACITACIÓN DE PERSONAL","2022-07-01",{"$f":"MONTH(G462)","v":7},"2022-12-31",{"$f":"(I462-G462)/30","v":6.1},"Invitación directa","GastosAdministrativos",23740000,{"$f":"M462","v":23740000},"NO",null,"Gerencia de Abastecimiento Estratégico\ncontratacion@positiva.gov.co\nPBX: (1)6502200 Ext: 10641","NO","NO","NO","NO",{"$f":"IF(U462=\"SI\",\"Pública clasificada\",\"Pública\")","v":"Pública"},{"$f":"CONCATENATE(D462,\"-\",\"Tipo de información\",\" \",V462,\"-\",F462)","v":"C20692022-Tipo de información Pública-PRESTACIÓN DE SERVICIOS PLAN DE CAPACITACIÓN DE PERSONAL"}]
["SECRETARIA GENERAL Y JURÍDICA","GERENCIA DE TALENTO HUMANO","SI","C20102022",86101808,"PRESTACIÓN DE SERVICIOS PROCESO DE CAPACITACIÓN DE PERSONAL Y GESTIÓN DE CONOCIMIENTO","2022-01-01",{"$f":"MONTH(G463)","v":1},"2022-12-31",{"$f":"(I463-G463)/30","v":12.133333333333333},"Invitación directa","GastosAdministrativos",394700000,{"$f":"M463","v":394700000},"NO",null,"Gerencia de Abastecimiento Estratégico\ncontratacion@positiva.gov.co\nPBX: (1)6502200 Ext: 10641","NO","NO","NO","NO",{"$f":"IF(U463=\"SI\",\"Pública clasificada\",\"Pública\")","v":"Pública"},{"$f":"CONCATENATE(D463,\"-\",\"Tipo de información\",\" \",V463,\"-\",F463)","v":"C20102022-Tipo de información Pública-PRESTACIÓN DE SERVICIOS PROCESO DE CAPACITACIÓN DE PERSONAL Y GESTIÓN DE CONOCIMIENTO"}]
["SECRETARIA GENERAL Y JURÍDICA","GERENCIA DE TALENTO HUMANO","SI","C20322022",80111607,"PRESTACIÓN DE SERVICIOS- Servicios jurídicos especializados, conceptualizando (verbal y/o escrito) en temas de derecho y relaciones laborales colectivas e individuales.","2022-01-01",{"$f":"MONTH(G464)","v":1},"2022-12-31",{"$f":"(I464-G464)/30","v":12.133333333333333},"Invitación directa","GastosAdministrativos",84510400,{"$f":"M464","v":84510400},"NO",null,"Gerencia de Abastecimiento Estratégico\ncontratacion@positiva.gov.co\nPBX: (1)6502200 Ext: 10641","NO","NO","NO","NO",{"$f":"IF(U464=\"SI\",\"Pública clasificada\",\"Pública\")","v":"Pública"},{"$f":"CONCATENATE(D464,\"-\",\"Tipo de información\",\" \",V464,\"-\",F464)","v":"C20322022-Tipo de información Pública-PRESTACIÓN DE SERVICIOS- Servicios jurídicos especializados, conceptualizando (verbal y/o escrito) en temas de derecho y relaciones laborales colectivas e individuales."}]
["VICEPRESIDENCIA TÉCNICA","Gerencia de Actuaría","NO","C65012022",80101504,"Prestación de servicios: Prestación de servicios profesionales especializados con una persona jurídica para dar cumplimiento con lo ordenado en la Circular Externa 022 de 2015 de la Superintendencia Financiera de Colombia relacionado con el rol del actuario responsable respecto a la certificación de suficiencia de las reservas técnicas de Positiva Compañía de Seguros S.A., frente a los requisitos exigidos en la Circular Externa 045 de 2016 y demás normas que la modifiquen, así como la atención de las instrucciones y requerimientos que sean impartidos por la Superintendencia Financiera de Colombia.","2022-02-01",{"$f":"MONTH(G465)","v":2},"2023-01-31",{"$f":"(I465-G465)/30","v":12.133333333333333},"Invitación directa","GastosAdministrativos",303414540,278129995,"SI","Aprobada","Gerencia de Abastecimiento Estratégico\ncontratacion@positiva.gov.co\nPBX: (1)6502200 Ext: 10641","SI","SI","NO","SI",{"$f":"IF(U465=\"SI\",\"Pública clasificada\",\"Pública\")","v":"Pública clasificada"},{"$f":"CONCATENATE(D465,\"-\",\"Tipo de información\",\" \",V465,\"-\",F465)","v":"C65012022-Tipo de información Pública clasificada-Prestación de servicios: Prestación de servicios profesionales especializados con una persona jurídica para dar cumplimiento con lo ordenado en la Circular Externa 022 de 2015 de la Superintendencia Financiera de Colombia relacionado con el rol del actuario responsable respecto a la certificación de suficiencia de las reservas técnicas de Positiva Compañía de Seguros S.A., frente a los requisitos exigidos en la Circular Externa 045 de 2016 y demás normas que la modifiquen, así como la atención de las instrucciones y requerimientos que sean impartidos por la Superintendencia Financiera de Colombia."}]
["VICEPRESIDENCIA TÉCNICA","Gerencia Médica","NO","C65052022",43231500,"Prestación de servicios: Prestar servicios de  asesoría, apoyo y acompañamiento en los  tramites precontractuales, contractuales y postcontractuales de los procesos a realizar por la Compañía al grupo de servicios definidos por la Vicepresidencia Técnica y la \nGerencia Medica referentes a la atención integral del siniestro de Positiva  Compañía de Seguros","2022-01-01",{"$f":"MONTH(G466)","v":1},"2022-06-30",{"$f":"(I466-G466)/30","v":6},"Invitación directa","GastosAdministrativos",188345838,188345838,"SI","Aprobada","Gerencia de Abastecimiento Estratégico\ncontratacion@positiva.gov.co\nPBX: (1)6502200 Ext: 10641","SI","SI","NO","SI",{"$f":"IF(U466=\"SI\",\"Pública clasificada\",\"Pública\")","v":"Pública clasificada"},{"$f":"CONCATENATE(D466,\"-\",\"Tipo de información\",\" \",V466,\"-\",F466)","v":"C65052022-Tipo de información Pública clasificada-Prestación de servicios: Prestar servicios de  asesoría, apoyo y acompañamiento en los  tramites precontractuales, contractuales y postcontractuales de los procesos a realizar por la Compañía al grupo de servicios definidos por la Vicepresidencia Técnica y la \nGerencia Medica referentes a la atención integral del siniestro de Positiva  Compañía de Seguros"}]
["VICEPRESIDENCIA TÉCNICA","Gerencia Médica","NO","C65062022",43231500,"Prestación de servicios: Prestar los servicios profesionales para gestionar los trámites precontractuales y contractuales de los procesos a realizar por la Vicepresidencia Técnica y la Gerencia Medica referentes a la red de prestadores de servicios de salud en el subproceso de Planeación del Modelo de atención integral del siniestro de POSITIVA","2022-01-01",{"$f":"MONTH(G467)","v":1},"2022-12-31",{"$f":"(I467-G467)/30","v":12.133333333333333},"Invitación directa","GastosAdministrativos",104318400,104318400,"SI","Aprobada","Gerencia de Abastecimiento Estratégico\ncontratacion@positiva.gov.co\nPBX: (1)6502200 Ext: 10641","SI","SI","NO","SI",{"$f":"IF(U467=\"SI\",\"Pública clasificada\",\"Pública\")","v":"Pública clasificada"},{"$f":"CONCATENATE(D467,\"-\",\"Tipo de información\",\" \",V467,\"-\",F467)","v":"C65062022-Tipo de información Pública clasificada-Prestación de servicios: Prestar los servicios profesionales para gestionar los trámites precontractuales y contractuales de los procesos a realizar por la Vicepresidencia Técnica y la Gerencia Medica referentes a la red de prestadores de servicios de salud en el subproceso de Planeación del Modelo de atención integral del siniestro de POSITIVA"}]
["VICEPRESIDENCIA TÉCNICA","Gerencia Médica","NO","C65072022",43231500,"Prestación de servicios: El CONTRATISTA se obliga con POSITIVA a prestar los servicios Técnicos, realizando el acompañamiento y apoyo en las actividades administrativas relacionados con los trámites precontractuales, contractuales y pos contractuales de los procesos referentes a la red de prestadores de servicios de salud en el sub proceso de planeación del modelo de atención integral del siniestro de Positiva Compañía de Seguros","2022-01-01",{"$f":"MONTH(G468)","v":1},"2022-08-31",{"$f":"(I468-G468)/30","v":8.0666666666666664},"Invitación directa","GastosAdministrativos",26839200,26839200,"SI","Aprobada","Gerencia de Abastecimiento Estratégico\ncontratacion@positiva.gov.co\nPBX: (1)6502200 Ext: 10641","SI","SI","NO","SI",{"$f":"IF(U468=\"SI\",\"Pública clasificada\",\"Pública\")","v":"Pública clasificada"},{"$f":"CONCATENATE(D468,\"-\",\"Tipo de información\",\" \",V468,\"-\",F468)","v":"C65072022-Tipo de información Pública clasificada-Prestación de servicios: El CONTRATISTA se obliga con POSITIVA a prestar los servicios Técnicos, realizando el acompañamiento y apoyo en las actividades administrativas relacionados con los trámites precontractuales, contractuales y pos contractuales de los procesos referentes a la red de prestadores de servicios de salud en el sub proceso de planeación del modelo de atención integral del siniestro de Positiva Compañía de Seguros"}]
["VICEPRESIDENCIA TÉCNICA","Gerencia Médica","NO","C65082022",43231500,"Prestación de servicios: El CONTRATISTA se obliga con POSITIVA a prestar los servicios Técnicos, realizando el acompañamiento y apoyo en las actividades administrativas relacionados con los trámites precontractuales, contractuales y pos contractuales de los procesos referentes a la red de prestadores de servicios de salud en el sub proceso de planeación del modelo de atención integral del siniestro de Positiva Compañía de Seguros S.A.","2022-01-01",{"$f":"MONTH(G469)","v":1},"2022-08-31",{"$f":"(I469-G469)/30","v":8.0666666666666664},"Invitación directa","GastosAdministrativos",26839200,26839200,"NO",null,"Gerencia de Abastecimiento Estratégico\ncontratacion@positiva.gov.co\nPBX: (1)6502200 Ext: 10641","SI","SI","NO","SI",{"$f":"IF(U469=\"SI\",\"Pública clasificada\",\"Pública\")","v":"Pública clasificada"},{"$f":"CONCATENATE(D469,\"-\",\"Tipo de información\",\" \",V469,\"-\",F469)","v":"C65082022-Tipo de información Pública clasificada-Prestación de servicios: El CONTRATISTA se obliga con POSITIVA a prestar los servicios Técnicos, realizando el acompañamiento y apoyo en las actividades administrativas relacionados con los trámites precontractuales, contractuales y pos contractuales de los procesos referentes a la red de prestadores de servicios de salud en el sub proceso de planeación del modelo de atención integral del siniestro de Positiva Compañía de Seguros S.A."}]
["VICEPRESIDENCIA TÉCNICA","Gerencia de Indemnizaciones","NO","C65092022",92121604,"Prestación de servicios: Prestación de los servicio de estudio de confiabilidad para conocimiento del cliente de todas entidades, Cooperativas, financieras  y demás que deseen aplicar libranzas o descuentos a la nómina de pensionados, donde se garantice la validación de la información corporativa, se verifique la documentación aportada, se compruebe el entorno de cada operador; generando informe con concepto final; para que Positiva pueda definir la asignación  o renovación de código de descuento al operador solicitante.","2022-09-01",{"$f":"MONTH(G470)","v":9},"2022-12-31",{"$f":"(I470-G470)/30","v":4.0333333333333332},"Invitación directa","GastosAdministrativos",40000000,40000000,"NO",null,"Gerencia de Abastecimiento Estratégico\ncontratacion@positiva.gov.co\nPBX: (1)6502200 Ext: 10641","SI","SI","NO","SI",{"$f":"IF(U470=\"SI\",\"Pública clasificada\",\"Pública\")","v":"Pública clasificada"},{"$f":"CONCATENATE(D470,\"-\",\"Tipo de información\",\" \",V470,\"-\",F470)","v":"C65092022-Tipo de información Pública clasificada-Prestación de servicios: Prestación de los servicio de estudio de confiabilidad para conocimiento del cliente de todas entidades, Cooperativas, financieras  y demás que deseen aplicar libranzas o descuentos a la nómina de pensionados, donde se garantice la validación de la información corporativa, se verifique la documentación aportada, se compruebe el entorno de cada operador; generando informe con concepto final; para que Positiva pueda definir la asignación  o renovación de código de descuento al operador solicitante."}]
["VICEPRESIDENCIA TÉCNICA","Gerencia de Indemnizaciones","NO","C65102022",43231500,"Prestación de servicios: EL CONTRATISTA, se compromete con POSITIVA, prestación de servicio administración, soporte y mantenimiento, de portal administrador de libranzas Sygnus, el cual incluye, Servicio de Soporte Funcional y Tecnológico de software, Servicio de mantenimiento de software y todos los desarrollos necesarios para la adaptación del portal a los Sistemas de Información utilizados por POSITIVA. El portal administrador de libranzas Sygnus deberá administrar todas las operaciones de libranzas de la nómina de pensionados de POSITIVA.\nPARÁGRAFO PRIMERO: Para mayor ilustración y definición de los términos de la presente Aceptación de Oferta, se entiende que la justificación, los estudios previos y la oferta presentada por EL CONTRATISTA, junto con los documentos aportados, hacen parte integral de la presente Aceptación de Oferta.\nPARÁGRAFO SEGUNDO: EL CONTRATISTA deberá obrar con absoluta lealtad y honradez en su relación con POSITIVA y atender con celosa diligencia los encargos que por esta Aceptación de Oferta se le confieran. De igual manera, deberá mantener permanentemente informada a POSITIVA., del desarrollo de la presente Aceptación de Oferta.","2022-07-08",{"$f":"MONTH(G471)","v":7},"2023-07-07",{"$f":"(I471-G471)/30","v":12.133333333333333},"Invitación directa",null,0,0,"NO",null,"Gerencia de Abastecimiento Estratégico\ncontratacion@positiva.gov.co\nPBX: (1)6502200 Ext: 10641","SI","SI","NO","SI",{"$f":"IF(U471=\"SI\",\"Pública clasificada\",\"Pública\")","v":"Pública clasificada"},{"$f":"CONCATENATE(D471,\"-\",\"Tipo de información\",\" \",V471,\"-\",F471)","v":"C65102022-Tipo de información Pública clasificada-Prestación de servicios: EL CONTRATISTA, se compromete con POSITIVA, prestación de servicio administración, soporte y mantenimiento, de portal administrador de libranzas Sygnus, el cual incluye, Servicio de Soporte Funcional y Tecnológico de software, Servicio de mantenimiento de software y todos los desarrollos necesarios para la adaptación del portal a los Sistemas de Información utilizados por POSITIVA. El portal administrador de libranzas Sygnus deberá administrar todas las operaciones de libranzas de la nómina de pensionados de POSITIVA.\nPARÁGRAFO PRIMERO: Para mayor ilustración y definición de los términos de la presente Aceptación de Oferta, se entiende que la justificación, los estudios previos y la oferta presentada por EL CONTRATISTA, junto con los documentos aportados, hacen parte integral de la presente Aceptación de Oferta.\nPARÁGRAFO SEGUNDO: EL CONTRATISTA deberá obrar con absoluta lealtad y honradez en su relación con POSITIVA y atender con celosa diligencia los encargos que por esta Aceptación de Oferta se le confieran. De igual manera, deberá mantener permanentemente informada a POSITIVA., del desarrollo de la presente Aceptación de Oferta."}]
["VICEPRESIDENCIA TÉCNICA","Gerencia Técnica de Vida","NO","C65112022",83111505,"Prestación de servicios: Prestar los servicios profesionales jurídicos encaminados a soportar el ofrecimiento del producto Renta Vitalicia Inmobiliaria y asesorar al cliente en los trámites precontractuales, contractuales y postcontractuales de los procesos a realizar por la Vicepresidencia Técnica y la Gerencia Técnica de Vida referentes a la cotización y contratación de pólizas del seguro citado, enmarcados en el proceso de Gestión del Cliente/Gestión de Producción/Emisión de Positiva Compañía de Seguros S.A.","2022-02-01",{"$f":"MONTH(G472)","v":2},"2022-12-31",{"$f":"(I472-G472)/30","v":11.1},"Invitación directa","GastosAdministrativos",88000000,88000000,"NO",null,"Gerencia de Abastecimiento Estratégico\ncontratacion@positiva.gov.co\nPBX: (1)6502200 Ext: 10641","SI","SI","NO","SI",{"$f":"IF(U472=\"SI\",\"Pública clasificada\",\"Pública\")","v":"Pública clasificada"},{"$f":"CONCATENATE(D472,\"-\",\"Tipo de información\",\" \",V472,\"-\",F472)","v":"C65112022-Tipo de información Pública clasificada-Prestación de servicios: Prestar los servicios profesionales jurídicos encaminados a soportar el ofrecimiento del producto Renta Vitalicia Inmobiliaria y asesorar al cliente en los trámites precontractuales, contractuales y postcontractuales de los procesos a realizar por la Vicepresidencia Técnica y la Gerencia Técnica de Vida referentes a la cotización y contratación de pólizas del seguro citado, enmarcados en el proceso de Gestión del Cliente/Gestión de Producción/Emisión de Positiva Compañía de Seguros S.A."}]
["VICEPRESIDENCIA TÉCNICA","Vicepresidencia Técnica","NO","C65122022",80111701,"Prestación de servicios: EL CONTRATISTA, se compromete con POSITIVA, a prestar los servicios requeridos por la Vicepresidencia Técnica de POSITIVA, para dar respuesta a las peticiones, quejas, reclamos, solicitudes y derechos de petición que se interpongan para los diferentes ramos de la Compañía; Riesgos Laborales, Salud, y Vida entre otros, así como el apoyo técnico en la respuesta y cumplimiento de tutelas, soporte para respuesta a requerimientos jurídicos, servicios de peritaje, revisión y argumentación frente a dictámenes de calificación emitidos por otras entidades, acompañado lo anterior del seguimiento periódico permanente a los casos que lo ameriten de acuerdo a los criterios que establezca la Compañía","2022-02-01",{"$f":"MONTH(G473)","v":2},"2023-02-01",{"$f":"(I473-G473)/30","v":12.166666666666666},"Invitación directa","CargoAReserva",0,0,"NO",null,"Gerencia de Abastecimiento Estratégico\ncontratacion@positiva.gov.co\nPBX: (1)6502200 Ext: 10641","SI","SI","NO","SI",{"$f":"IF(U473=\"SI\",\"Pública clasificada\",\"Pública\")","v":"Pública clasificada"},{"$f":"CONCATENATE(D473,\"-\",\"Tipo de información\",\" \",V473,\"-\",F473)","v":"C65122022-Tipo de información Pública clasificada-Prestación de servicios: EL CONTRATISTA, se compromete con POSITIVA, a prestar los servicios requeridos por la Vicepresidencia Técnica de POSITIVA, para dar respuesta a las peticiones, quejas, reclamos, solicitudes y derechos de petición que se interpongan para los diferentes ramos de la Compañía; Riesgos Laborales, Salud, y Vida entre otros, así como el apoyo técnico en la respuesta y cumplimiento de tutelas, soporte para respuesta a requerimientos jurídicos, servicios de peritaje, revisión y argumentación frente a dictámenes de calificación emitidos por otras entidades, acompañado lo anterior del seguimiento periódico permanente a los casos que lo ameriten de acuerdo a los criterios que establezca la Compañía"}]
["VICEPRESIDENCIA TÉCNICA","Gerencia Médica","NO","C65132022",86101806,"Prestación de servicios: Prestar los servicios de diseño, desarrollo y virtualización de contenidos educativos, capacitación y acompañamiento a las personas inscritas que atienden la población asegurada para la atención integral de siniestros. ","2022-07-01",{"$f":"MONTH(G474)","v":7},"2022-12-31",{"$f":"(I474-G474)/30","v":6.1},"Invitación directa","GastosAdministrativos",140000000,140000000,"NO",null,"Gerencia de Abastecimiento Estratégico\ncontratacion@positiva.gov.co\nPBX: (1)6502200 Ext: 10641","SI","SI","NO","SI",{"$f":"IF(U474=\"SI\",\"Pública clasificada\",\"Pública\")","v":"Pública clasificada"},{"$f":"CONCATENATE(D474,\"-\",\"Tipo de información\",\" \",V474,\"-\",F474)","v":"C65132022-Tipo de información Pública clasificada-Prestación de servicios: Prestar los servicios de diseño, desarrollo y virtualización de contenidos educativos, capacitación y acompañamiento a las personas inscritas que atienden la población asegurada para la atención integral de siniestros. "}]
["VICEPRESIDENCIA TÉCNICA","Gerencia Médica","NO","C65142022",85100000,"Prestación de servicios: PRESTACIÓN DE SERVICIOS: El CONTRATISTA se obliga con POSITIVA a la prestación de los servicios de salud para los asegurados y/o afiliados a POSITIVA, que accedan a los servicios del CONTRATISTA en calidad de asegurados, a los ramos: Administración de Riesgos Laborales (ARL -por causa exclusiva de un accidente de trabajo, una enfermedad profesional), Accidentes Personales (AP Educativo Generación Positiva, AP Colectivos, AP Corto Plazo, AP Individual), Vida Individual, Vida Grupo, Planes de Salud y demás Ramos de Seguros autorizados a Positiva, encontrándose excluidos del presente contrato los servicios y todas aquellas actividades, procedimientos e intervenciones que no tengan por objeto contribuir al diagnóstico, tratamiento o rehabilitación de la patología derivada del evento calificado como profesional o los servicios considerados como experimentales, cosméticos y suntuarios. Para tal efecto, POSITIVA se compromete a pagarle al CONTRATISTA el valor de los servicios de salud","2022-01-12",{"$f":"MONTH(G475)","v":1},"2024-01-12",{"$f":"(I475-G475)/30","v":24.333333333333332},"Invitación directa","CargoAReserva",0,0,"NO",null,"Gerencia de Abastecimiento Estratégico\ncontratacion@positiva.gov.co\nPBX: (1)6502200 Ext: 10641","SI","SI","NO","SI",{"$f":"IF(U475=\"SI\",\"Pública clasificada\",\"Pública\")","v":"Pública clasificada"},{"$f":"CONCATENATE(D475,\"-\",\"Tipo de información\",\" \",V475,\"-\",F475)","v":"C65142022-Tipo de información Pública clasificada-Prestación de servicios: PRESTACIÓN DE SERVICIOS: El CONTRATISTA se obliga con POSITIVA a la prestación de los servicios de salud para los asegurados y/o afiliados a POSITIVA, que accedan a los servicios del CONTRATISTA en calidad de asegurados, a los ramos: Administración de Riesgos Laborales (ARL -por causa exclusiva de un accidente de trabajo, una enfermedad profesional), Accidentes Personales (AP Educativo Generación Positiva, AP Colectivos, AP Corto Plazo, AP Individual), Vida Individual, Vida Grupo, Planes de Salud y demás Ramos de Seguros autorizados a Positiva, encontrándose excluidos del presente contrato los servicios y todas aquellas actividades, procedimientos e intervenciones que no tengan por objeto contribuir al diagnóstico, tratamiento o rehabilitación de la patología derivada del evento calificado como profesional o los servicios considerados como experimentales, cosméticos y suntuarios. Para tal efecto, POSITIVA se compromete a pagarle al CONTRATISTA el valor de los servicios de salud"}]
["VICEPRESIDENCIA TÉCNICA","Gerencia Médica","NO","C65152022",85100000,"Prestación de servicios: El CONTRATISTA se obliga con POSITIVA a la prestación de los servicios de salud para los asegurados y/o afiliados a POSITIVA, que accedan a los servicios del CONTRATISTA en calidad de asegurados, a los ramos: Administración de Riesgos Laborales (ARL -por causa exclusiva de un accidente de trabajo, una enfermedad profesional), Accidentes Personales (AP Educativo Generación Positiva, AP Colectivos, AP Corto Plazo, AP Individual), Vida Individual, Vida Grupo, Planes de Salud y demás Ramos de Seguros autorizados a Positiva, encontrándose excluidos del presente contrato los servicios y todas aquellas actividades, procedimientos e intervenciones que no tengan por objeto contribuir al diagnóstico, tratamiento o rehabilitación de la patología derivada del evento calificado como profesional o los servicios considerados como experimentales, cosméticos y suntuarios. Para tal efecto, POSITIVA se compromete a pagarle al CONTRATISTA el valor de los servicios de salud","2022-01-15",{"$f":"MONTH(G476)","v":1},"2024-01-15",{"$f":"(I476-G476)/30","v":24.333333333333332},"Invitación directa","CargoAReserva",0,0,"NO",null,"Gerencia de Abastecimiento Estratégico\ncontratacion@positiva.gov.co\nPBX: (1)6502200 Ext: 10641","SI","SI","NO","SI",{"$f":"IF(U476=\"SI\",\"Pública clasificada\",\"Pública\")","v":"Pública clasificada"},{"$f":"CONCATENATE(D476,\"-\",\"Tipo de información\",\" \",V476,\"-\",F476)","v":"C65152022-Tipo de información Pública clasificada-Prestación de servicios: El CONTRATISTA se obliga con POSITIVA a la prestación de los servicios de salud para los asegurados y/o afiliados a POSITIVA, que accedan a los servicios del CONTRATISTA en calidad de asegurados, a los ramos: Administración de Riesgos Laborales (ARL -por causa exclusiva de un accidente de trabajo, una enfermedad profesional), Accidentes Personales (AP Educativo Generación Positiva, AP Colectivos, AP Corto Plazo, AP Individual), Vida Individual, Vida Grupo, Planes de Salud y demás Ramos de Seguros autorizados a Positiva, encontrándose excluidos del presente contrato los servicios y todas aquellas actividades, procedimientos e intervenciones que no tengan por objeto contribuir al diagnóstico, tratamiento o rehabilitación de la patología derivada del evento calificado como profesional o los servicios considerados como experimentales, cosméticos y suntuarios. Para tal efecto, POSITIVA se compromete a pagarle al CONTRATISTA el valor de los servicios de salud"}]
["VICEPRESIDENCIA TÉCNICA","Gerencia Médica","NO","C65162022",81111800,"Prestación de servicios: EL CONTRATISTA SE OBLIGA A: La   Prestación de servicios de soluciones web en la modalidad de software como servicio (SaaS), que permita la gestión integral del  siniestro y que contemple la integración de los canales de comunicación dispuestos para los clientes, la red de prestadores, la gestión de las solicitudes de autorizaciones de servicios de salud, la captura de avisos de siniestros, la radicación y auditoría de cuentas médicas, la auditoria de Microgestion de los siniestros, la validación y consulta de los movimientos realizados durante la vida del siniestro","2022-01-15",{"$f":"MONTH(G477)","v":1},"2024-01-15",{"$f":"(I477-G477)/30","v":24.333333333333332},"Invitación directa","CargoAReserva",11820600000,5910300000,"NO",null,"Gerencia de Abastecimiento Estratégico\ncontratacion@positiva.gov.co\nPBX: (1)6502200 Ext: 10641","SI","SI","NO","SI",{"$f":"IF(U477=\"SI\",\"Pública clasificada\",\"Pública\")","v":"Pública clasificada"},{"$f":"CONCATENATE(D477,\"-\",\"Tipo de información\",\" \",V477,\"-\",F477)","v":"C65162022-Tipo de información Pública clasificada-Prestación de servicios: EL CONTRATISTA SE OBLIGA A: La   Prestación de servicios de soluciones web en la modalidad de software como servicio (SaaS), que permita la gestión integral del  siniestro y que contemple la integración de los canales de comunicación dispuestos para los clientes, la red de prestadores, la gestión de las solicitudes de autorizaciones de servicios de salud, la captura de avisos de siniestros, la radicación y auditoría de cuentas médicas, la auditoria de Microgestion de los siniestros, la validación y consulta de los movimientos realizados durante la vida del siniestro"}]
["VICEPRESIDENCIA TÉCNICA","Gerencia Médica","NO","C65172022",83111507,"Prestación de servicios: PRESTACION DE LOS SERVICIOS DE GESTION LOGÍSTICA ESPECIALIZADA PARA LA PRESTACIÓN DE SERVICIOS ASISTENCIALES EN SALUD con el objetivo de administrar de manera  eficiente los recursos económicos dispuestos para garantizar las prestaciones asistenciales de los afiliados y asegurados de todos los ramos habilitados de POSITIVA COMPAÑÍA DE SEGUROS S.A.","2022-09-01",{"$f":"MONTH(G478)","v":9},"2024-09-30",{"$f":"(I478-G478)/30","v":25.333333333333332},"Invitación pública","CargoAReserva",0,0,"NO",null,"Gerencia de Abastecimiento Estratégico\ncontratacion@positiva.gov.co\nPBX: (1)6502200 Ext: 10641","SI","SI","NO","SI",{"$f":"IF(U478=\"SI\",\"Pública clasificada\",\"Pública\")","v":"Pública clasificada"},{"$f":"CONCATENATE(D478,\"-\",\"Tipo de información\",\" \",V478,\"-\",F478)","v":"C65172022-Tipo de información Pública clasificada-Prestación de servicios: PRESTACION DE LOS SERVICIOS DE GESTION LOGÍSTICA ESPECIALIZADA PARA LA PRESTACIÓN DE SERVICIOS ASISTENCIALES EN SALUD con el objetivo de administrar de manera  eficiente los recursos económicos dispuestos para garantizar las prestaciones asistenciales de los afiliados y asegurados de todos los ramos habilitados de POSITIVA COMPAÑÍA DE SEGUROS S.A."}]
["VICEPRESIDENCIA TÉCNICA","Gerencia Médica","NO","C65182022",51100000,"Prestación de servicios: PRESTAR LOS SERVICIOS A NIVEL NACIONAL DE DISPENSACIÓN, SUMINISTRO, DISTRIBUCIÓN Y CONTROL DE MEDICAMENTOS, DISPOSITIVOS, INSUMOS MÉDICOS Y PRODUCTOS COMPLEMENTARIOS EN SALUD A LOS ASEGURADOS EN LOS DIFERENTES RAMOS HABILITADOS DE POSITIVA COMPAÑIA DE SEGUROS S.A","2022-06-01",{"$f":"MONTH(G479)","v":6},"2024-06-01",{"$f":"(I479-G479)/30","v":24.366666666666667},"Invitación pública","CargoAReserva",0,0,"NO",null,"Gerencia de Abastecimiento Estratégico\ncontratacion@positiva.gov.co\nPBX: (1)6502200 Ext: 10641","SI","SI","NO","SI",{"$f":"IF(U479=\"SI\",\"Pública clasificada\",\"Pública\")","v":"Pública clasificada"},{"$f":"CONCATENATE(D479,\"-\",\"Tipo de información\",\" \",V479,\"-\",F479)","v":"C65182022-Tipo de información Pública clasificada-Prestación de servicios: PRESTAR LOS SERVICIOS A NIVEL NACIONAL DE DISPENSACIÓN, SUMINISTRO, DISTRIBUCIÓN Y CONTROL DE MEDICAMENTOS, DISPOSITIVOS, INSUMOS MÉDICOS Y PRODUCTOS COMPLEMENTARIOS EN SALUD A LOS ASEGURADOS EN LOS DIFERENTES RAMOS HABILITADOS DE POSITIVA COMPAÑIA DE SEGUROS S.A"}]
["VICEPRESIDENCIA TÉCNICA","Gerencia Médica","NO","C65192022",80000000,"Prestación de servicios: PRESTAR LOS SERVICIOS ESPECIALIZADOS DE INTERVENTORÍA TÉCNICA, JURÍDICA, FINANCIERA Y ADMINISTRATIVA A LOS CONTRATOS ESPECIALIZADOS DE LA COMPAÑÍA  RELACIONADOS CON LOS SERVICIOS DE MEDICINA LABORAL","2022-09-01",{"$f":"MONTH(G480)","v":9},"2024-09-30",{"$f":"(I480-G480)/30","v":25.333333333333332},"Invitación de Méritos","CargoAReserva",0,0,"NO",null,"Gerencia de Abastecimiento Estratégico\ncontratacion@positiva.gov.co\nPBX: (1)6502200 Ext: 10641","SI","SI","NO","SI",{"$f":"IF(U480=\"SI\",\"Pública clasificada\",\"Pública\")","v":"Pública clasificada"},{"$f":"CONCATENATE(D480,\"-\",\"Tipo de información\",\" \",V480,\"-\",F480)","v":"C65192022-Tipo de información Pública clasificada-Prestación de servicios: PRESTAR LOS SERVICIOS ESPECIALIZADOS DE INTERVENTORÍA TÉCNICA, JURÍDICA, FINANCIERA Y ADMINISTRATIVA A LOS CONTRATOS ESPECIALIZADOS DE LA COMPAÑÍA  RELACIONADOS CON LOS SERVICIOS DE MEDICINA LABORAL"}]
["VICEPRESIDENCIA TÉCNICA","Gerencia Médica","NO","C65202022",80000000,"Prestación de servicios: PRESTAR LOS SERVICIOS ESPECIALIZADOS DE INTERVENTORÍA TÉCNICA, JURÍDICA, FINANCIERA Y ADMINISTRATIVA A LOS CONTRATOS DE  SERVICIOS DE GESTION LOGÍSTICA ESPECIALIZADA PARA LA PRESTACIÓN DE SERVICIOS ASISTENCIALES EN SALUD","2022-09-01",{"$f":"MONTH(G481)","v":9},"2024-09-30",{"$f":"(I481-G481)/30","v":25.333333333333332},"Invitación de Méritos","CargoAReserva",0,0,"NO",null,"Gerencia de Abastecimiento Estratégico\ncontratacion@positiva.gov.co\nPBX: (1)6502200 Ext: 10641","SI","SI","NO","SI",{"$f":"IF(U481=\"SI\",\"Pública clasificada\",\"Pública\")","v":"Pública clasificada"},{"$f":"CONCATENATE(D481,\"-\",\"Tipo de información\",\" \",V481,\"-\",F481)","v":"C65202022-Tipo de información Pública clasificada-Prestación de servicios: PRESTAR LOS SERVICIOS ESPECIALIZADOS DE INTERVENTORÍA TÉCNICA, JURÍDICA, FINANCIERA Y ADMINISTRATIVA A LOS CONTRATOS DE  SERVICIOS DE GESTION LOGÍSTICA ESPECIALIZADA PARA LA PRESTACIÓN DE SERVICIOS ASISTENCIALES EN SALUD"}]
["VICEPRESIDENCIA TÉCNICA","Gerencia Médica","NO","C65212022",80101600,"Prestación de servicios: PRESTAR LOS SERVICIOS DE ATENCIÓN, SEGUIMIENTO Y CONTROL DE LAS PRESTACIONES ASISTENCIALES Y ECONÓMICAS DE LOS SINIESTROS PARA LOS DIFERENTES RAMOS Y PRODUCTOS COMERCIALIZADOS POR POSITIVA","2022-04-15",{"$f":"MONTH(G482)","v":4},"2023-04-15",{"$f":"(I482-G482)/30","v":12.166666666666666},"Invitación pública","CargoAReserva",0,0,"NO",null,"Gerencia de Abastecimiento Estratégico\ncontratacion@positiva.gov.co\nPBX: (1)6502200 Ext: 10641","SI","SI","NO","SI",{"$f":"IF(U482=\"SI\",\"Pública clasificada\",\"Pública\")","v":"Pública clasificada"},{"$f":"CONCATENATE(D482,\"-\",\"Tipo de información\",\" \",V482,\"-\",F482)","v":"C65212022-Tipo de información Pública clasificada-Prestación de servicios: PRESTAR LOS SERVICIOS DE ATENCIÓN, SEGUIMIENTO Y CONTROL DE LAS PRESTACIONES ASISTENCIALES Y ECONÓMICAS DE LOS SINIESTROS PARA LOS DIFERENTES RAMOS Y PRODUCTOS COMERCIALIZADOS POR POSITIVA"}]
["VICEPRESIDENCIA TÉCNICA","Gerencia Médica","NO","C65222022",85100000,"Prestación de servicios: El CONTRATISTA se obliga con POSITIVA a la prestación de los servicios de salud para los asegurados y o afiliados a POSITIVA que accedan a los servicios habilitados del CONTRATISTA en calidad de asegurados a los ramos Administración de Riesgos Laborales ARL por causa exclusiva de un accidente de trabajo una enfermedad profesional) Accidentes Personales AP Educativo Generación Positiva AP Colectivos APCorto Plazo AP Individual y demás Ramos de Seguros autorizados a Positiva encontrándose excluidos del presente contrato los servicios y todas aquellas actividades procedimientos e intervenciones que no tengan por objeto contribuir al diagnóstico tratamiento o rehabilitación de la patología derivada del siniestro o los servicios considerados como experimentales cosméticos y suntuarios.","2022-02-09",{"$f":"MONTH(G483)","v":2},"2024-02-09",{"$f":"(I483-G483)/30","v":24.333333333333332},"Invitación directa","CargoAReserva",0,0,"NO",null,"Gerencia de Abastecimiento Estratégico\ncontratacion@positiva.gov.co\nPBX: (1)6502200 Ext: 10641","SI","SI","NO","SI",{"$f":"IF(U483=\"SI\",\"Pública clasificada\",\"Pública\")","v":"Pública clasificada"},{"$f":"CONCATENATE(D483,\"-\",\"Tipo de información\",\" \",V483,\"-\",F483)","v":"C65222022-Tipo de información Pública clasificada-Prestación de servicios: El CONTRATISTA se obliga con POSITIVA a la prestación de los servicios de salud para los asegurados y o afiliados a POSITIVA que accedan a los servicios habilitados del CONTRATISTA en calidad de asegurados a los ramos Administración de Riesgos Laborales ARL por causa exclusiva de un accidente de trabajo una enfermedad profesional) Accidentes Personales AP Educativo Generación Positiva AP Colectivos APCorto Plazo AP Individual y demás Ramos de Seguros autorizados a Positiva encontrándose excluidos del presente contrato los servicios y todas aquellas actividades procedimientos e intervenciones que no tengan por objeto contribuir al diagnóstico tratamiento o rehabilitación de la patología derivada del siniestro o los servicios considerados como experimentales cosméticos y suntuarios."}]
["VICEPRESIDENCIA TÉCNICA","Gerencia Médica","NO","C65232022",85100000,"Prestación de servicios: El CONTRATISTA se obliga con POSITIVA a la prestación de los servicios de salud para los asegurados y o afiliados a POSITIVA que accedan a los servicios habilitados del CONTRATISTA en calidad de asegurados a los ramos Administración de Riesgos Laborales ARL por causa exclusiva de un accidente de trabajo una enfermedad profesional) Accidentes Personales AP Educativo Generación Positiva AP Colectivos APCorto Plazo AP Individual y demás Ramos de Seguros autorizados a Positiva encontrándose excluidos del presente contrato los servicios y todas aquellas actividades procedimientos e intervenciones que no tengan por objeto contribuir al diagnóstico tratamiento o rehabilitación de la patología derivada del siniestro o los servicios considerados como experimentales cosméticos y suntuarios.","2022-08-25",{"$f":"MONTH(G484)","v":8},"2027-08-25",{"$f":"(I484-G484)/30","v":60.866666666666667},"Invitación directa","CargoAReserva",0,0,"NO",null,"Gerencia de Abastecimiento Estratégico\ncontratacion@positiva.gov.co\nPBX: (1)6502200 Ext: 10641","SI","SI","NO","SI",{"$f":"IF(U484=\"SI\",\"Pública clasificada\",\"Pública\")","v":"Pública clasificada"},{"$f":"CONCATENATE(D484,\"-\",\"Tipo de información\",\" \",V484,\"-\",F484)","v":"C65232022-Tipo de información Pública clasificada-Prestación de servicios: El CONTRATISTA se obliga con POSITIVA a la prestación de los servicios de salud para los asegurados y o afiliados a POSITIVA que accedan a los servicios habilitados del CONTRATISTA en calidad de asegurados a los ramos Administración de Riesgos Laborales ARL por causa exclusiva de un accidente de trabajo una enfermedad profesional) Accidentes Personales AP Educativo Generación Positiva AP Colectivos APCorto Plazo AP Individual y demás Ramos de Seguros autorizados a Positiva encontrándose excluidos del presente contrato los servicios y todas aquellas actividades procedimientos e intervenciones que no tengan por objeto contribuir al diagnóstico tratamiento o rehabilitación de la patología derivada del siniestro o los servicios considerados como experimentales cosméticos y suntuarios."}]
["VICEPRESIDENCIA TÉCNICA","Gerencia Médica","NO","C65242022",85100000,"Prestación de servicios: El CONTRATISTA se obliga con POSITIVA a la prestación de los servicios de salud para los asegurados y o afiliados a POSITIVA que accedan a los servicios habilitados del CONTRATISTA en calidad de asegurados a los ramos Administración de Riesgos Laborales ARL por causa exclusiva de un accidente de trabajo una enfermedad profesional) Accidentes Personales AP Educativo Generación Positiva AP Colectivos APCorto Plazo AP Individual y demás Ramos de Seguros autorizados a Positiva encontrándose excluidos del presente contrato los servicios y todas aquellas actividades procedimientos e intervenciones que no tengan por objeto contribuir al diagnóstico tratamiento o rehabilitación de la patología derivada del siniestro o los servicios considerados como experimentales cosméticos y suntuarios.","2022-12-29",{"$f":"MONTH(G485)","v":12},"2027-12-29",{"$f":"(I485-G485)/30","v":60.866666666666667},"Invitación directa","CargoAReserva",0,0,"NO",null,"Gerencia de Abastecimiento Estratégico\ncontratacion@positiva.gov.co\nPBX: (1)6502200 Ext: 10641","SI","SI","NO","SI",{"$f":"IF(U485=\"SI\",\"Pública clasificada\",\"Pública\")","v":"Pública clasificada"},{"$f":"CONCATENATE(D485,\"-\",\"Tipo de información\",\" \",V485,\"-\",F485)","v":"C65242022-Tipo de información Pública clasificada-Prestación de servicios: El CONTRATISTA se obliga con POSITIVA a la prestación de los servicios de salud para los asegurados y o afiliados a POSITIVA que accedan a los servicios habilitados del CONTRATISTA en calidad de asegurados a los ramos Administración de Riesgos Laborales ARL por causa exclusiva de un accidente de trabajo una enfermedad profesional) Accidentes Personales AP Educativo Generación Positiva AP Colectivos APCorto Plazo AP Individual y demás Ramos de Seguros autorizados a Positiva encontrándose excluidos del presente contrato los servicios y todas aquellas actividades procedimientos e intervenciones que no tengan por objeto contribuir al diagnóstico tratamiento o rehabilitación de la patología derivada del siniestro o los servicios considerados como experimentales cosméticos y suntuarios."}]
["VICEPRESIDENCIA TÉCNICA","Gerencia Médica","NO","C65252022",85100000,"Prestación de servicios: El CONTRATISTA se obliga con POSITIVA a la prestación de los servicios de salud para los asegurados y o afiliados a POSITIVA que accedan a los servicios habilitados del CONTRATISTA en calidad de asegurados a los ramos Administración de Riesgos Laborales ARL por causa exclusiva de un accidente de trabajo una enfermedad profesional) Accidentes Personales AP Educativo Generación Positiva AP Colectivos APCorto Plazo AP Individual y demás Ramos de Seguros autorizados a Positiva encontrándose excluidos del presente contrato los servicios y todas aquellas actividades procedimientos e intervenciones que no tengan por objeto contribuir al diagnóstico tratamiento o rehabilitación de la patología derivada del siniestro o los servicios considerados como experimentales cosméticos y suntuarios.","2022-04-30",{"$f":"MONTH(G486)","v":4},"2024-04-30",{"$f":"(I486-G486)/30","v":24.366666666666667},"Invitación directa","CargoAReserva",0,0,"NO",null,"Gerencia de Abastecimiento Estratégico\ncontratacion@positiva.gov.co\nPBX: (1)6502200 Ext: 10641","SI","SI","NO","SI",{"$f":"IF(U486=\"SI\",\"Pública clasificada\",\"Pública\")","v":"Pública clasificada"},{"$f":"CONCATENATE(D486,\"-\",\"Tipo de información\",\" \",V486,\"-\",F486)","v":"C65252022-Tipo de información Pública clasificada-Prestación de servicios: El CONTRATISTA se obliga con POSITIVA a la prestación de los servicios de salud para los asegurados y o afiliados a POSITIVA que accedan a los servicios habilitados del CONTRATISTA en calidad de asegurados a los ramos Administración de Riesgos Laborales ARL por causa exclusiva de un accidente de trabajo una enfermedad profesional) Accidentes Personales AP Educativo Generación Positiva AP Colectivos APCorto Plazo AP Individual y demás Ramos de Seguros autorizados a Positiva encontrándose excluidos del presente contrato los servicios y todas aquellas actividades procedimientos e intervenciones que no tengan por objeto contribuir al diagnóstico tratamiento o rehabilitación de la patología derivada del siniestro o los servicios considerados como experimentales cosméticos y suntuarios."}]
["VICEPRESIDENCIA TÉCNICA","Gerencia Médica","NO","C65262022",85100000,"Prestación de servicios: El CONTRATISTA se obliga con POSITIVA a la prestación de los servicios de salud para los asegurados y o afiliados a POSITIVA que accedan a los servicios habilitados del CONTRATISTA en calidad de asegurados a los ramos Administración de Riesgos Laborales ARL por causa exclusiva de un accidente de trabajo una enfermedad profesional) Accidentes Personales AP Educativo Generación Positiva AP Colectivos APCorto Plazo AP Individual y demás Ramos de Seguros autorizados a Positiva encontrándose excluidos del presente contrato los servicios y todas aquellas actividades procedimientos e intervenciones que no tengan por objeto contribuir al diagnóstico tratamiento o rehabilitación de la patología derivada del siniestro o los servicios considerados como experimentales cosméticos y suntuarios.","2022-02-28",{"$f":"MONTH(G487)","v":2},"2024-02-28",{"$f":"(I487-G487)/30","v":24.333333333333332},"Invitación directa","CargoAReserva",0,0,"NO",null,"Gerencia de Abastecimiento Estratégico\ncontratacion@positiva.gov.co\nPBX: (1)6502200 Ext: 10641","SI","SI","NO","SI",{"$f":"IF(U487=\"SI\",\"Pública clasificada\",\"Pública\")","v":"Pública clasificada"},{"$f":"CONCATENATE(D487,\"-\",\"Tipo de información\",\" \",V487,\"-\",F487)","v":"C65262022-Tipo de información Pública clasificada-Prestación de servicios: El CONTRATISTA se obliga con POSITIVA a la prestación de los servicios de salud para los asegurados y o afiliados a POSITIVA que accedan a los servicios habilitados del CONTRATISTA en calidad de asegurados a los ramos Administración de Riesgos Laborales ARL por causa exclusiva de un accidente de trabajo una enfermedad profesional) Accidentes Personales AP Educativo Generación Positiva AP Colectivos APCorto Plazo AP Individual y demás Ramos de Seguros autorizados a Positiva encontrándose excluidos del presente contrato los servicios y todas aquellas actividades procedimientos e intervenciones que no tengan por objeto contribuir al diagnóstico tratamiento o rehabilitación de la patología derivada del siniestro o los servicios considerados como experimentales cosméticos y suntuarios."}]
["VICEPRESIDENCIA TÉCNICA","Gerencia Médica","NO","C65272022",85100000,"Prestación de servicios: El CONTRATISTA se obliga con POSITIVA a la prestación de los servicios de salud para los asegurados y o afiliados a POSITIVA que accedan a los servicios habilitados del CONTRATISTA en calidad de asegurados a los ramos Administración de Riesgos Laborales ARL por causa exclusiva de un accidente de trabajo una enfermedad profesional) Accidentes Personales AP Educativo Generación Positiva AP Colectivos APCorto Plazo AP Individual y demás Ramos de Seguros autorizados a Positiva encontrándose excluidos del presente contrato los servicios y todas aquellas actividades procedimientos e intervenciones que no tengan por objeto contribuir al diagnóstico tratamiento o rehabilitación de la patología derivada del siniestro o los servicios considerados como experimentales cosméticos y suntuarios.","2022-09-01",{"$f":"MONTH(G488)","v":9},"2024-09-30",{"$f":"(I488-G488)/30","v":25.333333333333332},"Invitación directa","CargoAReserva",0,0,"NO",null,"Gerencia de Abastecimiento Estratégico\ncontratacion@positiva.gov.co\nPBX: (1)6502200 Ext: 10641","SI","SI","NO","SI",{"$f":"IF(U488=\"SI\",\"Pública clasificada\",\"Pública\")","v":"Pública clasificada"},{"$f":"CONCATENATE(D488,\"-\",\"Tipo de información\",\" \",V488,\"-\",F488)","v":"C65272022-Tipo de información Pública clasificada-Prestación de servicios: El CONTRATISTA se obliga con POSITIVA a la prestación de los servicios de salud para los asegurados y o afiliados a POSITIVA que accedan a los servicios habilitados del CONTRATISTA en calidad de asegurados a los ramos Administración de Riesgos Laborales ARL por causa exclusiva de un accidente de trabajo una enfermedad profesional) Accidentes Personales AP Educativo Generación Positiva AP Colectivos APCorto Plazo AP Individual y demás Ramos de Seguros autorizados a Positiva encontrándose excluidos del presente contrato los servicios y todas aquellas actividades procedimientos e intervenciones que no tengan por objeto contribuir al diagnóstico tratamiento o rehabilitación de la patología derivada del siniestro o los servicios considerados como experimentales cosméticos y suntuarios."}]
["VICEPRESIDENCIA TÉCNICA","Gerencia Médica","NO","C65282022",85100000,"Prestación de servicios: El CONTRATISTA se obliga con POSITIVA a la prestación de los servicios de salud para los asegurados y o afiliados a POSITIVA que accedan a los servicios habilitados del CONTRATISTA en calidad de asegurados a los ramos Administración de Riesgos Laborales ARL por causa exclusiva de un accidente de trabajo una enfermedad profesional) Accidentes Personales AP Educativo Generación Positiva AP Colectivos APCorto Plazo AP Individual y demás Ramos de Seguros autorizados a Positiva encontrándose excluidos del presente contrato los servicios y todas aquellas actividades procedimientos e intervenciones que no tengan por objeto contribuir al diagnóstico tratamiento o rehabilitación de la patología derivada del siniestro o los servicios considerados como experimentales cosméticos y suntuarios.","2022-07-06",{"$f":"MONTH(G489)","v":7},"2024-07-06",{"$f":"(I489-G489)/30","v":24.366666666666667},"Invitación directa","CargoAReserva",0,0,"NO",null,"Gerencia de Abastecimiento Estratégico\ncontratacion@positiva.gov.co\nPBX: (1)6502200 Ext: 10641","SI","SI","NO","SI",{"$f":"IF(U489=\"SI\",\"Pública clasificada\",\"Pública\")","v":"Pública clasificada"},{"$f":"CONCATENATE(D489,\"-\",\"Tipo de información\",\" \",V489,\"-\",F489)","v":"C65282022-Tipo de información Pública clasificada-Prestación de servicios: El CONTRATISTA se obliga con POSITIVA a la prestación de los servicios de salud para los asegurados y o afiliados a POSITIVA que accedan a los servicios habilitados del CONTRATISTA en calidad de asegurados a los ramos Administración de Riesgos Laborales ARL por causa exclusiva de un accidente de trabajo una enfermedad profesional) Accidentes Personales AP Educativo Generación Positiva AP Colectivos APCorto Plazo AP Individual y demás Ramos de Seguros autorizados a Positiva encontrándose excluidos del presente contrato los servicios y todas aquellas actividades procedimientos e intervenciones que no tengan por objeto contribuir al diagnóstico tratamiento o rehabilitación de la patología derivada del siniestro o los servicios considerados como experimentales cosméticos y suntuarios."}]
["VICEPRESIDENCIA TÉCNICA","Gerencia Médica","NO","C65292022",85100000,"Prestación de servicios: El CONTRATISTA se obliga con POSITIVA a la prestación de los servicios de salud para los asegurados y o afiliados a POSITIVA que accedan a los servicios habilitados del CONTRATISTA en calidad de asegurados a los ramos Administración de Riesgos Laborales ARL por causa exclusiva de un accidente de trabajo una enfermedad profesional) Accidentes Personales AP Educativo Generación Positiva AP Colectivos APCorto Plazo AP Individual y demás Ramos de Seguros autorizados a Positiva encontrándose excluidos del presente contrato los servicios y todas aquellas actividades procedimientos e intervenciones que no tengan por objeto contribuir al diagnóstico tratamiento o rehabilitación de la patología derivada del siniestro o los servicios considerados como experimentales cosméticos y suntuarios.","2022-09-01",{"$f":"MONTH(G490)","v":9},"2024-09-30",{"$f":"(I490-G490)/30","v":25.333333333333332},"Invitación directa","CargoAReserva",0,0,"NO",null,"Gerencia de Abastecimiento Estratégico\ncontratacion@positiva.gov.co\nPBX: (1)6502200 Ext: 10641","SI","SI","NO","SI",{"$f":"IF(U490=\"SI\",\"Pública clasificada\",\"Pública\")","v":"Pública clasificada"},{"$f":"CONCATENATE(D490,\"-\",\"Tipo de información\",\" \",V490,\"-\",F490)","v":"C65292022-Tipo de información Pública clasificada-Prestación de servicios: El CONTRATISTA se obliga con POSITIVA a la prestación de los servicios de salud para los asegurados y o afiliados a POSITIVA que accedan a los servicios habilitados del CONTRATISTA en calidad de asegurados a los ramos Administración de Riesgos Laborales ARL por causa exclusiva de un accidente de trabajo una enfermedad profesional) Accidentes Personales AP Educativo Generación Positiva AP Colectivos APCorto Plazo AP Individual y demás Ramos de Seguros autorizados a Positiva encontrándose excluidos del presente contrato los servicios y todas aquellas actividades procedimientos e intervenciones que no tengan por objeto contribuir al diagnóstico tratamiento o rehabilitación de la patología derivada del siniestro o los servicios considerados como experimentales cosméticos y suntuarios."}]
["VICEPRESIDENCIA TÉCNICA","Gerencia Médica","NO","C65302022",85100000,"Prestación de servicios: El CONTRATISTA se obliga con POSITIVA a la prestación de los servicios de salud para los asegurados y o afiliados a POSITIVA que accedan a los servicios habilitados del CONTRATISTA en calidad de asegurados a los ramos Administración de Riesgos Laborales ARL por causa exclusiva de un accidente de trabajo una enfermedad profesional) Accidentes Personales AP Educativo Generación Positiva AP Colectivos APCorto Plazo AP Individual y demás Ramos de Seguros autorizados a Positiva encontrándose excluidos del presente contrato los servicios y todas aquellas actividades procedimientos e intervenciones que no tengan por objeto contribuir al diagnóstico tratamiento o rehabilitación de la patología derivada del siniestro o los servicios considerados como experimentales cosméticos y suntuarios.","2022-07-01",{"$f":"MONTH(G491)","v":7},"2027-07-01",{"$f":"(I491-G491)/30","v":60.866666666666667},"Invitación directa","CargoAReserva",0,0,"NO",null,"Gerencia de Abastecimiento Estratégico\ncontratacion@positiva.gov.co\nPBX: (1)6502200 Ext: 10641","SI","SI","NO","SI",{"$f":"IF(U491=\"SI\",\"Pública clasificada\",\"Pública\")","v":"Pública clasificada"},{"$f":"CONCATENATE(D491,\"-\",\"Tipo de información\",\" \",V491,\"-\",F491)","v":"C65302022-Tipo de información Pública clasificada-Prestación de servicios: El CONTRATISTA se obliga con POSITIVA a la prestación de los servicios de salud para los asegurados y o afiliados a POSITIVA que accedan a los servicios habilitados del CONTRATISTA en calidad de asegurados a los ramos Administración de Riesgos Laborales ARL por causa exclusiva de un accidente de trabajo una enfermedad profesional) Accidentes Personales AP Educativo Generación Positiva AP Colectivos APCorto Plazo AP Individual y demás Ramos de Seguros autorizados a Positiva encontrándose excluidos del presente contrato los servicios y todas aquellas actividades procedimientos e intervenciones que no tengan por objeto contribuir al diagnóstico tratamiento o rehabilitación de la patología derivada del siniestro o los servicios considerados como experimentales cosméticos y suntuarios."}]
["VICEPRESIDENCIA TÉCNICA","Gerencia Médica","NO","C65312022",85100000,"Prestación de servicios: El CONTRATISTA se obliga con POSITIVA a la prestación de los servicios de salud para los asegurados y o afiliados a POSITIVA que accedan a los servicios habilitados del CONTRATISTA en calidad de asegurados a los ramos Administración de Riesgos Laborales ARL por causa exclusiva de un accidente de trabajo una enfermedad profesional) Accidentes Personales AP Educativo Generación Positiva AP Colectivos APCorto Plazo AP Individual y demás Ramos de Seguros autorizados a Positiva encontrándose excluidos del presente contrato los servicios y todas aquellas actividades procedimientos e intervenciones que no tengan por objeto contribuir al diagnóstico tratamiento o rehabilitación de la patología derivada del siniestro o los servicios considerados como experimentales cosméticos y suntuarios.","2022-08-01",{"$f":"MONTH(G492)","v":8},"2027-08-01",{"$f":"(I492-G492)/30","v":60.866666666666667},"Invitación directa","CargoAReserva",0,0,"NO",null,"Gerencia de Abastecimiento Estratégico\ncontratacion@positiva.gov.co\nPBX: (1)6502200 Ext: 10641","SI","SI","NO","SI",{"$f":"IF(U492=\"SI\",\"Pública clasificada\",\"Pública\")","v":"Pública clasificada"},{"$f":"CONCATENATE(D492,\"-\",\"Tipo de información\",\" \",V492,\"-\",F492)","v":"C65312022-Tipo de información Pública clasificada-Prestación de servicios: El CONTRATISTA se obliga con POSITIVA a la prestación de los servicios de salud para los asegurados y o afiliados a POSITIVA que accedan a los servicios habilitados del CONTRATISTA en calidad de asegurados a los ramos Administración de Riesgos Laborales ARL por causa exclusiva de un accidente de trabajo una enfermedad profesional) Accidentes Personales AP Educativo Generación Positiva AP Colectivos APCorto Plazo AP Individual y demás Ramos de Seguros autorizados a Positiva encontrándose excluidos del presente contrato los servicios y todas aquellas actividades procedimientos e intervenciones que no tengan por objeto contribuir al diagnóstico tratamiento o rehabilitación de la patología derivada del siniestro o los servicios considerados como experimentales cosméticos y suntuarios."}]
["VICEPRESIDENCIA TÉCNICA","Gerencia Médica","NO","C65322022",85100000,"Prestación de servicios: El CONTRATISTA se obliga con POSITIVA a la prestación de los servicios de salud para los asegurados y o afiliados a POSITIVA que accedan a los servicios habilitados del CONTRATISTA en calidad de asegurados a los ramos Administración de Riesgos Laborales ARL por causa exclusiva de un accidente de trabajo una enfermedad profesional) Accidentes Personales AP Educativo Generación Positiva AP Colectivos APCorto Plazo AP Individual y demás Ramos de Seguros autorizados a Positiva encontrándose excluidos del presente contrato los servicios y todas aquellas actividades procedimientos e intervenciones que no tengan por objeto contribuir al diagnóstico tratamiento o rehabilitación de la patología derivada del siniestro o los servicios considerados como experimentales cosméticos y suntuarios.","2022-09-01",{"$f":"MONTH(G493)","v":9},"2027-09-01",{"$f":"(I493-G493)/30","v":60.866666666666667},"Invitación directa","CargoAReserva",0,0,"NO",null,"Gerencia de Abastecimiento Estratégico\ncontratacion@positiva.gov.co\nPBX: (1)6502200 Ext: 10641","SI","SI","NO","SI",{"$f":"IF(U493=\"SI\",\"Pública clasificada\",\"Pública\")","v":"Pública clasificada"},{"$f":"CONCATENATE(D493,\"-\",\"Tipo de información\",\" \",V493,\"-\",F493)","v":"C65322022-Tipo de información Pública clasificada-Prestación de servicios: El CONTRATISTA se obliga con POSITIVA a la prestación de los servicios de salud para los asegurados y o afiliados a POSITIVA que accedan a los servicios habilitados del CONTRATISTA en calidad de asegurados a los ramos Administración de Riesgos Laborales ARL por causa exclusiva de un accidente de trabajo una enfermedad profesional) Accidentes Personales AP Educativo Generación Positiva AP Colectivos APCorto Plazo AP Individual y demás Ramos de Seguros autorizados a Positiva encontrándose excluidos del presente contrato los servicios y todas aquellas actividades procedimientos e intervenciones que no tengan por objeto contribuir al diagnóstico tratamiento o rehabilitación de la patología derivada del siniestro o los servicios considerados como experimentales cosméticos y suntuarios."}]
["VICEPRESIDENCIA TÉCNICA","Gerencia Médica","NO","C65332022",85100000,"Prestación de servicios: El CONTRATISTA se obliga con POSITIVA a la prestación de los servicios de salud para los asegurados y o afiliados a POSITIVA que accedan a los servicios habilitados del CONTRATISTA en calidad de asegurados a los ramos Administración de Riesgos Laborales ARL por causa exclusiva de un accidente de trabajo una enfermedad profesional) Accidentes Personales AP Educativo Generación Positiva AP Colectivos APCorto Plazo AP Individual y demás Ramos de Seguros autorizados a Positiva encontrándose excluidos del presente contrato los servicios y todas aquellas actividades procedimientos e intervenciones que no tengan por objeto contribuir al diagnóstico tratamiento o rehabilitación de la patología derivada del siniestro o los servicios considerados como experimentales cosméticos y suntuarios.","2022-08-01",{"$f":"MONTH(G494)","v":8},"2024-08-07",{"$f":"(I494-G494)/30","v":24.566666666666666},"Invitación directa","CargoAReserva",0,0,"NO",null,"Gerencia de Abastecimiento Estratégico\ncontratacion@positiva.gov.co\nPBX: (1)6502200 Ext: 10641","SI","SI","NO","SI",{"$f":"IF(U494=\"SI\",\"Pública clasificada\",\"Pública\")","v":"Pública clasificada"},{"$f":"CONCATENATE(D494,\"-\",\"Tipo de información\",\" \",V494,\"-\",F494)","v":"C65332022-Tipo de información Pública clasificada-Prestación de servicios: El CONTRATISTA se obliga con POSITIVA a la prestación de los servicios de salud para los asegurados y o afiliados a POSITIVA que accedan a los servicios habilitados del CONTRATISTA en calidad de asegurados a los ramos Administración de Riesgos Laborales ARL por causa exclusiva de un accidente de trabajo una enfermedad profesional) Accidentes Personales AP Educativo Generación Positiva AP Colectivos APCorto Plazo AP Individual y demás Ramos de Seguros autorizados a Positiva encontrándose excluidos del presente contrato los servicios y todas aquellas actividades procedimientos e intervenciones que no tengan por objeto contribuir al diagnóstico tratamiento o rehabilitación de la patología derivada del siniestro o los servicios considerados como experimentales cosméticos y suntuarios."}]
["VICEPRESIDENCIA TÉCNICA","Gerencia Médica","NO","C65342022",85100000,"Prestación de servicios: El CONTRATISTA se obliga con POSITIVA a la prestación de los servicios de salud para los asegurados y o afiliados a POSITIVA que accedan a los servicios habilitados del CONTRATISTA en calidad de asegurados a los ramos Administración de Riesgos Laborales ARL por causa exclusiva de un accidente de trabajo una enfermedad profesional) Accidentes Personales AP Educativo Generación Positiva AP Colectivos APCorto Plazo AP Individual y demás Ramos de Seguros autorizados a Positiva encontrándose excluidos del presente contrato los servicios y todas aquellas actividades procedimientos e intervenciones que no tengan por objeto contribuir al diagnóstico tratamiento o rehabilitación de la patología derivada del siniestro o los servicios considerados como experimentales cosméticos y suntuarios.","2022-10-01",{"$f":"MONTH(G495)","v":10},"2027-10-01",{"$f":"(I495-G495)/30","v":60.866666666666667},"Invitación directa","CargoAReserva",0,0,"NO",null,"Gerencia de Abastecimiento Estratégico\ncontratacion@positiva.gov.co\nPBX: (1)6502200 Ext: 10641","SI","SI","NO","SI",{"$f":"IF(U495=\"SI\",\"Pública clasificada\",\"Pública\")","v":"Pública clasificada"},{"$f":"CONCATENATE(D495,\"-\",\"Tipo de información\",\" \",V495,\"-\",F495)","v":"C65342022-Tipo de información Pública clasificada-Prestación de servicios: El CONTRATISTA se obliga con POSITIVA a la prestación de los servicios de salud para los asegurados y o afiliados a POSITIVA que accedan a los servicios habilitados del CONTRATISTA en calidad de asegurados a los ramos Administración de Riesgos Laborales ARL por causa exclusiva de un accidente de trabajo una enfermedad profesional) Accidentes Personales AP Educativo Generación Positiva AP Colectivos APCorto Plazo AP Individual y demás Ramos de Seguros autorizados a Positiva encontrándose excluidos del presente contrato los servicios y todas aquellas actividades procedimientos e intervenciones que no tengan por objeto contribuir al diagnóstico tratamiento o rehabilitación de la patología derivada del siniestro o los servicios considerados como experimentales cosméticos y suntuarios."}]
["VICEPRESIDENCIA TÉCNICA","Gerencia Médica","NO","C65352022",85100000,"Prestación de servicios: El CONTRATISTA se obliga con POSITIVA a la prestación de los servicios de salud para los asegurados y o afiliados a POSITIVA que accedan a los servicios habilitados del CONTRATISTA en calidad de asegurados a los ramos Administración de Riesgos Laborales ARL por causa exclusiva de un accidente de trabajo una enfermedad profesional) Accidentes Personales AP Educativo Generación Positiva AP Colectivos APCorto Plazo AP Individual y demás Ramos de Seguros autorizados a Positiva encontrándose excluidos del presente contrato los servicios y todas aquellas actividades procedimientos e intervenciones que no tengan por objeto contribuir al diagnóstico tratamiento o rehabilitación de la patología derivada del siniestro o los servicios considerados como experimentales cosméticos y suntuarios.","2022-11-01",{"$f":"MONTH(G496)","v":11},"2027-11-01",{"$f":"(I496-G496)/30","v":60.866666666666667},"Invitación directa","CargoAReserva",0,0,"NO",null,"Gerencia de Abastecimiento Estratégico\ncontratacion@positiva.gov.co\nPBX: (1)6502200 Ext: 10641","SI","SI","NO","SI",{"$f":"IF(U496=\"SI\",\"Pública clasificada\",\"Pública\")","v":"Pública clasificada"},{"$f":"CONCATENATE(D496,\"-\",\"Tipo de información\",\" \",V496,\"-\",F496)","v":"C65352022-Tipo de información Pública clasificada-Prestación de servicios: El CONTRATISTA se obliga con POSITIVA a la prestación de los servicios de salud para los asegurados y o afiliados a POSITIVA que accedan a los servicios habilitados del CONTRATISTA en calidad de asegurados a los ramos Administración de Riesgos Laborales ARL por causa exclusiva de un accidente de trabajo una enfermedad profesional) Accidentes Personales AP Educativo Generación Positiva AP Colectivos APCorto Plazo AP Individual y demás Ramos de Seguros autorizados a Positiva encontrándose excluidos del presente contrato los servicios y todas aquellas actividades procedimientos e intervenciones que no tengan por objeto contribuir al diagnóstico tratamiento o rehabilitación de la patología derivada del siniestro o los servicios considerados como experimentales cosméticos y suntuarios."}]
["VICEPRESIDENCIA TÉCNICA","Gerencia Médica","NO","C65362022",85100000,"Prestación de servicios: El CONTRATISTA se obliga con POSITIVA a la prestación de los servicios de salud para los asegurados y o afiliados a POSITIVA que accedan a los servicios habilitados del CONTRATISTA en calidad de asegurados a los ramos Administración de Riesgos Laborales ARL por causa exclusiva de un accidente de trabajo una enfermedad profesional) Accidentes Personales AP Educativo Generación Positiva AP Colectivos APCorto Plazo AP Individual y demás Ramos de Seguros autorizados a Positiva encontrándose excluidos del presente contrato los servicios y todas aquellas actividades procedimientos e intervenciones que no tengan por objeto contribuir al diagnóstico tratamiento o rehabilitación de la patología derivada del siniestro o los servicios considerados como experimentales cosméticos y suntuarios.","2022-02-01",{"$f":"MONTH(G497)","v":2},"2027-02-01",{"$f":"(I497-G497)/30","v":60.866666666666667},"Invitación directa","CargoAReserva",0,0,"NO",null,"Gerencia de Abastecimiento Estratégico\ncontratacion@positiva.gov.co\nPBX: (1)6502200 Ext: 10641","SI","SI","NO","SI",{"$f":"IF(U497=\"SI\",\"Pública clasificada\",\"Pública\")","v":"Pública clasificada"},{"$f":"CONCATENATE(D497,\"-\",\"Tipo de información\",\" \",V497,\"-\",F497)","v":"C65362022-Tipo de información Pública clasificada-Prestación de servicios: El CONTRATISTA se obliga con POSITIVA a la prestación de los servicios de salud para los asegurados y o afiliados a POSITIVA que accedan a los servicios habilitados del CONTRATISTA en calidad de asegurados a los ramos Administración de Riesgos Laborales ARL por causa exclusiva de un accidente de trabajo una enfermedad profesional) Accidentes Personales AP Educativo Generación Positiva AP Colectivos APCorto Plazo AP Individual y demás Ramos de Seguros autorizados a Positiva encontrándose excluidos del presente contrato los servicios y todas aquellas actividades procedimientos e intervenciones que no tengan por objeto contribuir al diagnóstico tratamiento o rehabilitación de la patología derivada del siniestro o los servicios considerados como experimentales cosméticos y suntuarios."}]
["VICEPRESIDENCIA TÉCNICA","Gerencia Médica","NO","C65372022",85100000,"Prestación de servicios: El CONTRATISTA se obliga con POSITIVA a la prestación de los servicios de salud para los asegurados y o afiliados a POSITIVA que accedan a los servicios habilitados del CONTRATISTA en calidad de asegurados a los ramos Administración de Riesgos Laborales ARL por causa exclusiva de un accidente de trabajo una enfermedad profesional) Accidentes Personales AP Educativo Generación Positiva AP Colectivos APCorto Plazo AP Individual y demás Ramos de Seguros autorizados a Positiva encontrándose excluidos del presente contrato los servicios y todas aquellas actividades procedimientos e intervenciones que no tengan por objeto contribuir al diagnóstico tratamiento o rehabilitación de la patología derivada del siniestro o los servicios considerados como experimentales cosméticos y suntuarios.","2022-03-01",{"$f":"MONTH(G498)","v":3},"2027-03-01",{"$f":"(I498-G498)/30","v":60.866666666666667},"Invitación directa","CargoAReserva",0,0,"NO",null,"Gerencia de Abastecimiento Estratégico\ncontratacion@positiva.gov.co\nPBX: (1)6502200 Ext: 10641","SI","SI","NO","SI",{"$f":"IF(U498=\"SI\",\"Pública clasificada\",\"Pública\")","v":"Pública clasificada"},{"$f":"CONCATENATE(D498,\"-\",\"Tipo de información\",\" \",V498,\"-\",F498)","v":"C65372022-Tipo de información Pública clasificada-Prestación de servicios: El CONTRATISTA se obliga con POSITIVA a la prestación de los servicios de salud para los asegurados y o afiliados a POSITIVA que accedan a los servicios habilitados del CONTRATISTA en calidad de asegurados a los ramos Administración de Riesgos Laborales ARL por causa exclusiva de un accidente de trabajo una enfermedad profesional) Accidentes Personales AP Educativo Generación Positiva AP Colectivos APCorto Plazo AP Individual y demás Ramos de Seguros autorizados a Positiva encontrándose excluidos del presente contrato los servicios y todas aquellas actividades procedimientos e intervenciones que no tengan por objeto contribuir al diagnóstico tratamiento o rehabilitación de la patología derivada del siniestro o los servicios considerados como experimentales cosméticos y suntuarios."}]
["VICEPRESIDENCIA TÉCNICA","Gerencia Médica","NO","C65382022",85100000,"Prestación de servicios: El CONTRATISTA se obliga con POSITIVA a la prestación de los servicios de salud para los asegurados y o afiliados a POSITIVA que accedan a los servicios habilitados del CONTRATISTA en calidad de asegurados a los ramos Administración de Riesgos Laborales ARL por causa exclusiva de un accidente de trabajo una enfermedad profesional) Accidentes Personales AP Educativo Generación Positiva AP Colectivos APCorto Plazo AP Individual y demás Ramos de Seguros autorizados a Positiva encontrándose excluidos del presente contrato los servicios y todas aquellas actividades procedimientos e intervenciones que no tengan por objeto contribuir al diagnóstico tratamiento o rehabilitación de la patología derivada del siniestro o los servicios considerados como experimentales cosméticos y suntuarios.","2022-04-01",{"$f":"MONTH(G499)","v":4},"2027-04-01",{"$f":"(I499-G499)/30","v":60.866666666666667},"Invitación directa","CargoAReserva",0,0,"NO",null,"Gerencia de Abastecimiento Estratégico\ncontratacion@positiva.gov.co\nPBX: (1)6502200 Ext: 10641","SI","SI","NO","SI",{"$f":"IF(U499=\"SI\",\"Pública clasificada\",\"Pública\")","v":"Pública clasificada"},{"$f":"CONCATENATE(D499,\"-\",\"Tipo de información\",\" \",V499,\"-\",F499)","v":"C65382022-Tipo de información Pública clasificada-Prestación de servicios: El CONTRATISTA se obliga con POSITIVA a la prestación de los servicios de salud para los asegurados y o afiliados a POSITIVA que accedan a los servicios habilitados del CONTRATISTA en calidad de asegurados a los ramos Administración de Riesgos Laborales ARL por causa exclusiva de un accidente de trabajo una enfermedad profesional) Accidentes Personales AP Educativo Generación Positiva AP Colectivos APCorto Plazo AP Individual y demás Ramos de Seguros autorizados a Positiva encontrándose excluidos del presente contrato los servicios y todas aquellas actividades procedimientos e intervenciones que no tengan por objeto contribuir al diagnóstico tratamiento o rehabilitación de la patología derivada del siniestro o los servicios considerados como experimentales cosméticos y suntuarios."}]
["VICEPRESIDENCIA TÉCNICA","Gerencia Médica","NO","C65392022",85100000,"Prestación de servicios: El CONTRATISTA se obliga con POSITIVA a la prestación de los servicios de salud para los asegurados y o afiliados a POSITIVA que accedan a los servicios habilitados del CONTRATISTA en calidad de asegurados a los ramos Administración de Riesgos Laborales ARL por causa exclusiva de un accidente de trabajo una enfermedad profesional) Accidentes Personales AP Educativo Generación Positiva AP Colectivos APCorto Plazo AP Individual y demás Ramos de Seguros autorizados a Positiva encontrándose excluidos del presente contrato los servicios y todas aquellas actividades procedimientos e intervenciones que no tengan por objeto contribuir al diagnóstico tratamiento o rehabilitación de la patología derivada del siniestro o los servicios considerados como experimentales cosméticos y suntuarios.","2022-09-01",{"$f":"MONTH(G500)","v":9},"2024-09-30",{"$f":"(I500-G500)/30","v":25.333333333333332},"Invitación directa","CargoAReserva",0,0,"NO",null,"Gerencia de Abastecimiento Estratégico\ncontratacion@positiva.gov.co\nPBX: (1)6502200 Ext: 10641","SI","SI","NO","SI",{"$f":"IF(U500=\"SI\",\"Pública clasificada\",\"Pública\")","v":"Pública clasificada"},{"$f":"CONCATENATE(D500,\"-\",\"Tipo de información\",\" \",V500,\"-\",F500)","v":"C65392022-Tipo de información Pública clasificada-Prestación de servicios: El CONTRATISTA se obliga con POSITIVA a la prestación de los servicios de salud para los asegurados y o afiliados a POSITIVA que accedan a los servicios habilitados del CONTRATISTA en calidad de asegurados a los ramos Administración de Riesgos Laborales ARL por causa exclusiva de un accidente de trabajo una enfermedad profesional) Accidentes Personales AP Educativo Generación Positiva AP Colectivos APCorto Plazo AP Individual y demás Ramos de Seguros autorizados a Positiva encontrándose excluidos del presente contrato los servicios y todas aquellas actividades procedimientos e intervenciones que no tengan por objeto contribuir al diagnóstico tratamiento o rehabilitación de la patología derivada del siniestro o los servicios considerados como experimentales cosméticos y suntuarios."}]
["VICEPRESIDENCIA TÉCNICA","Gerencia Médica","NO","C65402022",85100000,"Prestación de servicios: El CONTRATISTA se obliga con POSITIVA a la prestación de los servicios de salud para los asegurados y o afiliados a POSITIVA que accedan a los servicios habilitados del CONTRATISTA en calidad de asegurados a los ramos Administración de Riesgos Laborales ARL por causa exclusiva de un accidente de trabajo una enfermedad profesional) Accidentes Personales AP Educativo Generación Positiva AP Colectivos APCorto Plazo AP Individual y demás Ramos de Seguros autorizados a Positiva encontrándose excluidos del presente contrato los servicios y todas aquellas actividades procedimientos e intervenciones que no tengan por objeto contribuir al diagnóstico tratamiento o rehabilitación de la patología derivada del siniestro o los servicios considerados como experimentales cosméticos y suntuarios.","2022-09-01",{"$f":"MONTH(G501)","v":9},"2024-09-30",{"$f":"(I501-G501)/30","v":25.333333333333332},"Invitación directa","CargoAReserva",0,0,"NO",null,"Gerencia de Abastecimiento Estratégico\ncontratacion@positiva.gov.co\nPBX: (1)6502200 Ext: 10641","SI","SI","NO","SI",{"$f":"IF(U501=\"SI\",\"Pública clasificada\",\"Pública\")","v":"Pública clasificada"},{"$f":"CONCATENATE(D501,\"-\",\"Tipo de información\",\" \",V501,\"-\",F501)","v":"C65402022-Tipo de información Pública clasificada-Prestación de servicios: El CONTRATISTA se obliga con POSITIVA a la prestación de los servicios de salud para los asegurados y o afiliados a POSITIVA que accedan a los servicios habilitados del CONTRATISTA en calidad de asegurados a los ramos Administración de Riesgos Laborales ARL por causa exclusiva de un accidente de trabajo una enfermedad profesional) Accidentes Personales AP Educativo Generación Positiva AP Colectivos APCorto Plazo AP Individual y demás Ramos de Seguros autorizados a Positiva encontrándose excluidos del presente contrato los servicios y todas aquellas actividades procedimientos e intervenciones que no tengan por objeto contribuir al diagnóstico tratamiento o rehabilitación de la patología derivada del siniestro o los servicios considerados como experimentales cosméticos y suntuarios."}]
["VICEPRESIDENCIA TÉCNICA","Gerencia Médica","NO","C65412022",85100000,"Prestación de servicios: El CONTRATISTA se obliga con POSITIVA a la prestación de los servicios de salud para los asegurados y o afiliados a POSITIVA que accedan a los servicios habilitados del CONTRATISTA en calidad de asegurados a los ramos Administración de Riesgos Laborales ARL por causa exclusiva de un accidente de trabajo una enfermedad profesional) Accidentes Personales AP Educativo Generación Positiva AP Colectivos APCorto Plazo AP Individual y demás Ramos de Seguros autorizados a Positiva encontrándose excluidos del presente contrato los servicios y todas aquellas actividades procedimientos e intervenciones que no tengan por objeto contribuir al diagnóstico tratamiento o rehabilitación de la patología derivada del siniestro o los servicios considerados como experimentales cosméticos y suntuarios.","2022-09-02",{"$f":"MONTH(G502)","v":9},"2024-09-02",{"$f":"(I502-G502)/30","v":24.366666666666667},"Invitación directa","CargoAReserva",0,0,"NO",null,"Gerencia de Abastecimiento Estratégico\ncontratacion@positiva.gov.co\nPBX: (1)6502200 Ext: 10641","SI","SI","NO","SI",{"$f":"IF(U502=\"SI\",\"Pública clasificada\",\"Pública\")","v":"Pública clasificada"},{"$f":"CONCATENATE(D502,\"-\",\"Tipo de información\",\" \",V502,\"-\",F502)","v":"C65412022-Tipo de información Pública clasificada-Prestación de servicios: El CONTRATISTA se obliga con POSITIVA a la prestación de los servicios de salud para los asegurados y o afiliados a POSITIVA que accedan a los servicios habilitados del CONTRATISTA en calidad de asegurados a los ramos Administración de Riesgos Laborales ARL por causa exclusiva de un accidente de trabajo una enfermedad profesional) Accidentes Personales AP Educativo Generación Positiva AP Colectivos APCorto Plazo AP Individual y demás Ramos de Seguros autorizados a Positiva encontrándose excluidos del presente contrato los servicios y todas aquellas actividades procedimientos e intervenciones que no tengan por objeto contribuir al diagnóstico tratamiento o rehabilitación de la patología derivada del siniestro o los servicios considerados como experimentales cosméticos y suntuarios."}]
["VICEPRESIDENCIA TÉCNICA","Gerencia Médica","NO","C65422022",85100000,"Prestación de servicios: El CONTRATISTA se obliga con POSITIVA a la prestación de los servicios de salud para los asegurados y o afiliados a POSITIVA que accedan a los servicios habilitados del CONTRATISTA en calidad de asegurados a los ramos Administración de Riesgos Laborales ARL por causa exclusiva de un accidente de trabajo una enfermedad profesional) Accidentes Personales AP Educativo Generación Positiva AP Colectivos APCorto Plazo AP Individual y demás Ramos de Seguros autorizados a Positiva encontrándose excluidos del presente contrato los servicios y todas aquellas actividades procedimientos e intervenciones que no tengan por objeto contribuir al diagnóstico tratamiento o rehabilitación de la patología derivada del siniestro o los servicios considerados como experimentales cosméticos y suntuarios.","2022-10-01",{"$f":"MONTH(G503)","v":10},"2024-10-01",{"$f":"(I503-G503)/30","v":24.366666666666667},"Invitación directa","CargoAReserva",0,0,"NO",null,"Gerencia de Abastecimiento Estratégico\ncontratacion@positiva.gov.co\nPBX: (1)6502200 Ext: 10641","SI","SI","NO","SI",{"$f":"IF(U503=\"SI\",\"Pública clasificada\",\"Pública\")","v":"Pública clasificada"},{"$f":"CONCATENATE(D503,\"-\",\"Tipo de información\",\" \",V503,\"-\",F503)","v":"C65422022-Tipo de información Pública clasificada-Prestación de servicios: El CONTRATISTA se obliga con POSITIVA a la prestación de los servicios de salud para los asegurados y o afiliados a POSITIVA que accedan a los servicios habilitados del CONTRATISTA en calidad de asegurados a los ramos Administración de Riesgos Laborales ARL por causa exclusiva de un accidente de trabajo una enfermedad profesional) Accidentes Personales AP Educativo Generación Positiva AP Colectivos APCorto Plazo AP Individual y demás Ramos de Seguros autorizados a Positiva encontrándose excluidos del presente contrato los servicios y todas aquellas actividades procedimientos e intervenciones que no tengan por objeto contribuir al diagnóstico tratamiento o rehabilitación de la patología derivada del siniestro o los servicios considerados como experimentales cosméticos y suntuarios."}]
["VICEPRESIDENCIA TÉCNICA","Gerencia Médica","NO","C65432022",85100000,"Prestación de servicios: El CONTRATISTA se obliga con POSITIVA a la prestación de los servicios de salud para los asegurados y o afiliados a POSITIVA que accedan a los servicios habilitados del CONTRATISTA en calidad de asegurados a los ramos Administración de Riesgos Laborales ARL por causa exclusiva de un accidente de trabajo una enfermedad profesional) Accidentes Personales AP Educativo Generación Positiva AP Colectivos APCorto Plazo AP Individual y demás Ramos de Seguros autorizados a Positiva encontrándose excluidos del presente contrato los servicios y todas aquellas actividades procedimientos e intervenciones que no tengan por objeto contribuir al diagnóstico tratamiento o rehabilitación de la patología derivada del siniestro o los servicios considerados como experimentales cosméticos y suntuarios.","2022-11-01",{"$f":"MONTH(G504)","v":11},"2024-11-01",{"$f":"(I504-G504)/30","v":24.366666666666667},"Invitación directa","CargoAReserva",0,0,"NO",null,"Gerencia de Abastecimiento Estratégico\ncontratacion@positiva.gov.co\nPBX: (1)6502200 Ext: 10641","SI","SI","NO","SI",{"$f":"IF(U504=\"SI\",\"Pública clasificada\",\"Pública\")","v":"Pública clasificada"},{"$f":"CONCATENATE(D504,\"-\",\"Tipo de información\",\" \",V504,\"-\",F504)","v":"C65432022-Tipo de información Pública clasificada-Prestación de servicios: El CONTRATISTA se obliga con POSITIVA a la prestación de los servicios de salud para los asegurados y o afiliados a POSITIVA que accedan a los servicios habilitados del CONTRATISTA en calidad de asegurados a los ramos Administración de Riesgos Laborales ARL por causa exclusiva de un accidente de trabajo una enfermedad profesional) Accidentes Personales AP Educativo Generación Positiva AP Colectivos APCorto Plazo AP Individual y demás Ramos de Seguros autorizados a Positiva encontrándose excluidos del presente contrato los servicios y todas aquellas actividades procedimientos e intervenciones que no tengan por objeto contribuir al diagnóstico tratamiento o rehabilitación de la patología derivada del siniestro o los servicios considerados como experimentales cosméticos y suntuarios."}]
["VICEPRESIDENCIA TÉCNICA","Gerencia Médica","NO","C65442022",85100000,"Prestación de servicios: El CONTRATISTA se obliga con POSITIVA a la prestación de los servicios de salud para los asegurados y o afiliados a POSITIVA que accedan a los servicios habilitados del CONTRATISTA en calidad de asegurados a los ramos Administración de Riesgos Laborales ARL por causa exclusiva de un accidente de trabajo una enfermedad profesional) Accidentes Personales AP Educativo Generación Positiva AP Colectivos APCorto Plazo AP Individual y demás Ramos de Seguros autorizados a Positiva encontrándose excluidos del presente contrato los servicios y todas aquellas actividades procedimientos e intervenciones que no tengan por objeto contribuir al diagnóstico tratamiento o rehabilitación de la patología derivada del siniestro o los servicios considerados como experimentales cosméticos y suntuarios.","2022-07-01",{"$f":"MONTH(G505)","v":7},"2027-07-01",{"$f":"(I505-G505)/30","v":60.866666666666667},"Invitación directa","CargoAReserva",0,0,"NO",null,"Gerencia de Abastecimiento Estratégico\ncontratacion@positiva.gov.co\nPBX: (1)6502200 Ext: 10641","SI","SI","NO","SI",{"$f":"IF(U505=\"SI\",\"Pública clasificada\",\"Pública\")","v":"Pública clasificada"},{"$f":"CONCATENATE(D505,\"-\",\"Tipo de información\",\" \",V505,\"-\",F505)","v":"C65442022-Tipo de información Pública clasificada-Prestación de servicios: El CONTRATISTA se obliga con POSITIVA a la prestación de los servicios de salud para los asegurados y o afiliados a POSITIVA que accedan a los servicios habilitados del CONTRATISTA en calidad de asegurados a los ramos Administración de Riesgos Laborales ARL por causa exclusiva de un accidente de trabajo una enfermedad profesional) Accidentes Personales AP Educativo Generación Positiva AP Colectivos APCorto Plazo AP Individual y demás Ramos de Seguros autorizados a Positiva encontrándose excluidos del presente contrato los servicios y todas aquellas actividades procedimientos e intervenciones que no tengan por objeto contribuir al diagnóstico tratamiento o rehabilitación de la patología derivada del siniestro o los servicios considerados como experimentales cosméticos y suntuarios."}]
["VICEPRESIDENCIA TÉCNICA","Gerencia Médica","NO","C65452022",85100000,"Prestación de servicios: El CONTRATISTA se obliga con POSITIVA a la prestación de los servicios de salud para los asegurados y o afiliados a POSITIVA que accedan a los servicios habilitados del CONTRATISTA en calidad de asegurados a los ramos Administración de Riesgos Laborales ARL por causa exclusiva de un accidente de trabajo una enfermedad profesional) Accidentes Personales AP Educativo Generación Positiva AP Colectivos APCorto Plazo AP Individual y demás Ramos de Seguros autorizados a Positiva encontrándose excluidos del presente contrato los servicios y todas aquellas actividades procedimientos e intervenciones que no tengan por objeto contribuir al diagnóstico tratamiento o rehabilitación de la patología derivada del siniestro o los servicios considerados como experimentales cosméticos y suntuarios.","2022-03-01",{"$f":"MONTH(G506)","v":3},"2024-03-01",{"$f":"(I506-G506)/30","v":24.366666666666667},"Invitación directa","CargoAReserva",0,0,"NO",null,"Gerencia de Abastecimiento Estratégico\ncontratacion@positiva.gov.co\nPBX: (1)6502200 Ext: 10641","SI","SI","NO","SI",{"$f":"IF(U506=\"SI\",\"Pública clasificada\",\"Pública\")","v":"Pública clasificada"},{"$f":"CONCATENATE(D506,\"-\",\"Tipo de información\",\" \",V506,\"-\",F506)","v":"C65452022-Tipo de información Pública clasificada-Prestación de servicios: El CONTRATISTA se obliga con POSITIVA a la prestación de los servicios de salud para los asegurados y o afiliados a POSITIVA que accedan a los servicios habilitados del CONTRATISTA en calidad de asegurados a los ramos Administración de Riesgos Laborales ARL por causa exclusiva de un accidente de trabajo una enfermedad profesional) Accidentes Personales AP Educativo Generación Positiva AP Colectivos APCorto Plazo AP Individual y demás Ramos de Seguros autorizados a Positiva encontrándose excluidos del presente contrato los servicios y todas aquellas actividades procedimientos e intervenciones que no tengan por objeto contribuir al diagnóstico tratamiento o rehabilitación de la patología derivada del siniestro o los servicios considerados como experimentales cosméticos y suntuarios."}]
["VICEPRESIDENCIA TÉCNICA","Gerencia Médica","NO","C65462022",85100000,"Prestación de servicios: El CONTRATISTA se obliga con POSITIVA a la prestación de los servicios de salud para los asegurados y o afiliados a POSITIVA que accedan a los servicios habilitados del CONTRATISTA en calidad de asegurados a los ramos Administración de Riesgos Laborales ARL por causa exclusiva de un accidente de trabajo una enfermedad profesional) Accidentes Personales AP Educativo Generación Positiva AP Colectivos APCorto Plazo AP Individual y demás Ramos de Seguros autorizados a Positiva encontrándose excluidos del presente contrato los servicios y todas aquellas actividades procedimientos e intervenciones que no tengan por objeto contribuir al diagnóstico tratamiento o rehabilitación de la patología derivada del siniestro o los servicios considerados como experimentales cosméticos y suntuarios.","2022-04-01",{"$f":"MONTH(G507)","v":4},"2024-04-01",{"$f":"(I507-G507)/30","v":24.366666666666667},"Invitación directa","CargoAReserva",0,0,"NO",null,"Gerencia de Abastecimiento Estratégico\ncontratacion@positiva.gov.co\nPBX: (1)6502200 Ext: 10641","SI","SI","NO","SI",{"$f":"IF(U507=\"SI\",\"Pública clasificada\",\"Pública\")","v":"Pública clasificada"},{"$f":"CONCATENATE(D507,\"-\",\"Tipo de información\",\" \",V507,\"-\",F507)","v":"C65462022-Tipo de información Pública clasificada-Prestación de servicios: El CONTRATISTA se obliga con POSITIVA a la prestación de los servicios de salud para los asegurados y o afiliados a POSITIVA que accedan a los servicios habilitados del CONTRATISTA en calidad de asegurados a los ramos Administración de Riesgos Laborales ARL por causa exclusiva de un accidente de trabajo una enfermedad profesional) Accidentes Personales AP Educativo Generación Positiva AP Colectivos APCorto Plazo AP Individual y demás Ramos de Seguros autorizados a Positiva encontrándose excluidos del presente contrato los servicios y todas aquellas actividades procedimientos e intervenciones que no tengan por objeto contribuir al diagnóstico tratamiento o rehabilitación de la patología derivada del siniestro o los servicios considerados como experimentales cosméticos y suntuarios."}]
["VICEPRESIDENCIA TÉCNICA","Gerencia Médica","NO","C65472022",85100000,"Prestación de servicios: El CONTRATISTA se obliga con POSITIVA a la prestación de los servicios de salud para los asegurados y o afiliados a POSITIVA que accedan a los servicios habilitados del CONTRATISTA en calidad de asegurados a los ramos Administración de Riesgos Laborales ARL por causa exclusiva de un accidente de trabajo una enfermedad profesional) Accidentes Personales AP Educativo Generación Positiva AP Colectivos APCorto Plazo AP Individual y demás Ramos de Seguros autorizados a Positiva encontrándose excluidos del presente contrato los servicios y todas aquellas actividades procedimientos e intervenciones que no tengan por objeto contribuir al diagnóstico tratamiento o rehabilitación de la patología derivada del siniestro o los servicios considerados como experimentales cosméticos y suntuarios.","2022-09-01",{"$f":"MONTH(G508)","v":9},"2024-09-30",{"$f":"(I508-G508)/30","v":25.333333333333332},"Invitación directa","CargoAReserva",0,0,"NO",null,"Gerencia de Abastecimiento Estratégico\ncontratacion@positiva.gov.co\nPBX: (1)6502200 Ext: 10641","SI","SI","NO","SI",{"$f":"IF(U508=\"SI\",\"Pública clasificada\",\"Pública\")","v":"Pública clasificada"},{"$f":"CONCATENATE(D508,\"-\",\"Tipo de información\",\" \",V508,\"-\",F508)","v":"C65472022-Tipo de información Pública clasificada-Prestación de servicios: El CONTRATISTA se obliga con POSITIVA a la prestación de los servicios de salud para los asegurados y o afiliados a POSITIVA que accedan a los servicios habilitados del CONTRATISTA en calidad de asegurados a los ramos Administración de Riesgos Laborales ARL por causa exclusiva de un accidente de trabajo una enfermedad profesional) Accidentes Personales AP Educativo Generación Positiva AP Colectivos APCorto Plazo AP Individual y demás Ramos de Seguros autorizados a Positiva encontrándose excluidos del presente contrato los servicios y todas aquellas actividades procedimientos e intervenciones que no tengan por objeto contribuir al diagnóstico tratamiento o rehabilitación de la patología derivada del siniestro o los servicios considerados como experimentales cosméticos y suntuarios."}]
["VICEPRESIDENCIA TÉCNICA","Gerencia Médica","NO","C65482022",85100000,"Prestación de servicios: El CONTRATISTA se obliga con POSITIVA a la prestación de los servicios de salud para los asegurados y o afiliados a POSITIVA que accedan a los servicios habilitados del CONTRATISTA en calidad de asegurados a los ramos Administración de Riesgos Laborales ARL por causa exclusiva de un accidente de trabajo una enfermedad profesional) Accidentes Personales AP Educativo Generación Positiva AP Colectivos APCorto Plazo AP Individual y demás Ramos de Seguros autorizados a Positiva encontrándose excluidos del presente contrato los servicios y todas aquellas actividades procedimientos e intervenciones que no tengan por objeto contribuir al diagnóstico tratamiento o rehabilitación de la patología derivada del siniestro o los servicios considerados como experimentales cosméticos y suntuarios.","2022-09-01",{"$f":"MONTH(G509)","v":9},"2024-09-30",{"$f":"(I509-G509)/30","v":25.333333333333332},"Invitación directa","CargoAReserva",0,0,"NO",null,"Gerencia de Abastecimiento Estratégico\ncontratacion@positiva.gov.co\nPBX: (1)6502200 Ext: 10641","SI","SI","NO","SI",{"$f":"IF(U509=\"SI\",\"Pública clasificada\",\"Pública\")","v":"Pública clasificada"},{"$f":"CONCATENATE(D509,\"-\",\"Tipo de información\",\" \",V509,\"-\",F509)","v":"C65482022-Tipo de información Pública clasificada-Prestación de servicios: El CONTRATISTA se obliga con POSITIVA a la prestación de los servicios de salud para los asegurados y o afiliados a POSITIVA que accedan a los servicios habilitados del CONTRATISTA en calidad de asegurados a los ramos Administración de Riesgos Laborales ARL por causa exclusiva de un accidente de trabajo una enfermedad profesional) Accidentes Personales AP Educativo Generación Positiva AP Colectivos APCorto Plazo AP Individual y demás Ramos de Seguros autorizados a Positiva encontrándose excluidos del presente contrato los servicios y todas aquellas actividades procedimientos e intervenciones que no tengan por objeto contribuir al diagnóstico tratamiento o rehabilitación de la patología derivada del siniestro o los servicios considerados como experimentales cosméticos y suntuarios."}]
["VICEPRESIDENCIA TÉCNICA","Gerencia Médica","NO","C65492022",85100000,"Prestación de servicios: El CONTRATISTA se obliga con POSITIVA a la prestación de los servicios de salud para los asegurados y o afiliados a POSITIVA que accedan a los servicios habilitados del CONTRATISTA en calidad de asegurados a los ramos Administración de Riesgos Laborales ARL por causa exclusiva de un accidente de trabajo una enfermedad profesional) Accidentes Personales AP Educativo Generación Positiva AP Colectivos APCorto Plazo AP Individual y demás Ramos de Seguros autorizados a Positiva encontrándose excluidos del presente contrato los servicios y todas aquellas actividades procedimientos e intervenciones que no tengan por objeto contribuir al diagnóstico tratamiento o rehabilitación de la patología derivada del siniestro o los servicios considerados como experimentales cosméticos y suntuarios.","2022-09-01",{"$f":"MONTH(G510)","v":9},"2024-09-30",{"$f":"(I510-G510)/30","v":25.333333333333332},"Invitación directa","CargoAReserva",0,0,"NO",null,"Gerencia de Abastecimiento Estratégico\ncontratacion@positiva.gov.co\nPBX: (1)6502200 Ext: 10641","SI","SI","NO","SI",{"$f":"IF(U510=\"SI\",\"Pública clasificada\",\"Pública\")","v":"Pública clasificada"},{"$f":"CONCATENATE(D510,\"-\",\"Tipo de información\",\" \",V510,\"-\",F510)","v":"C65492022-Tipo de información Pública clasificada-Prestación de servicios: El CONTRATISTA se obliga con POSITIVA a la prestación de los servicios de salud para los asegurados y o afiliados a POSITIVA que accedan a los servicios habilitados del CONTRATISTA en calidad de asegurados a los ramos Administración de Riesgos Laborales ARL por causa exclusiva de un accidente de trabajo una enfermedad profesional) Accidentes Personales AP Educativo Generación Positiva AP Colectivos APCorto Plazo AP Individual y demás Ramos de Seguros autorizados a Positiva encontrándose excluidos del presente contrato los servicios y todas aquellas actividades procedimientos e intervenciones que no tengan por objeto contribuir al diagnóstico tratamiento o rehabilitación de la patología derivada del siniestro o los servicios considerados como experimentales cosméticos y suntuarios."}]
["VICEPRESIDENCIA TÉCNICA","Gerencia Médica","NO","C65502022",85100000,"Prestación de servicios: El CONTRATISTA se obliga con POSITIVA a la prestación de los servicios de salud para los asegurados y o afiliados a POSITIVA que accedan a los servicios habilitados del CONTRATISTA en calidad de asegurados a los ramos Administración de Riesgos Laborales ARL por causa exclusiva de un accidente de trabajo una enfermedad profesional) Accidentes Personales AP Educativo Generación Positiva AP Colectivos APCorto Plazo AP Individual y demás Ramos de Seguros autorizados a Positiva encontrándose excluidos del presente contrato los servicios y todas aquellas actividades procedimientos e intervenciones que no tengan por objeto contribuir al diagnóstico tratamiento o rehabilitación de la patología derivada del siniestro o los servicios considerados como experimentales cosméticos y suntuarios.","2022-06-30",{"$f":"MONTH(G511)","v":6},"2024-06-30",{"$f":"(I511-G511)/30","v":24.366666666666667},"Invitación directa","CargoAReserva",0,0,"NO",null,"Gerencia de Abastecimiento Estratégico\ncontratacion@positiva.gov.co\nPBX: (1)6502200 Ext: 10641","SI","SI","NO","SI",{"$f":"IF(U511=\"SI\",\"Pública clasificada\",\"Pública\")","v":"Pública clasificada"},{"$f":"CONCATENATE(D511,\"-\",\"Tipo de información\",\" \",V511,\"-\",F511)","v":"C65502022-Tipo de información Pública clasificada-Prestación de servicios: El CONTRATISTA se obliga con POSITIVA a la prestación de los servicios de salud para los asegurados y o afiliados a POSITIVA que accedan a los servicios habilitados del CONTRATISTA en calidad de asegurados a los ramos Administración de Riesgos Laborales ARL por causa exclusiva de un accidente de trabajo una enfermedad profesional) Accidentes Personales AP Educativo Generación Positiva AP Colectivos APCorto Plazo AP Individual y demás Ramos de Seguros autorizados a Positiva encontrándose excluidos del presente contrato los servicios y todas aquellas actividades procedimientos e intervenciones que no tengan por objeto contribuir al diagnóstico tratamiento o rehabilitación de la patología derivada del siniestro o los servicios considerados como experimentales cosméticos y suntuarios."}]
["VICEPRESIDENCIA TÉCNICA","Gerencia Médica","NO","C65512022",85100000,"Prestación de servicios: El CONTRATISTA se obliga con POSITIVA a la prestación de los servicios de salud para los asegurados y o afiliados a POSITIVA que accedan a los servicios habilitados del CONTRATISTA en calidad de asegurados a los ramos Administración de Riesgos Laborales ARL por causa exclusiva de un accidente de trabajo una enfermedad profesional) Accidentes Personales AP Educativo Generación Positiva AP Colectivos APCorto Plazo AP Individual y demás Ramos de Seguros autorizados a Positiva encontrándose excluidos del presente contrato los servicios y todas aquellas actividades procedimientos e intervenciones que no tengan por objeto contribuir al diagnóstico tratamiento o rehabilitación de la patología derivada del siniestro o los servicios considerados como experimentales cosméticos y suntuarios.","2022-04-20",{"$f":"MONTH(G512)","v":4},"2024-04-20",{"$f":"(I512-G512)/30","v":24.366666666666667},"Invitación directa","CargoAReserva",0,0,"NO",null,"Gerencia de Abastecimiento Estratégico\ncontratacion@positiva.gov.co\nPBX: (1)6502200 Ext: 10641","SI","SI","NO","SI",{"$f":"IF(U512=\"SI\",\"Pública clasificada\",\"Pública\")","v":"Pública clasificada"},{"$f":"CONCATENATE(D512,\"-\",\"Tipo de información\",\" \",V512,\"-\",F512)","v":"C65512022-Tipo de información Pública clasificada-Prestación de servicios: El CONTRATISTA se obliga con POSITIVA a la prestación de los servicios de salud para los asegurados y o afiliados a POSITIVA que accedan a los servicios habilitados del CONTRATISTA en calidad de asegurados a los ramos Administración de Riesgos Laborales ARL por causa exclusiva de un accidente de trabajo una enfermedad profesional) Accidentes Personales AP Educativo Generación Positiva AP Colectivos APCorto Plazo AP Individual y demás Ramos de Seguros autorizados a Positiva encontrándose excluidos del presente contrato los servicios y todas aquellas actividades procedimientos e intervenciones que no tengan por objeto contribuir al diagnóstico tratamiento o rehabilitación de la patología derivada del siniestro o los servicios considerados como experimentales cosméticos y suntuarios."}]
["VICEPRESIDENCIA TÉCNICA","Gerencia Médica","NO","C65522022",85100000,"Prestación de servicios: El CONTRATISTA se obliga con POSITIVA a la prestación de los servicios de salud para los asegurados y o afiliados a POSITIVA que accedan a los servicios habilitados del CONTRATISTA en calidad de asegurados a los ramos Administración de Riesgos Laborales ARL por causa exclusiva de un accidente de trabajo una enfermedad profesional) Accidentes Personales AP Educativo Generación Positiva AP Colectivos APCorto Plazo AP Individual y demás Ramos de Seguros autorizados a Positiva encontrándose excluidos del presente contrato los servicios y todas aquellas actividades procedimientos e intervenciones que no tengan por objeto contribuir al diagnóstico tratamiento o rehabilitación de la patología derivada del siniestro o los servicios considerados como experimentales cosméticos y suntuarios.","2022-10-25",{"$f":"MONTH(G513)","v":10},"2024-10-25",{"$f":"(I513-G513)/30","v":24.366666666666667},"Invitación directa","CargoAReserva",0,0,"NO",null,"Gerencia de Abastecimiento Estratégico\ncontratacion@positiva.gov.co\nPBX: (1)6502200 Ext: 10641","SI","SI","NO","SI",{"$f":"IF(U513=\"SI\",\"Pública clasificada\",\"Pública\")","v":"Pública clasificada"},{"$f":"CONCATENATE(D513,\"-\",\"Tipo de información\",\" \",V513,\"-\",F513)","v":"C65522022-Tipo de información Pública clasificada-Prestación de servicios: El CONTRATISTA se obliga con POSITIVA a la prestación de los servicios de salud para los asegurados y o afiliados a POSITIVA que accedan a los servicios habilitados del CONTRATISTA en calidad de asegurados a los ramos Administración de Riesgos Laborales ARL por causa exclusiva de un accidente de trabajo una enfermedad profesional) Accidentes Personales AP Educativo Generación Positiva AP Colectivos APCorto Plazo AP Individual y demás Ramos de Seguros autorizados a Positiva encontrándose excluidos del presente contrato los servicios y todas aquellas actividades procedimientos e intervenciones que no tengan por objeto contribuir al diagnóstico tratamiento o rehabilitación de la patología derivada del siniestro o los servicios considerados como experimentales cosméticos y suntuarios."}]
["VICEPRESIDENCIA TÉCNICA","Gerencia Médica","NO","C65532022",85100000,"Prestación de servicios: El CONTRATISTA se obliga con POSITIVA a la prestación de los servicios de salud para los asegurados y o afiliados a POSITIVA que accedan a los servicios habilitados del CONTRATISTA en calidad de asegurados a los ramos Administración de Riesgos Laborales ARL por causa exclusiva de un accidente de trabajo una enfermedad profesional) Accidentes Personales AP Educativo Generación Positiva AP Colectivos APCorto Plazo AP Individual y demás Ramos de Seguros autorizados a Positiva encontrándose excluidos del presente contrato los servicios y todas aquellas actividades procedimientos e intervenciones que no tengan por objeto contribuir al diagnóstico tratamiento o rehabilitación de la patología derivada del siniestro o los servicios considerados como experimentales cosméticos y suntuarios.","2022-03-22",{"$f":"MONTH(G514)","v":3},"2024-03-22",{"$f":"(I514-G514)/30","v":24.366666666666667},"Invitación directa","CargoAReserva",0,0,"NO",null,"Gerencia de Abastecimiento Estratégico\ncontratacion@positiva.gov.co\nPBX: (1)6502200 Ext: 10641","SI","SI","NO","SI",{"$f":"IF(U514=\"SI\",\"Pública clasificada\",\"Pública\")","v":"Pública clasificada"},{"$f":"CONCATENATE(D514,\"-\",\"Tipo de información\",\" \",V514,\"-\",F514)","v":"C65532022-Tipo de información Pública clasificada-Prestación de servicios: El CONTRATISTA se obliga con POSITIVA a la prestación de los servicios de salud para los asegurados y o afiliados a POSITIVA que accedan a los servicios habilitados del CONTRATISTA en calidad de asegurados a los ramos Administración de Riesgos Laborales ARL por causa exclusiva de un accidente de trabajo una enfermedad profesional) Accidentes Personales AP Educativo Generación Positiva AP Colectivos APCorto Plazo AP Individual y demás Ramos de Seguros autorizados a Positiva encontrándose excluidos del presente contrato los servicios y todas aquellas actividades procedimientos e intervenciones que no tengan por objeto contribuir al diagnóstico tratamiento o rehabilitación de la patología derivada del siniestro o los servicios considerados como experimentales cosméticos y suntuarios."}]
["VICEPRESIDENCIA TÉCNICA","Gerencia Médica","NO","C65542022",85100000,"Prestación de servicios: El CONTRATISTA se obliga con POSITIVA a la prestación de los servicios de salud para los asegurados y o afiliados a POSITIVA que accedan a los servicios habilitados del CONTRATISTA en calidad de asegurados a los ramos Administración de Riesgos Laborales ARL por causa exclusiva de un accidente de trabajo una enfermedad profesional) Accidentes Personales AP Educativo Generación Positiva AP Colectivos APCorto Plazo AP Individual y demás Ramos de Seguros autorizados a Positiva encontrándose excluidos del presente contrato los servicios y todas aquellas actividades procedimientos e intervenciones que no tengan por objeto contribuir al diagnóstico tratamiento o rehabilitación de la patología derivada del siniestro o los servicios considerados como experimentales cosméticos y suntuarios.","2022-10-02",{"$f":"MONTH(G515)","v":10},"2024-10-02",{"$f":"(I515-G515)/30","v":24.366666666666667},"Invitación directa","CargoAReserva",0,0,"NO",null,"Gerencia de Abastecimiento Estratégico\ncontratacion@positiva.gov.co\nPBX: (1)6502200 Ext: 10641","SI","SI","NO","SI",{"$f":"IF(U515=\"SI\",\"Pública clasificada\",\"Pública\")","v":"Pública clasificada"},{"$f":"CONCATENATE(D515,\"-\",\"Tipo de información\",\" \",V515,\"-\",F515)","v":"C65542022-Tipo de información Pública clasificada-Prestación de servicios: El CONTRATISTA se obliga con POSITIVA a la prestación de los servicios de salud para los asegurados y o afiliados a POSITIVA que accedan a los servicios habilitados del CONTRATISTA en calidad de asegurados a los ramos Administración de Riesgos Laborales ARL por causa exclusiva de un accidente de trabajo una enfermedad profesional) Accidentes Personales AP Educativo Generación Positiva AP Colectivos APCorto Plazo AP Individual y demás Ramos de Seguros autorizados a Positiva encontrándose excluidos del presente contrato los servicios y todas aquellas actividades procedimientos e intervenciones que no tengan por objeto contribuir al diagnóstico tratamiento o rehabilitación de la patología derivada del siniestro o los servicios considerados como experimentales cosméticos y suntuarios."}]
["VICEPRESIDENCIA TÉCNICA","Gerencia Médica","NO","C65552022",85100000,"Prestación de servicios: El CONTRATISTA se obliga con POSITIVA a la prestación de los servicios de salud para los asegurados y o afiliados a POSITIVA que accedan a los servicios habilitados del CONTRATISTA en calidad de asegurados a los ramos Administración de Riesgos Laborales ARL por causa exclusiva de un accidente de trabajo una enfermedad profesional) Accidentes Personales AP Educativo Generación Positiva AP Colectivos APCorto Plazo AP Individual y demás Ramos de Seguros autorizados a Positiva encontrándose excluidos del presente contrato los servicios y todas aquellas actividades procedimientos e intervenciones que no tengan por objeto contribuir al diagnóstico tratamiento o rehabilitación de la patología derivada del siniestro o los servicios considerados como experimentales cosméticos y suntuarios.","2022-08-22",{"$f":"MONTH(G516)","v":8},"2024-08-22",{"$f":"(I516-G516)/30","v":24.366666666666667},"Invitación directa","CargoAReserva",0,0,"NO",null,"Gerencia de Abastecimiento Estratégico\ncontratacion@positiva.gov.co\nPBX: (1)6502200 Ext: 10641","SI","SI","NO","SI",{"$f":"IF(U516=\"SI\",\"Pública clasificada\",\"Pública\")","v":"Pública clasificada"},{"$f":"CONCATENATE(D516,\"-\",\"Tipo de información\",\" \",V516,\"-\",F516)","v":"C65552022-Tipo de información Pública clasificada-Prestación de servicios: El CONTRATISTA se obliga con POSITIVA a la prestación de los servicios de salud para los asegurados y o afiliados a POSITIVA que accedan a los servicios habilitados del CONTRATISTA en calidad de asegurados a los ramos Administración de Riesgos Laborales ARL por causa exclusiva de un accidente de trabajo una enfermedad profesional) Accidentes Personales AP Educativo Generación Positiva AP Colectivos APCorto Plazo AP Individual y demás Ramos de Seguros autorizados a Positiva encontrándose excluidos del presente contrato los servicios y todas aquellas actividades procedimientos e intervenciones que no tengan por objeto contribuir al diagnóstico tratamiento o rehabilitación de la patología derivada del siniestro o los servicios considerados como experimentales cosméticos y suntuarios."}]
["VICEPRESIDENCIA TÉCNICA","Gerencia Médica","NO","C65562022",85100000,"Prestación de servicios: El CONTRATISTA se obliga con POSITIVA a la prestación de los servicios de salud para los asegurados y o afiliados a POSITIVA que accedan a los servicios habilitados del CONTRATISTA en calidad de asegurados a los ramos Administración de Riesgos Laborales ARL por causa exclusiva de un accidente de trabajo una enfermedad profesional) Accidentes Personales AP Educativo Generación Positiva AP Colectivos APCorto Plazo AP Individual y demás Ramos de Seguros autorizados a Positiva encontrándose excluidos del presente contrato los servicios y todas aquellas actividades procedimientos e intervenciones que no tengan por objeto contribuir al diagnóstico tratamiento o rehabilitación de la patología derivada del siniestro o los servicios considerados como experimentales cosméticos y suntuarios.","2022-08-01",{"$f":"MONTH(G517)","v":8},"2027-08-01",{"$f":"(I517-G517)/30","v":60.866666666666667},"Invitación directa","CargoAReserva",0,0,"NO",null,"Gerencia de Abastecimiento Estratégico\ncontratacion@positiva.gov.co\nPBX: (1)6502200 Ext: 10641","SI","SI","NO","SI",{"$f":"IF(U517=\"SI\",\"Pública clasificada\",\"Pública\")","v":"Pública clasificada"},{"$f":"CONCATENATE(D517,\"-\",\"Tipo de información\",\" \",V517,\"-\",F517)","v":"C65562022-Tipo de información Pública clasificada-Prestación de servicios: El CONTRATISTA se obliga con POSITIVA a la prestación de los servicios de salud para los asegurados y o afiliados a POSITIVA que accedan a los servicios habilitados del CONTRATISTA en calidad de asegurados a los ramos Administración de Riesgos Laborales ARL por causa exclusiva de un accidente de trabajo una enfermedad profesional) Accidentes Personales AP Educativo Generación Positiva AP Colectivos APCorto Plazo AP Individual y demás Ramos de Seguros autorizados a Positiva encontrándose excluidos del presente contrato los servicios y todas aquellas actividades procedimientos e intervenciones que no tengan por objeto contribuir al diagnóstico tratamiento o rehabilitación de la patología derivada del siniestro o los servicios considerados como experimentales cosméticos y suntuarios."}]
["VICEPRESIDENCIA TÉCNICA","Gerencia Médica","NO","C65572022",85100000,"Prestación de servicios: El CONTRATISTA se obliga con POSITIVA a la prestación de los servicios de salud para los asegurados y o afiliados a POSITIVA que accedan a los servicios habilitados del CONTRATISTA en calidad de asegurados a los ramos Administración de Riesgos Laborales ARL por causa exclusiva de un accidente de trabajo una enfermedad profesional) Accidentes Personales AP Educativo Generación Positiva AP Colectivos APCorto Plazo AP Individual y demás Ramos de Seguros autorizados a Positiva encontrándose excluidos del presente contrato los servicios y todas aquellas actividades procedimientos e intervenciones que no tengan por objeto contribuir al diagnóstico tratamiento o rehabilitación de la patología derivada del siniestro o los servicios considerados como experimentales cosméticos y suntuarios.","2022-07-28",{"$f":"MONTH(G518)","v":7},"2024-07-28",{"$f":"(I518-G518)/30","v":24.366666666666667},"Invitación directa","CargoAReserva",0,0,"NO",null,"Gerencia de Abastecimiento Estratégico\ncontratacion@positiva.gov.co\nPBX: (1)6502200 Ext: 10641","SI","SI","NO","SI",{"$f":"IF(U518=\"SI\",\"Pública clasificada\",\"Pública\")","v":"Pública clasificada"},{"$f":"CONCATENATE(D518,\"-\",\"Tipo de información\",\" \",V518,\"-\",F518)","v":"C65572022-Tipo de información Pública clasificada-Prestación de servicios: El CONTRATISTA se obliga con POSITIVA a la prestación de los servicios de salud para los asegurados y o afiliados a POSITIVA que accedan a los servicios habilitados del CONTRATISTA en calidad de asegurados a los ramos Administración de Riesgos Laborales ARL por causa exclusiva de un accidente de trabajo una enfermedad profesional) Accidentes Personales AP Educativo Generación Positiva AP Colectivos APCorto Plazo AP Individual y demás Ramos de Seguros autorizados a Positiva encontrándose excluidos del presente contrato los servicios y todas aquellas actividades procedimientos e intervenciones que no tengan por objeto contribuir al diagnóstico tratamiento o rehabilitación de la patología derivada del siniestro o los servicios considerados como experimentales cosméticos y suntuarios."}]
["VICEPRESIDENCIA TÉCNICA","Gerencia Médica","NO","C65592022",85100000,"Prestación de servicios: El CONTRATISTA se obliga con POSITIVA a la prestación de los servicios de salud para los asegurados y o afiliados a POSITIVA que accedan a los servicios habilitados del CONTRATISTA en calidad de asegurados a los ramos Administración de Riesgos Laborales ARL por causa exclusiva de un accidente de trabajo una enfermedad profesional) Accidentes Personales AP Educativo Generación Positiva AP Colectivos APCorto Plazo AP Individual y demás Ramos de Seguros autorizados a Positiva encontrándose excluidos del presente contrato los servicios y todas aquellas actividades procedimientos e intervenciones que no tengan por objeto contribuir al diagnóstico tratamiento o rehabilitación de la patología derivada del siniestro o los servicios considerados como experimentales cosméticos y suntuarios.","2022-07-01",{"$f":"MONTH(G519)","v":7},"2024-07-01",{"$f":"(I519-G519)/30","v":24.366666666666667},"Invitación directa","CargoAReserva",0,0,"NO",null,"Gerencia de Abastecimiento Estratégico\ncontratacion@positiva.gov.co\nPBX: (1)6502200 Ext: 10641","SI","SI","NO","SI",{"$f":"IF(U519=\"SI\",\"Pública clasificada\",\"Pública\")","v":"Pública clasificada"},{"$f":"CONCATENATE(D519,\"-\",\"Tipo de información\",\" \",V519,\"-\",F519)","v":"C65592022-Tipo de información Pública clasificada-Prestación de servicios: El CONTRATISTA se obliga con POSITIVA a la prestación de los servicios de salud para los asegurados y o afiliados a POSITIVA que accedan a los servicios habilitados del CONTRATISTA en calidad de asegurados a los ramos Administración de Riesgos Laborales ARL por causa exclusiva de un accidente de trabajo una enfermedad profesional) Accidentes Personales AP Educativo Generación Positiva AP Colectivos APCorto Plazo AP Individual y demás Ramos de Seguros autorizados a Positiva encontrándose excluidos del presente contrato los servicios y todas aquellas actividades procedimientos e intervenciones que no tengan por objeto contribuir al diagnóstico tratamiento o rehabilitación de la patología derivada del siniestro o los servicios considerados como experimentales cosméticos y suntuarios."}]
["VICEPRESIDENCIA TÉCNICA","Gerencia Médica","NO","C65602022",85100000,"Prestación de servicios: El CONTRATISTA se obliga con POSITIVA a la prestación de los servicios de salud para los asegurados y o afiliados a POSITIVA que accedan a los servicios habilitados del CONTRATISTA en calidad de asegurados a los ramos Administración de Riesgos Laborales ARL por causa exclusiva de un accidente de trabajo una enfermedad profesional) Accidentes Personales AP Educativo Generación Positiva AP Colectivos APCorto Plazo AP Individual y demás Ramos de Seguros autorizados a Positiva encontrándose excluidos del presente contrato los servicios y todas aquellas actividades procedimientos e intervenciones que no tengan por objeto contribuir al diagnóstico tratamiento o rehabilitación de la patología derivada del siniestro o los servicios considerados como experimentales cosméticos y suntuarios.","2022-04-01",{"$f":"MONTH(G520)","v":4},"2024-04-01",{"$f":"(I520-G520)/30","v":24.366666666666667},"Invitación directa","CargoAReserva",0,0,"NO",null,"Gerencia de Abastecimiento Estratégico\ncontratacion@positiva.gov.co\nPBX: (1)6502200 Ext: 10641","SI","SI","NO","SI",{"$f":"IF(U520=\"SI\",\"Pública clasificada\",\"Pública\")","v":"Pública clasificada"},{"$f":"CONCATENATE(D520,\"-\",\"Tipo de información\",\" \",V520,\"-\",F520)","v":"C65602022-Tipo de información Pública clasificada-Prestación de servicios: El CONTRATISTA se obliga con POSITIVA a la prestación de los servicios de salud para los asegurados y o afiliados a POSITIVA que accedan a los servicios habilitados del CONTRATISTA en calidad de asegurados a los ramos Administración de Riesgos Laborales ARL por causa exclusiva de un accidente de trabajo una enfermedad profesional) Accidentes Personales AP Educativo Generación Positiva AP Colectivos APCorto Plazo AP Individual y demás Ramos de Seguros autorizados a Positiva encontrándose excluidos del presente contrato los servicios y todas aquellas actividades procedimientos e intervenciones que no tengan por objeto contribuir al diagnóstico tratamiento o rehabilitación de la patología derivada del siniestro o los servicios considerados como experimentales cosméticos y suntuarios."}]
["VICEPRESIDENCIA TÉCNICA","Gerencia Médica","NO","C65612022",85100000,"Prestación de servicios: El CONTRATISTA se obliga con POSITIVA a la prestación de los servicios de salud para los asegurados y o afiliados a POSITIVA que accedan a los servicios habilitados del CONTRATISTA en calidad de asegurados a los ramos Administración de Riesgos Laborales ARL por causa exclusiva de un accidente de trabajo una enfermedad profesional) Accidentes Personales AP Educativo Generación Positiva AP Colectivos APCorto Plazo AP Individual y demás Ramos de Seguros autorizados a Positiva encontrándose excluidos del presente contrato los servicios y todas aquellas actividades procedimientos e intervenciones que no tengan por objeto contribuir al diagnóstico tratamiento o rehabilitación de la patología derivada del siniestro o los servicios considerados como experimentales cosméticos y suntuarios.","2022-03-30",{"$f":"MONTH(G521)","v":3},"2024-03-29",{"$f":"(I521-G521)/30","v":24.333333333333332},"Invitación directa","CargoAReserva",0,0,"NO",null,"Gerencia de Abastecimiento Estratégico\ncontratacion@positiva.gov.co\nPBX: (1)6502200 Ext: 10641","SI","SI","NO","SI",{"$f":"IF(U521=\"SI\",\"Pública clasificada\",\"Pública\")","v":"Pública clasificada"},{"$f":"CONCATENATE(D521,\"-\",\"Tipo de información\",\" \",V521,\"-\",F521)","v":"C65612022-Tipo de información Pública clasificada-Prestación de servicios: El CONTRATISTA se obliga con POSITIVA a la prestación de los servicios de salud para los asegurados y o afiliados a POSITIVA que accedan a los servicios habilitados del CONTRATISTA en calidad de asegurados a los ramos Administración de Riesgos Laborales ARL por causa exclusiva de un accidente de trabajo una enfermedad profesional) Accidentes Personales AP Educativo Generación Positiva AP Colectivos APCorto Plazo AP Individual y demás Ramos de Seguros autorizados a Positiva encontrándose excluidos del presente contrato los servicios y todas aquellas actividades procedimientos e intervenciones que no tengan por objeto contribuir al diagnóstico tratamiento o rehabilitación de la patología derivada del siniestro o los servicios considerados como experimentales cosméticos y suntuarios."}]
["VICEPRESIDENCIA TÉCNICA","Gerencia Médica","NO","C65632022",85100000,"Prestación de servicios: El CONTRATISTA se obliga con POSITIVA a la prestación de los servicios de salud para los asegurados y o afiliados a POSITIVA que accedan a los servicios habilitados del CONTRATISTA en calidad de asegurados a los ramos Administración de Riesgos Laborales ARL por causa exclusiva de un accidente de trabajo una enfermedad profesional) Accidentes Personales AP Educativo Generación Positiva AP Colectivos APCorto Plazo AP Individual y demás Ramos de Seguros autorizados a Positiva encontrándose excluidos del presente contrato los servicios y todas aquellas actividades procedimientos e intervenciones que no tengan por objeto contribuir al diagnóstico tratamiento o rehabilitación de la patología derivada del siniestro o los servicios considerados como experimentales cosméticos y suntuarios.","2022-07-30",{"$f":"MONTH(G522)","v":7},"2024-07-29",{"$f":"(I522-G522)/30","v":24.333333333333332},"Invitación directa","CargoAReserva",0,0,"NO",null,"Gerencia de Abastecimiento Estratégico\ncontratacion@positiva.gov.co\nPBX: (1)6502200 Ext: 10641","SI","SI","NO","SI",{"$f":"IF(U522=\"SI\",\"Pública clasificada\",\"Pública\")","v":"Pública clasificada"},{"$f":"CONCATENATE(D522,\"-\",\"Tipo de información\",\" \",V522,\"-\",F522)","v":"C65632022-Tipo de información Pública clasificada-Prestación de servicios: El CONTRATISTA se obliga con POSITIVA a la prestación de los servicios de salud para los asegurados y o afiliados a POSITIVA que accedan a los servicios habilitados del CONTRATISTA en calidad de asegurados a los ramos Administración de Riesgos Laborales ARL por causa exclusiva de un accidente de trabajo una enfermedad profesional) Accidentes Personales AP Educativo Generación Positiva AP Colectivos APCorto Plazo AP Individual y demás Ramos de Seguros autorizados a Positiva encontrándose excluidos del presente contrato los servicios y todas aquellas actividades procedimientos e intervenciones que no tengan por objeto contribuir al diagnóstico tratamiento o rehabilitación de la patología derivada del siniestro o los servicios considerados como experimentales cosméticos y suntuarios."}]
["VICEPRESIDENCIA TÉCNICA","Gerencia Médica","NO","C65642022",85100000,"Prestación de servicios: El CONTRATISTA se obliga con POSITIVA a la prestación de los servicios de salud para los asegurados y o afiliados a POSITIVA que accedan a los servicios habilitados del CONTRATISTA en calidad de asegurados a los ramos Administración de Riesgos Laborales ARL por causa exclusiva de un accidente de trabajo una enfermedad profesional) Accidentes Personales AP Educativo Generación Positiva AP Colectivos APCorto Plazo AP Individual y demás Ramos de Seguros autorizados a Positiva encontrándose excluidos del presente contrato los servicios y todas aquellas actividades procedimientos e intervenciones que no tengan por objeto contribuir al diagnóstico tratamiento o rehabilitación de la patología derivada del siniestro o los servicios considerados como experimentales cosméticos y suntuarios.","2022-03-30",{"$f":"MONTH(G523)","v":3},"2024-03-29",{"$f":"(I523-G523)/30","v":24.333333333333332},"Invitación directa","CargoAReserva",0,0,"NO",null,"Gerencia de Abastecimiento Estratégico\ncontratacion@positiva.gov.co\nPBX: (1)6502200 Ext: 10641","SI","SI","NO","SI",{"$f":"IF(U523=\"SI\",\"Pública clasificada\",\"Pública\")","v":"Pública clasificada"},{"$f":"CONCATENATE(D523,\"-\",\"Tipo de información\",\" \",V523,\"-\",F523)","v":"C65642022-Tipo de información Pública clasificada-Prestación de servicios: El CONTRATISTA se obliga con POSITIVA a la prestación de los servicios de salud para los asegurados y o afiliados a POSITIVA que accedan a los servicios habilitados del CONTRATISTA en calidad de asegurados a los ramos Administración de Riesgos Laborales ARL por causa exclusiva de un accidente de trabajo una enfermedad profesional) Accidentes Personales AP Educativo Generación Positiva AP Colectivos APCorto Plazo AP Individual y demás Ramos de Seguros autorizados a Positiva encontrándose excluidos del presente contrato los servicios y todas aquellas actividades procedimientos e intervenciones que no tengan por objeto contribuir al diagnóstico tratamiento o rehabilitación de la patología derivada del siniestro o los servicios considerados como experimentales cosméticos y suntuarios."}]
["VICEPRESIDENCIA TÉCNICA","Gerencia Médica","NO","C65652022",85100000,"Prestación de servicios: El CONTRATISTA se obliga con POSITIVA a la prestación de los servicios de salud para los asegurados y o afiliados a POSITIVA que accedan a los servicios habilitados del CONTRATISTA en calidad de asegurados a los ramos Administración de Riesgos Laborales ARL por causa exclusiva de un accidente de trabajo una enfermedad profesional) Accidentes Personales AP Educativo Generación Positiva AP Colectivos APCorto Plazo AP Individual y demás Ramos de Seguros autorizados a Positiva encontrándose excluidos del presente contrato los servicios y todas aquellas actividades procedimientos e intervenciones que no tengan por objeto contribuir al diagnóstico tratamiento o rehabilitación de la patología derivada del siniestro o los servicios considerados como experimentales cosméticos y suntuarios.","2022-03-30",{"$f":"MONTH(G524)","v":3},"2024-03-29",{"$f":"(I524-G524)/30","v":24.333333333333332},"Invitación directa","CargoAReserva",0,0,"NO",null,"Gerencia de Abastecimiento Estratégico\ncontratacion@positiva.gov.co\nPBX: (1)6502200 Ext: 10641","SI","SI","NO","SI",{"$f":"IF(U524=\"SI\",\"Pública clasificada\",\"Pública\")","v":"Pública clasificada"},{"$f":"CONCATENATE(D524,\"-\",\"Tipo de información\",\" \",V524,\"-\",F524)","v":"C65652022-Tipo de información Pública clasificada-Prestación de servicios: El CONTRATISTA se obliga con POSITIVA a la prestación de los servicios de salud para los asegurados y o afiliados a POSITIVA que accedan a los servicios habilitados del CONTRATISTA en calidad de asegurados a los ramos Administración de Riesgos Laborales ARL por causa exclusiva de un accidente de trabajo una enfermedad profesional) Accidentes Personales AP Educativo Generación Positiva AP Colectivos APCorto Plazo AP Individual y demás Ramos de Seguros autorizados a Positiva encontrándose excluidos del presente contrato los servicios y todas aquellas actividades procedimientos e intervenciones que no tengan por objeto contribuir al diagnóstico tratamiento o rehabilitación de la patología derivada del siniestro o los servicios considerados como experimentales cosméticos y suntuarios."}]
["VICEPRESIDENCIA TÉCNICA","Gerencia Médica","NO","C65662022",85100000,"Prestación de servicios: El CONTRATISTA se obliga con POSITIVA a la prestación de los servicios de salud para los asegurados y o afiliados a POSITIVA que accedan a los servicios habilitados del CONTRATISTA en calidad de asegurados a los ramos Administración de Riesgos Laborales ARL por causa exclusiva de un accidente de trabajo una enfermedad profesional) Accidentes Personales AP Educativo Generación Positiva AP Colectivos APCorto Plazo AP Individual y demás Ramos de Seguros autorizados a Positiva encontrándose excluidos del presente contrato los servicios y todas aquellas actividades procedimientos e intervenciones que no tengan por objeto contribuir al diagnóstico tratamiento o rehabilitación de la patología derivada del siniestro o los servicios considerados como experimentales cosméticos y suntuarios.","2022-09-01",{"$f":"MONTH(G525)","v":9},"2024-09-30",{"$f":"(I525-G525)/30","v":25.333333333333332},"Invitación directa","CargoAReserva",0,0,"NO",null,"Gerencia de Abastecimiento Estratégico\ncontratacion@positiva.gov.co\nPBX: (1)6502200 Ext: 10641","SI","SI","NO","SI",{"$f":"IF(U525=\"SI\",\"Pública clasificada\",\"Pública\")","v":"Pública clasificada"},{"$f":"CONCATENATE(D525,\"-\",\"Tipo de información\",\" \",V525,\"-\",F525)","v":"C65662022-Tipo de información Pública clasificada-Prestación de servicios: El CONTRATISTA se obliga con POSITIVA a la prestación de los servicios de salud para los asegurados y o afiliados a POSITIVA que accedan a los servicios habilitados del CONTRATISTA en calidad de asegurados a los ramos Administración de Riesgos Laborales ARL por causa exclusiva de un accidente de trabajo una enfermedad profesional) Accidentes Personales AP Educativo Generación Positiva AP Colectivos APCorto Plazo AP Individual y demás Ramos de Seguros autorizados a Positiva encontrándose excluidos del presente contrato los servicios y todas aquellas actividades procedimientos e intervenciones que no tengan por objeto contribuir al diagnóstico tratamiento o rehabilitación de la patología derivada del siniestro o los servicios considerados como experimentales cosméticos y suntuarios."}]
["VICEPRESIDENCIA TÉCNICA","Gerencia Médica","NO","C65672022",85100000,"Prestación de servicios: El CONTRATISTA se obliga con POSITIVA a la prestación de los servicios de salud para los asegurados y o afiliados a POSITIVA que accedan a los servicios habilitados del CONTRATISTA en calidad de asegurados a los ramos Administración de Riesgos Laborales ARL por causa exclusiva de un accidente de trabajo una enfermedad profesional) Accidentes Personales AP Educativo Generación Positiva AP Colectivos APCorto Plazo AP Individual y demás Ramos de Seguros autorizados a Positiva encontrándose excluidos del presente contrato los servicios y todas aquellas actividades procedimientos e intervenciones que no tengan por objeto contribuir al diagnóstico tratamiento o rehabilitación de la patología derivada del siniestro o los servicios considerados como experimentales cosméticos y suntuarios.","2022-09-01",{"$f":"MONTH(G526)","v":9},"2024-09-30",{"$f":"(I526-G526)/30","v":25.333333333333332},"Invitación directa","CargoAReserva",0,0,"NO",null,"Gerencia de Abastecimiento Estratégico\ncontratacion@positiva.gov.co\nPBX: (1)6502200 Ext: 10641","SI","SI","NO","SI",{"$f":"IF(U526=\"SI\",\"Pública clasificada\",\"Pública\")","v":"Pública clasificada"},{"$f":"CONCATENATE(D526,\"-\",\"Tipo de información\",\" \",V526,\"-\",F526)","v":"C65672022-Tipo de información Pública clasificada-Prestación de servicios: El CONTRATISTA se obliga con POSITIVA a la prestación de los servicios de salud para los asegurados y o afiliados a POSITIVA que accedan a los servicios habilitados del CONTRATISTA en calidad de asegurados a los ramos Administración de Riesgos Laborales ARL por causa exclusiva de un accidente de trabajo una enfermedad profesional) Accidentes Personales AP Educativo Generación Positiva AP Colectivos APCorto Plazo AP Individual y demás Ramos de Seguros autorizados a Positiva encontrándose excluidos del presente contrato los servicios y todas aquellas actividades procedimientos e intervenciones que no tengan por objeto contribuir al diagnóstico tratamiento o rehabilitación de la patología derivada del siniestro o los servicios considerados como experimentales cosméticos y suntuarios."}]
["VICEPRESIDENCIA TÉCNICA","Gerencia Médica","NO","C65682022",85100000,"Prestación de servicios: El CONTRATISTA se obliga con POSITIVA a la prestación de los servicios de salud para los asegurados y o afiliados a POSITIVA que accedan a los servicios habilitados del CONTRATISTA en calidad de asegurados a los ramos Administración de Riesgos Laborales ARL por causa exclusiva de un accidente de trabajo una enfermedad profesional) Accidentes Personales AP Educativo Generación Positiva AP Colectivos APCorto Plazo AP Individual y demás Ramos de Seguros autorizados a Positiva encontrándose excluidos del presente contrato los servicios y todas aquellas actividades procedimientos e intervenciones que no tengan por objeto contribuir al diagnóstico tratamiento o rehabilitación de la patología derivada del siniestro o los servicios considerados como experimentales cosméticos y suntuarios.","2022-02-01",{"$f":"MONTH(G527)","v":2},"2024-02-01",{"$f":"(I527-G527)/30","v":24.333333333333332},"Invitación directa","CargoAReserva",0,0,"NO",null,"Gerencia de Abastecimiento Estratégico\ncontratacion@positiva.gov.co\nPBX: (1)6502200 Ext: 10641","SI","SI","NO","SI",{"$f":"IF(U527=\"SI\",\"Pública clasificada\",\"Pública\")","v":"Pública clasificada"},{"$f":"CONCATENATE(D527,\"-\",\"Tipo de información\",\" \",V527,\"-\",F527)","v":"C65682022-Tipo de información Pública clasificada-Prestación de servicios: El CONTRATISTA se obliga con POSITIVA a la prestación de los servicios de salud para los asegurados y o afiliados a POSITIVA que accedan a los servicios habilitados del CONTRATISTA en calidad de asegurados a los ramos Administración de Riesgos Laborales ARL por causa exclusiva de un accidente de trabajo una enfermedad profesional) Accidentes Personales AP Educativo Generación Positiva AP Colectivos APCorto Plazo AP Individual y demás Ramos de Seguros autorizados a Positiva encontrándose excluidos del presente contrato los servicios y todas aquellas actividades procedimientos e intervenciones que no tengan por objeto contribuir al diagnóstico tratamiento o rehabilitación de la patología derivada del siniestro o los servicios considerados como experimentales cosméticos y suntuarios."}]
["VICEPRESIDENCIA TÉCNICA","Gerencia Médica","NO","C65692022",85100000,"Prestación de servicios: El CONTRATISTA se obliga con POSITIVA a la prestación de los servicios de salud para los asegurados y o afiliados a POSITIVA que accedan a los servicios habilitados del CONTRATISTA en calidad de asegurados a los ramos Administración de Riesgos Laborales ARL por causa exclusiva de un accidente de trabajo una enfermedad profesional) Accidentes Personales AP Educativo Generación Positiva AP Colectivos APCorto Plazo AP Individual y demás Ramos de Seguros autorizados a Positiva encontrándose excluidos del presente contrato los servicios y todas aquellas actividades procedimientos e intervenciones que no tengan por objeto contribuir al diagnóstico tratamiento o rehabilitación de la patología derivada del siniestro o los servicios considerados como experimentales cosméticos y suntuarios.","2022-03-01",{"$f":"MONTH(G528)","v":3},"2024-03-01",{"$f":"(I528-G528)/30","v":24.366666666666667},"Invitación directa","CargoAReserva",0,0,"NO",null,"Gerencia de Abastecimiento Estratégico\ncontratacion@positiva.gov.co\nPBX: (1)6502200 Ext: 10641","SI","SI","NO","SI",{"$f":"IF(U528=\"SI\",\"Pública clasificada\",\"Pública\")","v":"Pública clasificada"},{"$f":"CONCATENATE(D528,\"-\",\"Tipo de información\",\" \",V528,\"-\",F528)","v":"C65692022-Tipo de información Pública clasificada-Prestación de servicios: El CONTRATISTA se obliga con POSITIVA a la prestación de los servicios de salud para los asegurados y o afiliados a POSITIVA que accedan a los servicios habilitados del CONTRATISTA en calidad de asegurados a los ramos Administración de Riesgos Laborales ARL por causa exclusiva de un accidente de trabajo una enfermedad profesional) Accidentes Personales AP Educativo Generación Positiva AP Colectivos APCorto Plazo AP Individual y demás Ramos de Seguros autorizados a Positiva encontrándose excluidos del presente contrato los servicios y todas aquellas actividades procedimientos e intervenciones que no tengan por objeto contribuir al diagnóstico tratamiento o rehabilitación de la patología derivada del siniestro o los servicios considerados como experimentales cosméticos y suntuarios."}]
["VICEPRESIDENCIA TÉCNICA","Gerencia Médica","NO","C65702022",85100000,"Prestación de servicios: El CONTRATISTA se obliga con POSITIVA a la prestación de los servicios de salud para los asegurados y o afiliados a POSITIVA que accedan a los servicios habilitados del CONTRATISTA en calidad de asegurados a los ramos Administración de Riesgos Laborales ARL por causa exclusiva de un accidente de trabajo una enfermedad profesional) Accidentes Personales AP Educativo Generación Positiva AP Colectivos APCorto Plazo AP Individual y demás Ramos de Seguros autorizados a Positiva encontrándose excluidos del presente contrato los servicios y todas aquellas actividades procedimientos e intervenciones que no tengan por objeto contribuir al diagnóstico tratamiento o rehabilitación de la patología derivada del siniestro o los servicios considerados como experimentales cosméticos y suntuarios.","2022-04-01",{"$f":"MONTH(G529)","v":4},"2024-04-01",{"$f":"(I529-G529)/30","v":24.366666666666667},"Invitación directa","CargoAReserva",0,0,"NO",null,"Gerencia de Abastecimiento Estratégico\ncontratacion@positiva.gov.co\nPBX: (1)6502200 Ext: 10641","SI","SI","NO","SI",{"$f":"IF(U529=\"SI\",\"Pública clasificada\",\"Pública\")","v":"Pública clasificada"},{"$f":"CONCATENATE(D529,\"-\",\"Tipo de información\",\" \",V529,\"-\",F529)","v":"C65702022-Tipo de información Pública clasificada-Prestación de servicios: El CONTRATISTA se obliga con POSITIVA a la prestación de los servicios de salud para los asegurados y o afiliados a POSITIVA que accedan a los servicios habilitados del CONTRATISTA en calidad de asegurados a los ramos Administración de Riesgos Laborales ARL por causa exclusiva de un accidente de trabajo una enfermedad profesional) Accidentes Personales AP Educativo Generación Positiva AP Colectivos APCorto Plazo AP Individual y demás Ramos de Seguros autorizados a Positiva encontrándose excluidos del presente contrato los servicios y todas aquellas actividades procedimientos e intervenciones que no tengan por objeto contribuir al diagnóstico tratamiento o rehabilitación de la patología derivada del siniestro o los servicios considerados como experimentales cosméticos y suntuarios."}]
["VICEPRESIDENCIA TÉCNICA","Gerencia Médica","NO","C65712022",85100000,"Prestación de servicios: El CONTRATISTA se obliga con POSITIVA a la prestación de los servicios de salud para los asegurados y o afiliados a POSITIVA que accedan a los servicios habilitados del CONTRATISTA en calidad de asegurados a los ramos Administración de Riesgos Laborales ARL por causa exclusiva de un accidente de trabajo una enfermedad profesional) Accidentes Personales AP Educativo Generación Positiva AP Colectivos APCorto Plazo AP Individual y demás Ramos de Seguros autorizados a Positiva encontrándose excluidos del presente contrato los servicios y todas aquellas actividades procedimientos e intervenciones que no tengan por objeto contribuir al diagnóstico tratamiento o rehabilitación de la patología derivada del siniestro o los servicios considerados como experimentales cosméticos y suntuarios.","2022-09-01",{"$f":"MONTH(G530)","v":9},"2027-09-01",{"$f":"(I530-G530)/30","v":60.866666666666667},"Invitación directa","CargoAReserva",0,0,"NO",null,"Gerencia de Abastecimiento Estratégico\ncontratacion@positiva.gov.co\nPBX: (1)6502200 Ext: 10641","SI","SI","NO","SI",{"$f":"IF(U530=\"SI\",\"Pública clasificada\",\"Pública\")","v":"Pública clasificada"},{"$f":"CONCATENATE(D530,\"-\",\"Tipo de información\",\" \",V530,\"-\",F530)","v":"C65712022-Tipo de información Pública clasificada-Prestación de servicios: El CONTRATISTA se obliga con POSITIVA a la prestación de los servicios de salud para los asegurados y o afiliados a POSITIVA que accedan a los servicios habilitados del CONTRATISTA en calidad de asegurados a los ramos Administración de Riesgos Laborales ARL por causa exclusiva de un accidente de trabajo una enfermedad profesional) Accidentes Personales AP Educativo Generación Positiva AP Colectivos APCorto Plazo AP Individual y demás Ramos de Seguros autorizados a Positiva encontrándose excluidos del presente contrato los servicios y todas aquellas actividades procedimientos e intervenciones que no tengan por objeto contribuir al diagnóstico tratamiento o rehabilitación de la patología derivada del siniestro o los servicios considerados como experimentales cosméticos y suntuarios."}]
["VICEPRESIDENCIA TÉCNICA","Gerencia Médica","NO","C65722022",85100000,"Prestación de servicios: El CONTRATISTA se obliga con POSITIVA a la prestación de los servicios de salud para los asegurados y o afiliados a POSITIVA que accedan a los servicios habilitados del CONTRATISTA en calidad de asegurados a los ramos Administración de Riesgos Laborales ARL por causa exclusiva de un accidente de trabajo una enfermedad profesional) Accidentes Personales AP Educativo Generación Positiva AP Colectivos APCorto Plazo AP Individual y demás Ramos de Seguros autorizados a Positiva encontrándose excluidos del presente contrato los servicios y todas aquellas actividades procedimientos e intervenciones que no tengan por objeto contribuir al diagnóstico tratamiento o rehabilitación de la patología derivada del siniestro o los servicios considerados como experimentales cosméticos y suntuarios.","2022-09-01",{"$f":"MONTH(G531)","v":9},"2024-09-30",{"$f":"(I531-G531)/30","v":25.333333333333332},"Invitación directa","CargoAReserva",0,0,"NO",null,"Gerencia de Abastecimiento Estratégico\ncontratacion@positiva.gov.co\nPBX: (1)6502200 Ext: 10641","SI","SI","NO","SI",{"$f":"IF(U531=\"SI\",\"Pública clasificada\",\"Pública\")","v":"Pública clasificada"},{"$f":"CONCATENATE(D531,\"-\",\"Tipo de información\",\" \",V531,\"-\",F531)","v":"C65722022-Tipo de información Pública clasificada-Prestación de servicios: El CONTRATISTA se obliga con POSITIVA a la prestación de los servicios de salud para los asegurados y o afiliados a POSITIVA que accedan a los servicios habilitados del CONTRATISTA en calidad de asegurados a los ramos Administración de Riesgos Laborales ARL por causa exclusiva de un accidente de trabajo una enfermedad profesional) Accidentes Personales AP Educativo Generación Positiva AP Colectivos APCorto Plazo AP Individual y demás Ramos de Seguros autorizados a Positiva encontrándose excluidos del presente contrato los servicios y todas aquellas actividades procedimientos e intervenciones que no tengan por objeto contribuir al diagnóstico tratamiento o rehabilitación de la patología derivada del siniestro o los servicios considerados como experimentales cosméticos y suntuarios."}]
["VICEPRESIDENCIA TÉCNICA","Gerencia Médica","NO","C65732022",85100000,"Prestación de servicios: El CONTRATISTA se obliga con POSITIVA a la prestación de los servicios de salud para los asegurados y o afiliados a POSITIVA que accedan a los servicios habilitados del CONTRATISTA en calidad de asegurados a los ramos Administración de Riesgos Laborales ARL por causa exclusiva de un accidente de trabajo una enfermedad profesional) Accidentes Personales AP Educativo Generación Positiva AP Colectivos APCorto Plazo AP Individual y demás Ramos de Seguros autorizados a Positiva encontrándose excluidos del presente contrato los servicios y todas aquellas actividades procedimientos e intervenciones que no tengan por objeto contribuir al diagnóstico tratamiento o rehabilitación de la patología derivada del siniestro o los servicios considerados como experimentales cosméticos y suntuarios.","2022-10-01",{"$f":"MONTH(G532)","v":10},"2027-10-01",{"$f":"(I532-G532)/30","v":60.866666666666667},"Invitación directa","CargoAReserva",0,0,"NO",null,"Gerencia de Abastecimiento Estratégico\ncontratacion@positiva.gov.co\nPBX: (1)6502200 Ext: 10641","SI","SI","NO","SI",{"$f":"IF(U532=\"SI\",\"Pública clasificada\",\"Pública\")","v":"Pública clasificada"},{"$f":"CONCATENATE(D532,\"-\",\"Tipo de información\",\" \",V532,\"-\",F532)","v":"C65732022-Tipo de información Pública clasificada-Prestación de servicios: El CONTRATISTA se obliga con POSITIVA a la prestación de los servicios de salud para los asegurados y o afiliados a POSITIVA que accedan a los servicios habilitados del CONTRATISTA en calidad de asegurados a los ramos Administración de Riesgos Laborales ARL por causa exclusiva de un accidente de trabajo una enfermedad profesional) Accidentes Personales AP Educativo Generación Positiva AP Colectivos APCorto Plazo AP Individual y demás Ramos de Seguros autorizados a Positiva encontrándose excluidos del presente contrato los servicios y todas aquellas actividades procedimientos e intervenciones que no tengan por objeto contribuir al diagnóstico tratamiento o rehabilitación de la patología derivada del siniestro o los servicios considerados como experimentales cosméticos y suntuarios."}]
["VICEPRESIDENCIA TÉCNICA","Gerencia Médica","NO","C65742022",85100000,"Prestación de servicios: El CONTRATISTA se obliga con POSITIVA a la prestación de los servicios de salud para los asegurados y o afiliados a POSITIVA que accedan a los servicios habilitados del CONTRATISTA en calidad de asegurados a los ramos Administración de Riesgos Laborales ARL por causa exclusiva de un accidente de trabajo una enfermedad profesional) Accidentes Personales AP Educativo Generación Positiva AP Colectivos APCorto Plazo AP Individual y demás Ramos de Seguros autorizados a Positiva encontrándose excluidos del presente contrato los servicios y todas aquellas actividades procedimientos e intervenciones que no tengan por objeto contribuir al diagnóstico tratamiento o rehabilitación de la patología derivada del siniestro o los servicios considerados como experimentales cosméticos y suntuarios.","2022-07-01",{"$f":"MONTH(G533)","v":7},"2024-07-01",{"$f":"(I533-G533)/30","v":24.366666666666667},"Invitación directa","CargoAReserva",0,0,"NO",null,"Gerencia de Abastecimiento Estratégico\ncontratacion@positiva.gov.co\nPBX: (1)6502200 Ext: 10641","SI","SI","NO","SI",{"$f":"IF(U533=\"SI\",\"Pública clasificada\",\"Pública\")","v":"Pública clasificada"},{"$f":"CONCATENATE(D533,\"-\",\"Tipo de información\",\" \",V533,\"-\",F533)","v":"C65742022-Tipo de información Pública clasificada-Prestación de servicios: El CONTRATISTA se obliga con POSITIVA a la prestación de los servicios de salud para los asegurados y o afiliados a POSITIVA que accedan a los servicios habilitados del CONTRATISTA en calidad de asegurados a los ramos Administración de Riesgos Laborales ARL por causa exclusiva de un accidente de trabajo una enfermedad profesional) Accidentes Personales AP Educativo Generación Positiva AP Colectivos APCorto Plazo AP Individual y demás Ramos de Seguros autorizados a Positiva encontrándose excluidos del presente contrato los servicios y todas aquellas actividades procedimientos e intervenciones que no tengan por objeto contribuir al diagnóstico tratamiento o rehabilitación de la patología derivada del siniestro o los servicios considerados como experimentales cosméticos y suntuarios."}]
["VICEPRESIDENCIA TÉCNICA","Gerencia Médica","NO","C65762022",85100000,"Prestación de servicios: El CONTRATISTA se obliga con POSITIVA a la prestación de los servicios de salud para los asegurados y o afiliados a POSITIVA que accedan a los servicios habilitados del CONTRATISTA en calidad de asegurados a los ramos Administración de Riesgos Laborales ARL por causa exclusiva de un accidente de trabajo una enfermedad profesional) Accidentes Personales AP Educativo Generación Positiva AP Colectivos APCorto Plazo AP Individual y demás Ramos de Seguros autorizados a Positiva encontrándose excluidos del presente contrato los servicios y todas aquellas actividades procedimientos e intervenciones que no tengan por objeto contribuir al diagnóstico tratamiento o rehabilitación de la patología derivada del siniestro o los servicios considerados como experimentales cosméticos y suntuarios.","2022-10-20",{"$f":"MONTH(G534)","v":10},"2024-10-20",{"$f":"(I534-G534)/30","v":24.366666666666667},"Invitación directa","CargoAReserva",0,0,"NO",null,"Gerencia de Abastecimiento Estratégico\ncontratacion@positiva.gov.co\nPBX: (1)6502200 Ext: 10641","SI","SI","NO","SI",{"$f":"IF(U534=\"SI\",\"Pública clasificada\",\"Pública\")","v":"Pública clasificada"},{"$f":"CONCATENATE(D534,\"-\",\"Tipo de información\",\" \",V534,\"-\",F534)","v":"C65762022-Tipo de información Pública clasificada-Prestación de servicios: El CONTRATISTA se obliga con POSITIVA a la prestación de los servicios de salud para los asegurados y o afiliados a POSITIVA que accedan a los servicios habilitados del CONTRATISTA en calidad de asegurados a los ramos Administración de Riesgos Laborales ARL por causa exclusiva de un accidente de trabajo una enfermedad profesional) Accidentes Personales AP Educativo Generación Positiva AP Colectivos APCorto Plazo AP Individual y demás Ramos de Seguros autorizados a Positiva encontrándose excluidos del presente contrato los servicios y todas aquellas actividades procedimientos e intervenciones que no tengan por objeto contribuir al diagnóstico tratamiento o rehabilitación de la patología derivada del siniestro o los servicios considerados como experimentales cosméticos y suntuarios."}]
["VICEPRESIDENCIA TÉCNICA","Gerencia Médica","NO","C65782022",85100000,"Prestación de servicios: El CONTRATISTA se obliga con POSITIVA a la prestación de los servicios de salud para los asegurados y o afiliados a POSITIVA que accedan a los servicios habilitados del CONTRATISTA en calidad de asegurados a los ramos Administración de Riesgos Laborales ARL por causa exclusiva de un accidente de trabajo una enfermedad profesional) Accidentes Personales AP Educativo Generación Positiva AP Colectivos APCorto Plazo AP Individual y demás Ramos de Seguros autorizados a Positiva encontrándose excluidos del presente contrato los servicios y todas aquellas actividades procedimientos e intervenciones que no tengan por objeto contribuir al diagnóstico tratamiento o rehabilitación de la patología derivada del siniestro o los servicios considerados como experimentales cosméticos y suntuarios.","2022-12-28",{"$f":"MONTH(G535)","v":12},"2024-12-28",{"$f":"(I535-G535)/30","v":24.366666666666667},"Invitación directa","CargoAReserva",0,0,"NO",null,"Gerencia de Abastecimiento Estratégico\ncontratacion@positiva.gov.co\nPBX: (1)6502200 Ext: 10641","SI","SI","NO","SI",{"$f":"IF(U535=\"SI\",\"Pública clasificada\",\"Pública\")","v":"Pública clasificada"},{"$f":"CONCATENATE(D535,\"-\",\"Tipo de información\",\" \",V535,\"-\",F535)","v":"C65782022-Tipo de información Pública clasificada-Prestación de servicios: El CONTRATISTA se obliga con POSITIVA a la prestación de los servicios de salud para los asegurados y o afiliados a POSITIVA que accedan a los servicios habilitados del CONTRATISTA en calidad de asegurados a los ramos Administración de Riesgos Laborales ARL por causa exclusiva de un accidente de trabajo una enfermedad profesional) Accidentes Personales AP Educativo Generación Positiva AP Colectivos APCorto Plazo AP Individual y demás Ramos de Seguros autorizados a Positiva encontrándose excluidos del presente contrato los servicios y todas aquellas actividades procedimientos e intervenciones que no tengan por objeto contribuir al diagnóstico tratamiento o rehabilitación de la patología derivada del siniestro o los servicios considerados como experimentales cosméticos y suntuarios."}]
["VICEPRESIDENCIA TÉCNICA","Gerencia Médica","NO","C65792022",85100000,"Prestación de servicios: El CONTRATISTA se obliga con POSITIVA a la prestación de los servicios de salud para los asegurados y o afiliados a POSITIVA que accedan a los servicios habilitados del CONTRATISTA en calidad de asegurados a los ramos Administración de Riesgos Laborales ARL por causa exclusiva de un accidente de trabajo una enfermedad profesional) Accidentes Personales AP Educativo Generación Positiva AP Colectivos APCorto Plazo AP Individual y demás Ramos de Seguros autorizados a Positiva encontrándose excluidos del presente contrato los servicios y todas aquellas actividades procedimientos e intervenciones que no tengan por objeto contribuir al diagnóstico tratamiento o rehabilitación de la patología derivada del siniestro o los servicios considerados como experimentales cosméticos y suntuarios.","2022-09-01",{"$f":"MONTH(G536)","v":9},"2024-09-30",{"$f":"(I536-G536)/30","v":25.333333333333332},"Invitación directa","CargoAReserva",0,0,"NO",null,"Gerencia de Abastecimiento Estratégico\ncontratacion@positiva.gov.co\nPBX: (1)6502200 Ext: 10641","SI","SI","NO","SI",{"$f":"IF(U536=\"SI\",\"Pública clasificada\",\"Pública\")","v":"Pública clasificada"},{"$f":"CONCATENATE(D536,\"-\",\"Tipo de información\",\" \",V536,\"-\",F536)","v":"C65792022-Tipo de información Pública clasificada-Prestación de servicios: El CONTRATISTA se obliga con POSITIVA a la prestación de los servicios de salud para los asegurados y o afiliados a POSITIVA que accedan a los servicios habilitados del CONTRATISTA en calidad de asegurados a los ramos Administración de Riesgos Laborales ARL por causa exclusiva de un accidente de trabajo una enfermedad profesional) Accidentes Personales AP Educativo Generación Positiva AP Colectivos APCorto Plazo AP Individual y demás Ramos de Seguros autorizados a Positiva encontrándose excluidos del presente contrato los servicios y todas aquellas actividades procedimientos e intervenciones que no tengan por objeto contribuir al diagnóstico tratamiento o rehabilitación de la patología derivada del siniestro o los servicios considerados como experimentales cosméticos y suntuarios."}]
["VICEPRESIDENCIA TÉCNICA","Gerencia Médica","NO","C65802022",85100000,"Prestación de servicios: El CONTRATISTA se obliga con POSITIVA a la prestación de los servicios de salud para los asegurados y o afiliados a POSITIVA que accedan a los servicios habilitados del CONTRATISTA en calidad de asegurados a los ramos Administración de Riesgos Laborales ARL por causa exclusiva de un accidente de trabajo una enfermedad profesional) Accidentes Personales AP Educativo Generación Positiva AP Colectivos APCorto Plazo AP Individual y demás Ramos de Seguros autorizados a Positiva encontrándose excluidos del presente contrato los servicios y todas aquellas actividades procedimientos e intervenciones que no tengan por objeto contribuir al diagnóstico tratamiento o rehabilitación de la patología derivada del siniestro o los servicios considerados como experimentales cosméticos y suntuarios.","2022-02-01",{"$f":"MONTH(G537)","v":2},"2027-02-01",{"$f":"(I537-G537)/30","v":60.866666666666667},"Invitación directa","CargoAReserva",0,0,"NO",null,"Gerencia de Abastecimiento Estratégico\ncontratacion@positiva.gov.co\nPBX: (1)6502200 Ext: 10641","SI","SI","NO","SI",{"$f":"IF(U537=\"SI\",\"Pública clasificada\",\"Pública\")","v":"Pública clasificada"},{"$f":"CONCATENATE(D537,\"-\",\"Tipo de información\",\" \",V537,\"-\",F537)","v":"C65802022-Tipo de información Pública clasificada-Prestación de servicios: El CONTRATISTA se obliga con POSITIVA a la prestación de los servicios de salud para los asegurados y o afiliados a POSITIVA que accedan a los servicios habilitados del CONTRATISTA en calidad de asegurados a los ramos Administración de Riesgos Laborales ARL por causa exclusiva de un accidente de trabajo una enfermedad profesional) Accidentes Personales AP Educativo Generación Positiva AP Colectivos APCorto Plazo AP Individual y demás Ramos de Seguros autorizados a Positiva encontrándose excluidos del presente contrato los servicios y todas aquellas actividades procedimientos e intervenciones que no tengan por objeto contribuir al diagnóstico tratamiento o rehabilitación de la patología derivada del siniestro o los servicios considerados como experimentales cosméticos y suntuarios."}]
["VICEPRESIDENCIA TÉCNICA","Gerencia Médica","NO","C65812022",85100000,"Prestación de servicios: El CONTRATISTA se obliga con POSITIVA a la prestación de los servicios de salud para los asegurados y o afiliados a POSITIVA que accedan a los servicios habilitados del CONTRATISTA en calidad de asegurados a los ramos Administración de Riesgos Laborales ARL por causa exclusiva de un accidente de trabajo una enfermedad profesional) Accidentes Personales AP Educativo Generación Positiva AP Colectivos APCorto Plazo AP Individual y demás Ramos de Seguros autorizados a Positiva encontrándose excluidos del presente contrato los servicios y todas aquellas actividades procedimientos e intervenciones que no tengan por objeto contribuir al diagnóstico tratamiento o rehabilitación de la patología derivada del siniestro o los servicios considerados como experimentales cosméticos y suntuarios.","2022-03-01",{"$f":"MONTH(G538)","v":3},"2027-03-01",{"$f":"(I538-G538)/30","v":60.866666666666667},"Invitación directa","CargoAReserva",0,0,"NO",null,"Gerencia de Abastecimiento Estratégico\ncontratacion@positiva.gov.co\nPBX: (1)6502200 Ext: 10641","SI","SI","NO","SI",{"$f":"IF(U538=\"SI\",\"Pública clasificada\",\"Pública\")","v":"Pública clasificada"},{"$f":"CONCATENATE(D538,\"-\",\"Tipo de información\",\" \",V538,\"-\",F538)","v":"C65812022-Tipo de información Pública clasificada-Prestación de servicios: El CONTRATISTA se obliga con POSITIVA a la prestación de los servicios de salud para los asegurados y o afiliados a POSITIVA que accedan a los servicios habilitados del CONTRATISTA en calidad de asegurados a los ramos Administración de Riesgos Laborales ARL por causa exclusiva de un accidente de trabajo una enfermedad profesional) Accidentes Personales AP Educativo Generación Positiva AP Colectivos APCorto Plazo AP Individual y demás Ramos de Seguros autorizados a Positiva encontrándose excluidos del presente contrato los servicios y todas aquellas actividades procedimientos e intervenciones que no tengan por objeto contribuir al diagnóstico tratamiento o rehabilitación de la patología derivada del siniestro o los servicios considerados como experimentales cosméticos y suntuarios."}]
["VICEPRESIDENCIA TÉCNICA","Gerencia Médica","NO","C65822022",85100000,"Prestación de servicios: El CONTRATISTA se obliga con POSITIVA a la prestación de los servicios de salud para los asegurados y o afiliados a POSITIVA que accedan a los servicios habilitados del CONTRATISTA en calidad de asegurados a los ramos Administración de Riesgos Laborales ARL por causa exclusiva de un accidente de trabajo una enfermedad profesional) Accidentes Personales AP Educativo Generación Positiva AP Colectivos APCorto Plazo AP Individual y demás Ramos de Seguros autorizados a Positiva encontrándose excluidos del presente contrato los servicios y todas aquellas actividades procedimientos e intervenciones que no tengan por objeto contribuir al diagnóstico tratamiento o rehabilitación de la patología derivada del siniestro o los servicios considerados como experimentales cosméticos y suntuarios.","2022-04-01",{"$f":"MONTH(G539)","v":4},"2027-04-01",{"$f":"(I539-G539)/30","v":60.866666666666667},"Invitación directa","CargoAReserva",0,0,"NO",null,"Gerencia de Abastecimiento Estratégico\ncontratacion@positiva.gov.co\nPBX: (1)6502200 Ext: 10641","SI","SI","NO","SI",{"$f":"IF(U539=\"SI\",\"Pública clasificada\",\"Pública\")","v":"Pública clasificada"},{"$f":"CONCATENATE(D539,\"-\",\"Tipo de información\",\" \",V539,\"-\",F539)","v":"C65822022-Tipo de información Pública clasificada-Prestación de servicios: El CONTRATISTA se obliga con POSITIVA a la prestación de los servicios de salud para los asegurados y o afiliados a POSITIVA que accedan a los servicios habilitados del CONTRATISTA en calidad de asegurados a los ramos Administración de Riesgos Laborales ARL por causa exclusiva de un accidente de trabajo una enfermedad profesional) Accidentes Personales AP Educativo Generación Positiva AP Colectivos APCorto Plazo AP Individual y demás Ramos de Seguros autorizados a Positiva encontrándose excluidos del presente contrato los servicios y todas aquellas actividades procedimientos e intervenciones que no tengan por objeto contribuir al diagnóstico tratamiento o rehabilitación de la patología derivada del siniestro o los servicios considerados como experimentales cosméticos y suntuarios."}]
["VICEPRESIDENCIA TÉCNICA","Gerencia Médica","NO","C65832022",85100000,"Prestación de servicios: El CONTRATISTA se obliga con POSITIVA a la prestación de los servicios de salud para los asegurados y o afiliados a POSITIVA que accedan a los servicios habilitados del CONTRATISTA en calidad de asegurados a los ramos Administración de Riesgos Laborales ARL por causa exclusiva de un accidente de trabajo una enfermedad profesional) Accidentes Personales AP Educativo Generación Positiva AP Colectivos APCorto Plazo AP Individual y demás Ramos de Seguros autorizados a Positiva encontrándose excluidos del presente contrato los servicios y todas aquellas actividades procedimientos e intervenciones que no tengan por objeto contribuir al diagnóstico tratamiento o rehabilitación de la patología derivada del siniestro o los servicios considerados como experimentales cosméticos y suntuarios.","2022-10-01",{"$f":"MONTH(G540)","v":10},"2024-10-30",{"$f":"(I540-G540)/30","v":25.333333333333332},"Invitación directa","CargoAReserva",0,0,"NO",null,"Gerencia de Abastecimiento Estratégico\ncontratacion@positiva.gov.co\nPBX: (1)6502200 Ext: 10641","SI","SI","NO","SI",{"$f":"IF(U540=\"SI\",\"Pública clasificada\",\"Pública\")","v":"Pública clasificada"},{"$f":"CONCATENATE(D540,\"-\",\"Tipo de información\",\" \",V540,\"-\",F540)","v":"C65832022-Tipo de información Pública clasificada-Prestación de servicios: El CONTRATISTA se obliga con POSITIVA a la prestación de los servicios de salud para los asegurados y o afiliados a POSITIVA que accedan a los servicios habilitados del CONTRATISTA en calidad de asegurados a los ramos Administración de Riesgos Laborales ARL por causa exclusiva de un accidente de trabajo una enfermedad profesional) Accidentes Personales AP Educativo Generación Positiva AP Colectivos APCorto Plazo AP Individual y demás Ramos de Seguros autorizados a Positiva encontrándose excluidos del presente contrato los servicios y todas aquellas actividades procedimientos e intervenciones que no tengan por objeto contribuir al diagnóstico tratamiento o rehabilitación de la patología derivada del siniestro o los servicios considerados como experimentales cosméticos y suntuarios."}]
["VICEPRESIDENCIA TÉCNICA","Gerencia Médica","NO","C65842022",85100000,"Prestación de servicios: El CONTRATISTA se obliga con POSITIVA a la prestación de los servicios de salud para los asegurados y o afiliados a POSITIVA que accedan a los servicios habilitados del CONTRATISTA en calidad de asegurados a los ramos Administración de Riesgos Laborales ARL por causa exclusiva de un accidente de trabajo una enfermedad profesional) Accidentes Personales AP Educativo Generación Positiva AP Colectivos APCorto Plazo AP Individual y demás Ramos de Seguros autorizados a Positiva encontrándose excluidos del presente contrato los servicios y todas aquellas actividades procedimientos e intervenciones que no tengan por objeto contribuir al diagnóstico tratamiento o rehabilitación de la patología derivada del siniestro o los servicios considerados como experimentales cosméticos y suntuarios.","2022-10-01",{"$f":"MONTH(G541)","v":10},"2024-10-30",{"$f":"(I541-G541)/30","v":25.333333333333332},"Invitación directa","CargoAReserva",0,0,"NO",null,"Gerencia de Abastecimiento Estratégico\ncontratacion@positiva.gov.co\nPBX: (1)6502200 Ext: 10641","SI","SI","NO","SI",{"$f":"IF(U541=\"SI\",\"Pública clasificada\",\"Pública\")","v":"Pública clasificada"},{"$f":"CONCATENATE(D541,\"-\",\"Tipo de información\",\" \",V541,\"-\",F541)","v":"C65842022-Tipo de información Pública clasificada-Prestación de servicios: El CONTRATISTA se obliga con POSITIVA a la prestación de los servicios de salud para los asegurados y o afiliados a POSITIVA que accedan a los servicios habilitados del CONTRATISTA en calidad de asegurados a los ramos Administración de Riesgos Laborales ARL por causa exclusiva de un accidente de trabajo una enfermedad profesional) Accidentes Personales AP Educativo Generación Positiva AP Colectivos APCorto Plazo AP Individual y demás Ramos de Seguros autorizados a Positiva encontrándose excluidos del presente contrato los servicios y todas aquellas actividades procedimientos e intervenciones que no tengan por objeto contribuir al diagnóstico tratamiento o rehabilitación de la patología derivada del siniestro o los servicios considerados como experimentales cosméticos y suntuarios."}]
["VICEPRESIDENCIA TÉCNICA","Gerencia Médica","NO","C65852022",85100000,"Prestación de servicios: El CONTRATISTA se obliga con POSITIVA a la prestación de los servicios de salud para los asegurados y o afiliados a POSITIVA que accedan a los servicios habilitados del CONTRATISTA en calidad de asegurados a los ramos Administración de Riesgos Laborales ARL por causa exclusiva de un accidente de trabajo una enfermedad profesional) Accidentes Personales AP Educativo Generación Positiva AP Colectivos APCorto Plazo AP Individual y demás Ramos de Seguros autorizados a Positiva encontrándose excluidos del presente contrato los servicios y todas aquellas actividades procedimientos e intervenciones que no tengan por objeto contribuir al diagnóstico tratamiento o rehabilitación de la patología derivada del siniestro o los servicios considerados como experimentales cosméticos y suntuarios.","2022-03-29",{"$f":"MONTH(G542)","v":3},"2024-03-29",{"$f":"(I542-G542)/30","v":24.366666666666667},"Invitación directa","CargoAReserva",0,0,"NO",null,"Gerencia de Abastecimiento Estratégico\ncontratacion@positiva.gov.co\nPBX: (1)6502200 Ext: 10641","SI","SI","NO","SI",{"$f":"IF(U542=\"SI\",\"Pública clasificada\",\"Pública\")","v":"Pública clasificada"},{"$f":"CONCATENATE(D542,\"-\",\"Tipo de información\",\" \",V542,\"-\",F542)","v":"C65852022-Tipo de información Pública clasificada-Prestación de servicios: El CONTRATISTA se obliga con POSITIVA a la prestación de los servicios de salud para los asegurados y o afiliados a POSITIVA que accedan a los servicios habilitados del CONTRATISTA en calidad de asegurados a los ramos Administración de Riesgos Laborales ARL por causa exclusiva de un accidente de trabajo una enfermedad profesional) Accidentes Personales AP Educativo Generación Positiva AP Colectivos APCorto Plazo AP Individual y demás Ramos de Seguros autorizados a Positiva encontrándose excluidos del presente contrato los servicios y todas aquellas actividades procedimientos e intervenciones que no tengan por objeto contribuir al diagnóstico tratamiento o rehabilitación de la patología derivada del siniestro o los servicios considerados como experimentales cosméticos y suntuarios."}]
["VICEPRESIDENCIA TÉCNICA","Gerencia Médica","NO","C65882022",85100000,"Prestación de servicios: El CONTRATISTA se obliga con POSITIVA a la prestación de los servicios de salud para los asegurados y o afiliados a POSITIVA que accedan a los servicios habilitados del CONTRATISTA en calidad de asegurados a los ramos Administración de Riesgos Laborales ARL por causa exclusiva de un accidente de trabajo una enfermedad profesional) Accidentes Personales AP Educativo Generación Positiva AP Colectivos APCorto Plazo AP Individual y demás Ramos de Seguros autorizados a Positiva encontrándose excluidos del presente contrato los servicios y todas aquellas actividades procedimientos e intervenciones que no tengan por objeto contribuir al diagnóstico tratamiento o rehabilitación de la patología derivada del siniestro o los servicios considerados como experimentales cosméticos y suntuarios.","2022-08-24",{"$f":"MONTH(G543)","v":8},"2024-08-24",{"$f":"(I543-G543)/30","v":24.366666666666667},"Invitación directa","CargoAReserva",0,0,"NO",null,"Gerencia de Abastecimiento Estratégico\ncontratacion@positiva.gov.co\nPBX: (1)6502200 Ext: 10641","SI","SI","NO","SI",{"$f":"IF(U543=\"SI\",\"Pública clasificada\",\"Pública\")","v":"Pública clasificada"},{"$f":"CONCATENATE(D543,\"-\",\"Tipo de información\",\" \",V543,\"-\",F543)","v":"C65882022-Tipo de información Pública clasificada-Prestación de servicios: El CONTRATISTA se obliga con POSITIVA a la prestación de los servicios de salud para los asegurados y o afiliados a POSITIVA que accedan a los servicios habilitados del CONTRATISTA en calidad de asegurados a los ramos Administración de Riesgos Laborales ARL por causa exclusiva de un accidente de trabajo una enfermedad profesional) Accidentes Personales AP Educativo Generación Positiva AP Colectivos APCorto Plazo AP Individual y demás Ramos de Seguros autorizados a Positiva encontrándose excluidos del presente contrato los servicios y todas aquellas actividades procedimientos e intervenciones que no tengan por objeto contribuir al diagnóstico tratamiento o rehabilitación de la patología derivada del siniestro o los servicios considerados como experimentales cosméticos y suntuarios."}]
["VICEPRESIDENCIA TÉCNICA","Gerencia Médica","NO","C65892022",85100000,"Prestación de servicios: El CONTRATISTA se obliga con POSITIVA a la prestación de los servicios de salud para los asegurados y o afiliados a POSITIVA que accedan a los servicios habilitados del CONTRATISTA en calidad de asegurados a los ramos Administración de Riesgos Laborales ARL por causa exclusiva de un accidente de trabajo una enfermedad profesional) Accidentes Personales AP Educativo Generación Positiva AP Colectivos APCorto Plazo AP Individual y demás Ramos de Seguros autorizados a Positiva encontrándose excluidos del presente contrato los servicios y todas aquellas actividades procedimientos e intervenciones que no tengan por objeto contribuir al diagnóstico tratamiento o rehabilitación de la patología derivada del siniestro o los servicios considerados como experimentales cosméticos y suntuarios.","2022-11-16",{"$f":"MONTH(G544)","v":11},"2024-11-16",{"$f":"(I544-G544)/30","v":24.366666666666667},"Invitación directa","CargoAReserva",0,0,"NO",null,"Gerencia de Abastecimiento Estratégico\ncontratacion@positiva.gov.co\nPBX: (1)6502200 Ext: 10641","SI","SI","NO","SI",{"$f":"IF(U544=\"SI\",\"Pública clasificada\",\"Pública\")","v":"Pública clasificada"},{"$f":"CONCATENATE(D544,\"-\",\"Tipo de información\",\" \",V544,\"-\",F544)","v":"C65892022-Tipo de información Pública clasificada-Prestación de servicios: El CONTRATISTA se obliga con POSITIVA a la prestación de los servicios de salud para los asegurados y o afiliados a POSITIVA que accedan a los servicios habilitados del CONTRATISTA en calidad de asegurados a los ramos Administración de Riesgos Laborales ARL por causa exclusiva de un accidente de trabajo una enfermedad profesional) Accidentes Personales AP Educativo Generación Positiva AP Colectivos APCorto Plazo AP Individual y demás Ramos de Seguros autorizados a Positiva encontrándose excluidos del presente contrato los servicios y todas aquellas actividades procedimientos e intervenciones que no tengan por objeto contribuir al diagnóstico tratamiento o rehabilitación de la patología derivada del siniestro o los servicios considerados como experimentales cosméticos y suntuarios."}]
["VICEPRESIDENCIA TÉCNICA","Gerencia Médica","NO","C65902022",85100000,"Prestación de servicios: El CONTRATISTA se obliga con POSITIVA a la prestación de los servicios de salud para los asegurados y o afiliados a POSITIVA que accedan a los servicios habilitados del CONTRATISTA en calidad de asegurados a los ramos Administración de Riesgos Laborales ARL por causa exclusiva de un accidente de trabajo una enfermedad profesional) Accidentes Personales AP Educativo Generación Positiva AP Colectivos APCorto Plazo AP Individual y demás Ramos de Seguros autorizados a Positiva encontrándose excluidos del presente contrato los servicios y todas aquellas actividades procedimientos e intervenciones que no tengan por objeto contribuir al diagnóstico tratamiento o rehabilitación de la patología derivada del siniestro o los servicios considerados como experimentales cosméticos y suntuarios.","2022-11-16",{"$f":"MONTH(G545)","v":11},"2024-11-16",{"$f":"(I545-G545)/30","v":24.366666666666667},"Invitación directa","CargoAReserva",0,0,"NO",null,"Gerencia de Abastecimiento Estratégico\ncontratacion@positiva.gov.co\nPBX: (1)6502200 Ext: 10641","SI","SI","NO","SI",{"$f":"IF(U545=\"SI\",\"Pública clasificada\",\"Pública\")","v":"Pública clasificada"},{"$f":"CONCATENATE(D545,\"-\",\"Tipo de información\",\" \",V545,\"-\",F545)","v":"C65902022-Tipo de información Pública clasificada-Prestación de servicios: El CONTRATISTA se obliga con POSITIVA a la prestación de los servicios de salud para los asegurados y o afiliados a POSITIVA que accedan a los servicios habilitados del CONTRATISTA en calidad de asegurados a los ramos Administración de Riesgos Laborales ARL por causa exclusiva de un accidente de trabajo una enfermedad profesional) Accidentes Personales AP Educativo Generación Positiva AP Colectivos APCorto Plazo AP Individual y demás Ramos de Seguros autorizados a Positiva encontrándose excluidos del presente contrato los servicios y todas aquellas actividades procedimientos e intervenciones que no tengan por objeto contribuir al diagnóstico tratamiento o rehabilitación de la patología derivada del siniestro o los servicios considerados como experimentales cosméticos y suntuarios."}]
["VICEPRESIDENCIA TÉCNICA","Gerencia Médica","NO","C65912022",85100000,"Prestación de servicios: El CONTRATISTA se obliga con POSITIVA a la prestación de los servicios de salud para los asegurados y o afiliados a POSITIVA que accedan a los servicios habilitados del CONTRATISTA en calidad de asegurados a los ramos Administración de Riesgos Laborales ARL por causa exclusiva de un accidente de trabajo una enfermedad profesional) Accidentes Personales AP Educativo Generación Positiva AP Colectivos APCorto Plazo AP Individual y demás Ramos de Seguros autorizados a Positiva encontrándose excluidos del presente contrato los servicios y todas aquellas actividades procedimientos e intervenciones que no tengan por objeto contribuir al diagnóstico tratamiento o rehabilitación de la patología derivada del siniestro o los servicios considerados como experimentales cosméticos y suntuarios.","2022-12-06",{"$f":"MONTH(G546)","v":12},"2024-12-06",{"$f":"(I546-G546)/30","v":24.366666666666667},"Invitación directa","CargoAReserva",0,0,"NO",null,"Gerencia de Abastecimiento Estratégico\ncontratacion@positiva.gov.co\nPBX: (1)6502200 Ext: 10641","SI","SI","NO","SI",{"$f":"IF(U546=\"SI\",\"Pública clasificada\",\"Pública\")","v":"Pública clasificada"},{"$f":"CONCATENATE(D546,\"-\",\"Tipo de información\",\" \",V546,\"-\",F546)","v":"C65912022-Tipo de información Pública clasificada-Prestación de servicios: El CONTRATISTA se obliga con POSITIVA a la prestación de los servicios de salud para los asegurados y o afiliados a POSITIVA que accedan a los servicios habilitados del CONTRATISTA en calidad de asegurados a los ramos Administración de Riesgos Laborales ARL por causa exclusiva de un accidente de trabajo una enfermedad profesional) Accidentes Personales AP Educativo Generación Positiva AP Colectivos APCorto Plazo AP Individual y demás Ramos de Seguros autorizados a Positiva encontrándose excluidos del presente contrato los servicios y todas aquellas actividades procedimientos e intervenciones que no tengan por objeto contribuir al diagnóstico tratamiento o rehabilitación de la patología derivada del siniestro o los servicios considerados como experimentales cosméticos y suntuarios."}]
["VICEPRESIDENCIA TÉCNICA","Gerencia Médica","NO","C65922022",85100000,"Prestación de servicios: El CONTRATISTA se obliga con POSITIVA a la prestación de los servicios de salud para los asegurados y o afiliados a POSITIVA que accedan a los servicios habilitados del CONTRATISTA en calidad de asegurados a los ramos Administración de Riesgos Laborales ARL por causa exclusiva de un accidente de trabajo una enfermedad profesional) Accidentes Personales AP Educativo Generación Positiva AP Colectivos APCorto Plazo AP Individual y demás Ramos de Seguros autorizados a Positiva encontrándose excluidos del presente contrato los servicios y todas aquellas actividades procedimientos e intervenciones que no tengan por objeto contribuir al diagnóstico tratamiento o rehabilitación de la patología derivada del siniestro o los servicios considerados como experimentales cosméticos y suntuarios.","2022-12-07",{"$f":"MONTH(G547)","v":12},"2024-12-07",{"$f":"(I547-G547)/30","v":24.366666666666667},"Invitación directa","CargoAReserva",0,0,"NO",null,"Gerencia de Abastecimiento Estratégico\ncontratacion@positiva.gov.co\nPBX: (1)6502200 Ext: 10641","SI","SI","NO","SI",{"$f":"IF(U547=\"SI\",\"Pública clasificada\",\"Pública\")","v":"Pública clasificada"},{"$f":"CONCATENATE(D547,\"-\",\"Tipo de información\",\" \",V547,\"-\",F547)","v":"C65922022-Tipo de información Pública clasificada-Prestación de servicios: El CONTRATISTA se obliga con POSITIVA a la prestación de los servicios de salud para los asegurados y o afiliados a POSITIVA que accedan a los servicios habilitados del CONTRATISTA en calidad de asegurados a los ramos Administración de Riesgos Laborales ARL por causa exclusiva de un accidente de trabajo una enfermedad profesional) Accidentes Personales AP Educativo Generación Positiva AP Colectivos APCorto Plazo AP Individual y demás Ramos de Seguros autorizados a Positiva encontrándose excluidos del presente contrato los servicios y todas aquellas actividades procedimientos e intervenciones que no tengan por objeto contribuir al diagnóstico tratamiento o rehabilitación de la patología derivada del siniestro o los servicios considerados como experimentales cosméticos y suntuarios."}]
["VICEPRESIDENCIA TÉCNICA","Gerencia Médica","NO","C65932022",85100000,"Prestación de servicios: El CONTRATISTA se obliga con POSITIVA a la prestación de los servicios de salud para los asegurados y o afiliados a POSITIVA que accedan a los servicios habilitados del CONTRATISTA en calidad de asegurados a los ramos Administración de Riesgos Laborales ARL por causa exclusiva de un accidente de trabajo una enfermedad profesional) Accidentes Personales AP Educativo Generación Positiva AP Colectivos APCorto Plazo AP Individual y demás Ramos de Seguros autorizados a Positiva encontrándose excluidos del presente contrato los servicios y todas aquellas actividades procedimientos e intervenciones que no tengan por objeto contribuir al diagnóstico tratamiento o rehabilitación de la patología derivada del siniestro o los servicios considerados como experimentales cosméticos y suntuarios.","2022-12-20",{"$f":"MONTH(G548)","v":12},"2024-12-20",{"$f":"(I548-G548)/30","v":24.366666666666667},"Invitación directa","CargoAReserva",0,0,"NO",null,"Gerencia de Abastecimiento Estratégico\ncontratacion@positiva.gov.co\nPBX: (1)6502200 Ext: 10641","SI","SI","NO","SI",{"$f":"IF(U548=\"SI\",\"Pública clasificada\",\"Pública\")","v":"Pública clasificada"},{"$f":"CONCATENATE(D548,\"-\",\"Tipo de información\",\" \",V548,\"-\",F548)","v":"C65932022-Tipo de información Pública clasificada-Prestación de servicios: El CONTRATISTA se obliga con POSITIVA a la prestación de los servicios de salud para los asegurados y o afiliados a POSITIVA que accedan a los servicios habilitados del CONTRATISTA en calidad de asegurados a los ramos Administración de Riesgos Laborales ARL por causa exclusiva de un accidente de trabajo una enfermedad profesional) Accidentes Personales AP Educativo Generación Positiva AP Colectivos APCorto Plazo AP Individual y demás Ramos de Seguros autorizados a Positiva encontrándose excluidos del presente contrato los servicios y todas aquellas actividades procedimientos e intervenciones que no tengan por objeto contribuir al diagnóstico tratamiento o rehabilitación de la patología derivada del siniestro o los servicios considerados como experimentales cosméticos y suntuarios."}]
["VICEPRESIDENCIA TÉCNICA","Gerencia Médica","NO","C65942022",85100000,"Prestación de servicios: El CONTRATISTA se obliga con POSITIVA a la prestación de los servicios de salud para los asegurados y o afiliados a POSITIVA que accedan a los servicios habilitados del CONTRATISTA en calidad de asegurados a los ramos Administración de Riesgos Laborales ARL por causa exclusiva de un accidente de trabajo una enfermedad profesional) Accidentes Personales AP Educativo Generación Positiva AP Colectivos APCorto Plazo AP Individual y demás Ramos de Seguros autorizados a Positiva encontrándose excluidos del presente contrato los servicios y todas aquellas actividades procedimientos e intervenciones que no tengan por objeto contribuir al diagnóstico tratamiento o rehabilitación de la patología derivada del siniestro o los servicios considerados como experimentales cosméticos y suntuarios.","2022-12-29",{"$f":"MONTH(G549)","v":12},"2024-12-29",{"$f":"(I549-G549)/30","v":24.366666666666667},"Invitación directa","CargoAReserva",0,0,"NO",null,"Gerencia de Abastecimiento Estratégico\ncontratacion@positiva.gov.co\nPBX: (1)6502200 Ext: 10641","SI","SI","NO","SI",{"$f":"IF(U549=\"SI\",\"Pública clasificada\",\"Pública\")","v":"Pública clasificada"},{"$f":"CONCATENATE(D549,\"-\",\"Tipo de información\",\" \",V549,\"-\",F549)","v":"C65942022-Tipo de información Pública clasificada-Prestación de servicios: El CONTRATISTA se obliga con POSITIVA a la prestación de los servicios de salud para los asegurados y o afiliados a POSITIVA que accedan a los servicios habilitados del CONTRATISTA en calidad de asegurados a los ramos Administración de Riesgos Laborales ARL por causa exclusiva de un accidente de trabajo una enfermedad profesional) Accidentes Personales AP Educativo Generación Positiva AP Colectivos APCorto Plazo AP Individual y demás Ramos de Seguros autorizados a Positiva encontrándose excluidos del presente contrato los servicios y todas aquellas actividades procedimientos e intervenciones que no tengan por objeto contribuir al diagnóstico tratamiento o rehabilitación de la patología derivada del siniestro o los servicios considerados como experimentales cosméticos y suntuarios."}]
["VICEPRESIDENCIA TÉCNICA","Gerencia Médica","NO","C65952022",85100000,"Prestación de servicios: El CONTRATISTA se obliga con POSITIVA a la prestación de los servicios de salud para los asegurados y o afiliados a POSITIVA que accedan a los servicios habilitados del CONTRATISTA en calidad de asegurados a los ramos Administración de Riesgos Laborales ARL por causa exclusiva de un accidente de trabajo una enfermedad profesional) Accidentes Personales AP Educativo Generación Positiva AP Colectivos APCorto Plazo AP Individual y demás Ramos de Seguros autorizados a Positiva encontrándose excluidos del presente contrato los servicios y todas aquellas actividades procedimientos e intervenciones que no tengan por objeto contribuir al diagnóstico tratamiento o rehabilitación de la patología derivada del siniestro o los servicios considerados como experimentales cosméticos y suntuarios.","2022-10-01",{"$f":"MONTH(G550)","v":10},"2024-10-30",{"$f":"(I550-G550)/30","v":25.333333333333332},"Invitación directa","CargoAReserva",0,0,"NO",null,"Gerencia de Abastecimiento Estratégico\ncontratacion@positiva.gov.co\nPBX: (1)6502200 Ext: 10641","SI","SI","NO","SI",{"$f":"IF(U550=\"SI\",\"Pública clasificada\",\"Pública\")","v":"Pública clasificada"},{"$f":"CONCATENATE(D550,\"-\",\"Tipo de información\",\" \",V550,\"-\",F550)","v":"C65952022-Tipo de información Pública clasificada-Prestación de servicios: El CONTRATISTA se obliga con POSITIVA a la prestación de los servicios de salud para los asegurados y o afiliados a POSITIVA que accedan a los servicios habilitados del CONTRATISTA en calidad de asegurados a los ramos Administración de Riesgos Laborales ARL por causa exclusiva de un accidente de trabajo una enfermedad profesional) Accidentes Personales AP Educativo Generación Positiva AP Colectivos APCorto Plazo AP Individual y demás Ramos de Seguros autorizados a Positiva encontrándose excluidos del presente contrato los servicios y todas aquellas actividades procedimientos e intervenciones que no tengan por objeto contribuir al diagnóstico tratamiento o rehabilitación de la patología derivada del siniestro o los servicios considerados como experimentales cosméticos y suntuarios."}]
["VICEPRESIDENCIA TÉCNICA","Gerencia Médica","NO","C65962022",85100000,"Prestación de servicios: El CONTRATISTA se obliga con POSITIVA a la prestación de los servicios de salud para los asegurados y o afiliados a POSITIVA que accedan a los servicios habilitados del CONTRATISTA en calidad de asegurados a los ramos Administración de Riesgos Laborales ARL por causa exclusiva de un accidente de trabajo una enfermedad profesional) Accidentes Personales AP Educativo Generación Positiva AP Colectivos APCorto Plazo AP Individual y demás Ramos de Seguros autorizados a Positiva encontrándose excluidos del presente contrato los servicios y todas aquellas actividades procedimientos e intervenciones que no tengan por objeto contribuir al diagnóstico tratamiento o rehabilitación de la patología derivada del siniestro o los servicios considerados como experimentales cosméticos y suntuarios.","2022-07-15",{"$f":"MONTH(G551)","v":7},"2024-07-15",{"$f":"(I551-G551)/30","v":24.366666666666667},"Invitación directa","CargoAReserva",0,0,"NO",null,"Gerencia de Abastecimiento Estratégico\ncontratacion@positiva.gov.co\nPBX: (1)6502200 Ext: 10641","SI","SI","NO","SI",{"$f":"IF(U551=\"SI\",\"Pública clasificada\",\"Pública\")","v":"Pública clasificada"},{"$f":"CONCATENATE(D551,\"-\",\"Tipo de información\",\" \",V551,\"-\",F551)","v":"C65962022-Tipo de información Pública clasificada-Prestación de servicios: El CONTRATISTA se obliga con POSITIVA a la prestación de los servicios de salud para los asegurados y o afiliados a POSITIVA que accedan a los servicios habilitados del CONTRATISTA en calidad de asegurados a los ramos Administración de Riesgos Laborales ARL por causa exclusiva de un accidente de trabajo una enfermedad profesional) Accidentes Personales AP Educativo Generación Positiva AP Colectivos APCorto Plazo AP Individual y demás Ramos de Seguros autorizados a Positiva encontrándose excluidos del presente contrato los servicios y todas aquellas actividades procedimientos e intervenciones que no tengan por objeto contribuir al diagnóstico tratamiento o rehabilitación de la patología derivada del siniestro o los servicios considerados como experimentales cosméticos y suntuarios."}]
["VICEPRESIDENCIA TÉCNICA","Gerencia Médica","NO","C65972022",85100000,"Prestación de servicios: El CONTRATISTA se obliga con POSITIVA a la prestación de los servicios de salud para los asegurados y o afiliados a POSITIVA que accedan a los servicios habilitados del CONTRATISTA en calidad de asegurados a los ramos Administración de Riesgos Laborales ARL por causa exclusiva de un accidente de trabajo una enfermedad profesional) Accidentes Personales AP Educativo Generación Positiva AP Colectivos APCorto Plazo AP Individual y demás Ramos de Seguros autorizados a Positiva encontrándose excluidos del presente contrato los servicios y todas aquellas actividades procedimientos e intervenciones que no tengan por objeto contribuir al diagnóstico tratamiento o rehabilitación de la patología derivada del siniestro o los servicios considerados como experimentales cosméticos y suntuarios.","2022-08-16",{"$f":"MONTH(G552)","v":8},"2024-08-16",{"$f":"(I552-G552)/30","v":24.366666666666667},"Invitación directa","CargoAReserva",0,0,"NO",null,"Gerencia de Abastecimiento Estratégico\ncontratacion@positiva.gov.co\nPBX: (1)6502200 Ext: 10641","SI","SI","NO","SI",{"$f":"IF(U552=\"SI\",\"Pública clasificada\",\"Pública\")","v":"Pública clasificada"},{"$f":"CONCATENATE(D552,\"-\",\"Tipo de información\",\" \",V552,\"-\",F552)","v":"C65972022-Tipo de información Pública clasificada-Prestación de servicios: El CONTRATISTA se obliga con POSITIVA a la prestación de los servicios de salud para los asegurados y o afiliados a POSITIVA que accedan a los servicios habilitados del CONTRATISTA en calidad de asegurados a los ramos Administración de Riesgos Laborales ARL por causa exclusiva de un accidente de trabajo una enfermedad profesional) Accidentes Personales AP Educativo Generación Positiva AP Colectivos APCorto Plazo AP Individual y demás Ramos de Seguros autorizados a Positiva encontrándose excluidos del presente contrato los servicios y todas aquellas actividades procedimientos e intervenciones que no tengan por objeto contribuir al diagnóstico tratamiento o rehabilitación de la patología derivada del siniestro o los servicios considerados como experimentales cosméticos y suntuarios."}]
["VICEPRESIDENCIA TÉCNICA","Gerencia Médica","NO","C65982022",85100000,"Prestación de servicios: El CONTRATISTA se obliga con POSITIVA a la prestación de los servicios de salud para los asegurados y o afiliados a POSITIVA que accedan a los servicios habilitados del CONTRATISTA en calidad de asegurados a los ramos Administración de Riesgos Laborales ARL por causa exclusiva de un accidente de trabajo una enfermedad profesional) Accidentes Personales AP Educativo Generación Positiva AP Colectivos APCorto Plazo AP Individual y demás Ramos de Seguros autorizados a Positiva encontrándose excluidos del presente contrato los servicios y todas aquellas actividades procedimientos e intervenciones que no tengan por objeto contribuir al diagnóstico tratamiento o rehabilitación de la patología derivada del siniestro o los servicios considerados como experimentales cosméticos y suntuarios.","2022-09-25",{"$f":"MONTH(G553)","v":9},"2024-09-25",{"$f":"(I553-G553)/30","v":24.366666666666667},"Invitación directa","CargoAReserva",0,0,"NO",null,"Gerencia de Abastecimiento Estratégico\ncontratacion@positiva.gov.co\nPBX: (1)6502200 Ext: 10641","SI","SI","NO","SI",{"$f":"IF(U553=\"SI\",\"Pública clasificada\",\"Pública\")","v":"Pública clasificada"},{"$f":"CONCATENATE(D553,\"-\",\"Tipo de información\",\" \",V553,\"-\",F553)","v":"C65982022-Tipo de información Pública clasificada-Prestación de servicios: El CONTRATISTA se obliga con POSITIVA a la prestación de los servicios de salud para los asegurados y o afiliados a POSITIVA que accedan a los servicios habilitados del CONTRATISTA en calidad de asegurados a los ramos Administración de Riesgos Laborales ARL por causa exclusiva de un accidente de trabajo una enfermedad profesional) Accidentes Personales AP Educativo Generación Positiva AP Colectivos APCorto Plazo AP Individual y demás Ramos de Seguros autorizados a Positiva encontrándose excluidos del presente contrato los servicios y todas aquellas actividades procedimientos e intervenciones que no tengan por objeto contribuir al diagnóstico tratamiento o rehabilitación de la patología derivada del siniestro o los servicios considerados como experimentales cosméticos y suntuarios."}]
["VICEPRESIDENCIA TÉCNICA","Gerencia Médica","NO","C65992022",85100000,"Prestación de servicios: El CONTRATISTA se obliga con POSITIVA a la prestación de los servicios de salud para los asegurados y o afiliados a POSITIVA que accedan a los servicios habilitados del CONTRATISTA en calidad de asegurados a los ramos Administración de Riesgos Laborales ARL por causa exclusiva de un accidente de trabajo una enfermedad profesional) Accidentes Personales AP Educativo Generación Positiva AP Colectivos APCorto Plazo AP Individual y demás Ramos de Seguros autorizados a Positiva encontrándose excluidos del presente contrato los servicios y todas aquellas actividades procedimientos e intervenciones que no tengan por objeto contribuir al diagnóstico tratamiento o rehabilitación de la patología derivada del siniestro o los servicios considerados como experimentales cosméticos y suntuarios.","2022-08-15",{"$f":"MONTH(G554)","v":8},"2024-08-15",{"$f":"(I554-G554)/30","v":24.366666666666667},"Invitación directa","CargoAReserva",0,0,"NO",null,"Gerencia de Abastecimiento Estratégico\ncontratacion@positiva.gov.co\nPBX: (1)6502200 Ext: 10641","SI","SI","NO","SI",{"$f":"IF(U554=\"SI\",\"Pública clasificada\",\"Pública\")","v":"Pública clasificada"},{"$f":"CONCATENATE(D554,\"-\",\"Tipo de información\",\" \",V554,\"-\",F554)","v":"C65992022-Tipo de información Pública clasificada-Prestación de servicios: El CONTRATISTA se obliga con POSITIVA a la prestación de los servicios de salud para los asegurados y o afiliados a POSITIVA que accedan a los servicios habilitados del CONTRATISTA en calidad de asegurados a los ramos Administración de Riesgos Laborales ARL por causa exclusiva de un accidente de trabajo una enfermedad profesional) Accidentes Personales AP Educativo Generación Positiva AP Colectivos APCorto Plazo AP Individual y demás Ramos de Seguros autorizados a Positiva encontrándose excluidos del presente contrato los servicios y todas aquellas actividades procedimientos e intervenciones que no tengan por objeto contribuir al diagnóstico tratamiento o rehabilitación de la patología derivada del siniestro o los servicios considerados como experimentales cosméticos y suntuarios."}]
["VICEPRESIDENCIA TÉCNICA","Gerencia Médica","NO","C66002022",85100000,"Prestación de servicios: El CONTRATISTA se obliga con POSITIVA a la prestación de los servicios de salud para los asegurados y o afiliados a POSITIVA que accedan a los servicios habilitados del CONTRATISTA en calidad de asegurados a los ramos Administración de Riesgos Laborales ARL por causa exclusiva de un accidente de trabajo una enfermedad profesional) Accidentes Personales AP Educativo Generación Positiva AP Colectivos APCorto Plazo AP Individual y demás Ramos de Seguros autorizados a Positiva encontrándose excluidos del presente contrato los servicios y todas aquellas actividades procedimientos e intervenciones que no tengan por objeto contribuir al diagnóstico tratamiento o rehabilitación de la patología derivada del siniestro o los servicios considerados como experimentales cosméticos y suntuarios.","2022-08-16",{"$f":"MONTH(G555)","v":8},"2024-08-16",{"$f":"(I555-G555)/30","v":24.366666666666667},"Invitación directa","CargoAReserva",0,0,"NO",null,"Gerencia de Abastecimiento Estratégico\ncontratacion@positiva.gov.co\nPBX: (1)6502200 Ext: 10641","SI","SI","NO","SI",{"$f":"IF(U555=\"SI\",\"Pública clasificada\",\"Pública\")","v":"Pública clasificada"},{"$f":"CONCATENATE(D555,\"-\",\"Tipo de información\",\" \",V555,\"-\",F555)","v":"C66002022-Tipo de información Pública clasificada-Prestación de servicios: El CONTRATISTA se obliga con POSITIVA a la prestación de los servicios de salud para los asegurados y o afiliados a POSITIVA que accedan a los servicios habilitados del CONTRATISTA en calidad de asegurados a los ramos Administración de Riesgos Laborales ARL por causa exclusiva de un accidente de trabajo una enfermedad profesional) Accidentes Personales AP Educativo Generación Positiva AP Colectivos APCorto Plazo AP Individual y demás Ramos de Seguros autorizados a Positiva encontrándose excluidos del presente contrato los servicios y todas aquellas actividades procedimientos e intervenciones que no tengan por objeto contribuir al diagnóstico tratamiento o rehabilitación de la patología derivada del siniestro o los servicios considerados como experimentales cosméticos y suntuarios."}]
["VICEPRESIDENCIA TÉCNICA","Gerencia Médica","NO","C66012022",85100000,"Prestación de servicios: El CONTRATISTA se obliga con POSITIVA a la prestación de los servicios de salud para los asegurados y o afiliados a POSITIVA que accedan a los servicios habilitados del CONTRATISTA en calidad de asegurados a los ramos Administración de Riesgos Laborales ARL por causa exclusiva de un accidente de trabajo una enfermedad profesional) Accidentes Personales AP Educativo Generación Positiva AP Colectivos APCorto Plazo AP Individual y demás Ramos de Seguros autorizados a Positiva encontrándose excluidos del presente contrato los servicios y todas aquellas actividades procedimientos e intervenciones que no tengan por objeto contribuir al diagnóstico tratamiento o rehabilitación de la patología derivada del siniestro o los servicios considerados como experimentales cosméticos y suntuarios.","2022-03-01",{"$f":"MONTH(G556)","v":3},"2024-03-01",{"$f":"(I556-G556)/30","v":24.366666666666667},"Invitación directa","CargoAReserva",0,0,"NO",null,"Gerencia de Abastecimiento Estratégico\ncontratacion@positiva.gov.co\nPBX: (1)6502200 Ext: 10641","SI","SI","NO","SI",{"$f":"IF(U556=\"SI\",\"Pública clasificada\",\"Pública\")","v":"Pública clasificada"},{"$f":"CONCATENATE(D556,\"-\",\"Tipo de información\",\" \",V556,\"-\",F556)","v":"C66012022-Tipo de información Pública clasificada-Prestación de servicios: El CONTRATISTA se obliga con POSITIVA a la prestación de los servicios de salud para los asegurados y o afiliados a POSITIVA que accedan a los servicios habilitados del CONTRATISTA en calidad de asegurados a los ramos Administración de Riesgos Laborales ARL por causa exclusiva de un accidente de trabajo una enfermedad profesional) Accidentes Personales AP Educativo Generación Positiva AP Colectivos APCorto Plazo AP Individual y demás Ramos de Seguros autorizados a Positiva encontrándose excluidos del presente contrato los servicios y todas aquellas actividades procedimientos e intervenciones que no tengan por objeto contribuir al diagnóstico tratamiento o rehabilitación de la patología derivada del siniestro o los servicios considerados como experimentales cosméticos y suntuarios."}]
["VICEPRESIDENCIA TÉCNICA","Gerencia Médica","NO","C66022022",85100000,"Prestación de servicios: El CONTRATISTA se obliga con POSITIVA a la prestación de los servicios de salud para los asegurados y o afiliados a POSITIVA que accedan a los servicios habilitados del CONTRATISTA en calidad de asegurados a los ramos Administración de Riesgos Laborales ARL por causa exclusiva de un accidente de trabajo una enfermedad profesional) Accidentes Personales AP Educativo Generación Positiva AP Colectivos APCorto Plazo AP Individual y demás Ramos de Seguros autorizados a Positiva encontrándose excluidos del presente contrato los servicios y todas aquellas actividades procedimientos e intervenciones que no tengan por objeto contribuir al diagnóstico tratamiento o rehabilitación de la patología derivada del siniestro o los servicios considerados como experimentales cosméticos y suntuarios.","2022-03-11",{"$f":"MONTH(G557)","v":3},"2024-03-11",{"$f":"(I557-G557)/30","v":24.366666666666667},"Invitación directa","CargoAReserva",0,0,"NO",null,"Gerencia de Abastecimiento Estratégico\ncontratacion@positiva.gov.co\nPBX: (1)6502200 Ext: 10641","SI","SI","NO","SI",{"$f":"IF(U557=\"SI\",\"Pública clasificada\",\"Pública\")","v":"Pública clasificada"},{"$f":"CONCATENATE(D557,\"-\",\"Tipo de información\",\" \",V557,\"-\",F557)","v":"C66022022-Tipo de información Pública clasificada-Prestación de servicios: El CONTRATISTA se obliga con POSITIVA a la prestación de los servicios de salud para los asegurados y o afiliados a POSITIVA que accedan a los servicios habilitados del CONTRATISTA en calidad de asegurados a los ramos Administración de Riesgos Laborales ARL por causa exclusiva de un accidente de trabajo una enfermedad profesional) Accidentes Personales AP Educativo Generación Positiva AP Colectivos APCorto Plazo AP Individual y demás Ramos de Seguros autorizados a Positiva encontrándose excluidos del presente contrato los servicios y todas aquellas actividades procedimientos e intervenciones que no tengan por objeto contribuir al diagnóstico tratamiento o rehabilitación de la patología derivada del siniestro o los servicios considerados como experimentales cosméticos y suntuarios."}]
["VICEPRESIDENCIA TÉCNICA","Gerencia Médica","NO","C66032022",85100000,"Prestación de servicios: El CONTRATISTA se obliga con POSITIVA a la prestación de los servicios de salud para los asegurados y o afiliados a POSITIVA que accedan a los servicios habilitados del CONTRATISTA en calidad de asegurados a los ramos Administración de Riesgos Laborales ARL por causa exclusiva de un accidente de trabajo una enfermedad profesional) Accidentes Personales AP Educativo Generación Positiva AP Colectivos APCorto Plazo AP Individual y demás Ramos de Seguros autorizados a Positiva encontrándose excluidos del presente contrato los servicios y todas aquellas actividades procedimientos e intervenciones que no tengan por objeto contribuir al diagnóstico tratamiento o rehabilitación de la patología derivada del siniestro o los servicios considerados como experimentales cosméticos y suntuarios.","2022-04-01",{"$f":"MONTH(G558)","v":4},"2024-04-01",{"$f":"(I558-G558)/30","v":24.366666666666667},"Invitación directa","CargoAReserva",0,0,"NO",null,"Gerencia de Abastecimiento Estratégico\ncontratacion@positiva.gov.co\nPBX: (1)6502200 Ext: 10641","SI","SI","NO","SI",{"$f":"IF(U558=\"SI\",\"Pública clasificada\",\"Pública\")","v":"Pública clasificada"},{"$f":"CONCATENATE(D558,\"-\",\"Tipo de información\",\" \",V558,\"-\",F558)","v":"C66032022-Tipo de información Pública clasificada-Prestación de servicios: El CONTRATISTA se obliga con POSITIVA a la prestación de los servicios de salud para los asegurados y o afiliados a POSITIVA que accedan a los servicios habilitados del CONTRATISTA en calidad de asegurados a los ramos Administración de Riesgos Laborales ARL por causa exclusiva de un accidente de trabajo una enfermedad profesional) Accidentes Personales AP Educativo Generación Positiva AP Colectivos APCorto Plazo AP Individual y demás Ramos de Seguros autorizados a Positiva encontrándose excluidos del presente contrato los servicios y todas aquellas actividades procedimientos e intervenciones que no tengan por objeto contribuir al diagnóstico tratamiento o rehabilitación de la patología derivada del siniestro o los servicios considerados como experimentales cosméticos y suntuarios."}]
["VICEPRESIDENCIA TÉCNICA","Gerencia Médica","NO","C66042022",85100000,"Prestación de servicios: El CONTRATISTA se obliga con POSITIVA a la prestación de los servicios de salud para los asegurados y o afiliados a POSITIVA que accedan a los servicios habilitados del CONTRATISTA en calidad de asegurados a los ramos Administración de Riesgos Laborales ARL por causa exclusiva de un accidente de trabajo una enfermedad profesional) Accidentes Personales AP Educativo Generación Positiva AP Colectivos APCorto Plazo AP Individual y demás Ramos de Seguros autorizados a Positiva encontrándose excluidos del presente contrato los servicios y todas aquellas actividades procedimientos e intervenciones que no tengan por objeto contribuir al diagnóstico tratamiento o rehabilitación de la patología derivada del siniestro o los servicios considerados como experimentales cosméticos y suntuarios.","2022-04-01",{"$f":"MONTH(G559)","v":4},"2024-04-01",{"$f":"(I559-G559)/30","v":24.366666666666667},"Invitación directa","CargoAReserva",0,0,"NO",null,"Gerencia de Abastecimiento Estratégico\ncontratacion@positiva.gov.co\nPBX: (1)6502200 Ext: 10641","SI","SI","NO","SI",{"$f":"IF(U559=\"SI\",\"Pública clasificada\",\"Pública\")","v":"Pública clasificada"},{"$f":"CONCATENATE(D559,\"-\",\"Tipo de información\",\" \",V559,\"-\",F559)","v":"C66042022-Tipo de información Pública clasificada-Prestación de servicios: El CONTRATISTA se obliga con POSITIVA a la prestación de los servicios de salud para los asegurados y o afiliados a POSITIVA que accedan a los servicios habilitados del CONTRATISTA en calidad de asegurados a los ramos Administración de Riesgos Laborales ARL por causa exclusiva de un accidente de trabajo una enfermedad profesional) Accidentes Personales AP Educativo Generación Positiva AP Colectivos APCorto Plazo AP Individual y demás Ramos de Seguros autorizados a Positiva encontrándose excluidos del presente contrato los servicios y todas aquellas actividades procedimientos e intervenciones que no tengan por objeto contribuir al diagnóstico tratamiento o rehabilitación de la patología derivada del siniestro o los servicios considerados como experimentales cosméticos y suntuarios."}]
["VICEPRESIDENCIA TÉCNICA","Gerencia Médica","NO","C66052022",85100000,"Prestación de servicios: El CONTRATISTA se obliga con POSITIVA a la prestación de los servicios de salud para los asegurados y o afiliados a POSITIVA que accedan a los servicios habilitados del CONTRATISTA en calidad de asegurados a los ramos Administración de Riesgos Laborales ARL por causa exclusiva de un accidente de trabajo una enfermedad profesional) Accidentes Personales AP Educativo Generación Positiva AP Colectivos APCorto Plazo AP Individual y demás Ramos de Seguros autorizados a Positiva encontrándose excluidos del presente contrato los servicios y todas aquellas actividades procedimientos e intervenciones que no tengan por objeto contribuir al diagnóstico tratamiento o rehabilitación de la patología derivada del siniestro o los servicios considerados como experimentales cosméticos y suntuarios.","2022-05-04",{"$f":"MONTH(G560)","v":5},"2024-05-04",{"$f":"(I560-G560)/30","v":24.366666666666667},"Invitación directa","CargoAReserva",0,0,"NO",null,"Gerencia de Abastecimiento Estratégico\ncontratacion@positiva.gov.co\nPBX: (1)6502200 Ext: 10641","SI","SI","NO","SI",{"$f":"IF(U560=\"SI\",\"Pública clasificada\",\"Pública\")","v":"Pública clasificada"},{"$f":"CONCATENATE(D560,\"-\",\"Tipo de información\",\" \",V560,\"-\",F560)","v":"C66052022-Tipo de información Pública clasificada-Prestación de servicios: El CONTRATISTA se obliga con POSITIVA a la prestación de los servicios de salud para los asegurados y o afiliados a POSITIVA que accedan a los servicios habilitados del CONTRATISTA en calidad de asegurados a los ramos Administración de Riesgos Laborales ARL por causa exclusiva de un accidente de trabajo una enfermedad profesional) Accidentes Personales AP Educativo Generación Positiva AP Colectivos APCorto Plazo AP Individual y demás Ramos de Seguros autorizados a Positiva encontrándose excluidos del presente contrato los servicios y todas aquellas actividades procedimientos e intervenciones que no tengan por objeto contribuir al diagnóstico tratamiento o rehabilitación de la patología derivada del siniestro o los servicios considerados como experimentales cosméticos y suntuarios."}]
["VICEPRESIDENCIA TÉCNICA","Gerencia Médica","NO","C66062022",85100000,"Prestación de servicios: El CONTRATISTA se obliga con POSITIVA a la prestación de los servicios de salud para los asegurados y o afiliados a POSITIVA que accedan a los servicios habilitados del CONTRATISTA en calidad de asegurados a los ramos Administración de Riesgos Laborales ARL por causa exclusiva de un accidente de trabajo una enfermedad profesional) Accidentes Personales AP Educativo Generación Positiva AP Colectivos APCorto Plazo AP Individual y demás Ramos de Seguros autorizados a Positiva encontrándose excluidos del presente contrato los servicios y todas aquellas actividades procedimientos e intervenciones que no tengan por objeto contribuir al diagnóstico tratamiento o rehabilitación de la patología derivada del siniestro o los servicios considerados como experimentales cosméticos y suntuarios.","2022-07-20",{"$f":"MONTH(G561)","v":7},"2024-07-20",{"$f":"(I561-G561)/30","v":24.366666666666667},"Invitación directa","CargoAReserva",0,0,"NO",null,"Gerencia de Abastecimiento Estratégico\ncontratacion@positiva.gov.co\nPBX: (1)6502200 Ext: 10641","SI","SI","NO","SI",{"$f":"IF(U561=\"SI\",\"Pública clasificada\",\"Pública\")","v":"Pública clasificada"},{"$f":"CONCATENATE(D561,\"-\",\"Tipo de información\",\" \",V561,\"-\",F561)","v":"C66062022-Tipo de información Pública clasificada-Prestación de servicios: El CONTRATISTA se obliga con POSITIVA a la prestación de los servicios de salud para los asegurados y o afiliados a POSITIVA que accedan a los servicios habilitados del CONTRATISTA en calidad de asegurados a los ramos Administración de Riesgos Laborales ARL por causa exclusiva de un accidente de trabajo una enfermedad profesional) Accidentes Personales AP Educativo Generación Positiva AP Colectivos APCorto Plazo AP Individual y demás Ramos de Seguros autorizados a Positiva encontrándose excluidos del presente contrato los servicios y todas aquellas actividades procedimientos e intervenciones que no tengan por objeto contribuir al diagnóstico tratamiento o rehabilitación de la patología derivada del siniestro o los servicios considerados como experimentales cosméticos y suntuarios."}]
["VICEPRESIDENCIA TÉCNICA","Gerencia Médica","NO","C66072022",85100000,"Prestación de servicios: El CONTRATISTA se obliga con POSITIVA a la prestación de los servicios de salud para los asegurados y o afiliados a POSITIVA que accedan a los servicios habilitados del CONTRATISTA en calidad de asegurados a los ramos Administración de Riesgos Laborales ARL por causa exclusiva de un accidente de trabajo una enfermedad profesional) Accidentes Personales AP Educativo Generación Positiva AP Colectivos APCorto Plazo AP Individual y demás Ramos de Seguros autorizados a Positiva encontrándose excluidos del presente contrato los servicios y todas aquellas actividades procedimientos e intervenciones que no tengan por objeto contribuir al diagnóstico tratamiento o rehabilitación de la patología derivada del siniestro o los servicios considerados como experimentales cosméticos y suntuarios.","2022-08-11",{"$f":"MONTH(G562)","v":8},"2024-08-11",{"$f":"(I562-G562)/30","v":24.366666666666667},"Invitación directa","CargoAReserva",0,0,"NO",null,"Gerencia de Abastecimiento Estratégico\ncontratacion@positiva.gov.co\nPBX: (1)6502200 Ext: 10641","SI","SI","NO","SI",{"$f":"IF(U562=\"SI\",\"Pública clasificada\",\"Pública\")","v":"Pública clasificada"},{"$f":"CONCATENATE(D562,\"-\",\"Tipo de información\",\" \",V562,\"-\",F562)","v":"C66072022-Tipo de información Pública clasificada-Prestación de servicios: El CONTRATISTA se obliga con POSITIVA a la prestación de los servicios de salud para los asegurados y o afiliados a POSITIVA que accedan a los servicios habilitados del CONTRATISTA en calidad de asegurados a los ramos Administración de Riesgos Laborales ARL por causa exclusiva de un accidente de trabajo una enfermedad profesional) Accidentes Personales AP Educativo Generación Positiva AP Colectivos APCorto Plazo AP Individual y demás Ramos de Seguros autorizados a Positiva encontrándose excluidos del presente contrato los servicios y todas aquellas actividades procedimientos e intervenciones que no tengan por objeto contribuir al diagnóstico tratamiento o rehabilitación de la patología derivada del siniestro o los servicios considerados como experimentales cosméticos y suntuarios."}]
["VICEPRESIDENCIA TÉCNICA","Gerencia Médica","NO","C66082022",85100000,"Prestación de servicios: El CONTRATISTA se obliga con POSITIVA a la prestación de los servicios de salud para los asegurados y o afiliados a POSITIVA que accedan a los servicios habilitados del CONTRATISTA en calidad de asegurados a los ramos Administración de Riesgos Laborales ARL por causa exclusiva de un accidente de trabajo una enfermedad profesional) Accidentes Personales AP Educativo Generación Positiva AP Colectivos APCorto Plazo AP Individual y demás Ramos de Seguros autorizados a Positiva encontrándose excluidos del presente contrato los servicios y todas aquellas actividades procedimientos e intervenciones que no tengan por objeto contribuir al diagnóstico tratamiento o rehabilitación de la patología derivada del siniestro o los servicios considerados como experimentales cosméticos y suntuarios.","2022-12-19",{"$f":"MONTH(G563)","v":12},"2024-12-19",{"$f":"(I563-G563)/30","v":24.366666666666667},"Invitación directa","CargoAReserva",0,0,"NO",null,"Gerencia de Abastecimiento Estratégico\ncontratacion@positiva.gov.co\nPBX: (1)6502200 Ext: 10641","SI","SI","NO","SI",{"$f":"IF(U563=\"SI\",\"Pública clasificada\",\"Pública\")","v":"Pública clasificada"},{"$f":"CONCATENATE(D563,\"-\",\"Tipo de información\",\" \",V563,\"-\",F563)","v":"C66082022-Tipo de información Pública clasificada-Prestación de servicios: El CONTRATISTA se obliga con POSITIVA a la prestación de los servicios de salud para los asegurados y o afiliados a POSITIVA que accedan a los servicios habilitados del CONTRATISTA en calidad de asegurados a los ramos Administración de Riesgos Laborales ARL por causa exclusiva de un accidente de trabajo una enfermedad profesional) Accidentes Personales AP Educativo Generación Positiva AP Colectivos APCorto Plazo AP Individual y demás Ramos de Seguros autorizados a Positiva encontrándose excluidos del presente contrato los servicios y todas aquellas actividades procedimientos e intervenciones que no tengan por objeto contribuir al diagnóstico tratamiento o rehabilitación de la patología derivada del siniestro o los servicios considerados como experimentales cosméticos y suntuarios."}]
["VICEPRESIDENCIA TÉCNICA","Gerencia Médica","NO","C66092022",85100000,"Prestación de servicios: El CONTRATISTA se obliga con POSITIVA a la prestación de los servicios de salud para los asegurados y o afiliados a POSITIVA que accedan a los servicios habilitados del CONTRATISTA en calidad de asegurados a los ramos Administración de Riesgos Laborales ARL por causa exclusiva de un accidente de trabajo una enfermedad profesional) Accidentes Personales AP Educativo Generación Positiva AP Colectivos APCorto Plazo AP Individual y demás Ramos de Seguros autorizados a Positiva encontrándose excluidos del presente contrato los servicios y todas aquellas actividades procedimientos e intervenciones que no tengan por objeto contribuir al diagnóstico tratamiento o rehabilitación de la patología derivada del siniestro o los servicios considerados como experimentales cosméticos y suntuarios.","2022-04-06",{"$f":"MONTH(G564)","v":4},"2024-04-06",{"$f":"(I564-G564)/30","v":24.366666666666667},"Invitación directa","CargoAReserva",0,0,"NO",null,"Gerencia de Abastecimiento Estratégico\ncontratacion@positiva.gov.co\nPBX: (1)6502200 Ext: 10641","SI","SI","NO","SI",{"$f":"IF(U564=\"SI\",\"Pública clasificada\",\"Pública\")","v":"Pública clasificada"},{"$f":"CONCATENATE(D564,\"-\",\"Tipo de información\",\" \",V564,\"-\",F564)","v":"C66092022-Tipo de información Pública clasificada-Prestación de servicios: El CONTRATISTA se obliga con POSITIVA a la prestación de los servicios de salud para los asegurados y o afiliados a POSITIVA que accedan a los servicios habilitados del CONTRATISTA en calidad de asegurados a los ramos Administración de Riesgos Laborales ARL por causa exclusiva de un accidente de trabajo una enfermedad profesional) Accidentes Personales AP Educativo Generación Positiva AP Colectivos APCorto Plazo AP Individual y demás Ramos de Seguros autorizados a Positiva encontrándose excluidos del presente contrato los servicios y todas aquellas actividades procedimientos e intervenciones que no tengan por objeto contribuir al diagnóstico tratamiento o rehabilitación de la patología derivada del siniestro o los servicios considerados como experimentales cosméticos y suntuarios."}]
["VICEPRESIDENCIA TÉCNICA","Gerencia Médica","NO","C66102022",85100000,"Prestación de servicios: El CONTRATISTA se obliga con POSITIVA a la prestación de los servicios de salud para los asegurados y o afiliados a POSITIVA que accedan a los servicios habilitados del CONTRATISTA en calidad de asegurados a los ramos Administración de Riesgos Laborales ARL por causa exclusiva de un accidente de trabajo una enfermedad profesional) Accidentes Personales AP Educativo Generación Positiva AP Colectivos APCorto Plazo AP Individual y demás Ramos de Seguros autorizados a Positiva encontrándose excluidos del presente contrato los servicios y todas aquellas actividades procedimientos e intervenciones que no tengan por objeto contribuir al diagnóstico tratamiento o rehabilitación de la patología derivada del siniestro o los servicios considerados como experimentales cosméticos y suntuarios.","2022-08-24",{"$f":"MONTH(G565)","v":8},"2024-08-24",{"$f":"(I565-G565)/30","v":24.366666666666667},"Invitación directa","CargoAReserva",0,0,"NO",null,"Gerencia de Abastecimiento Estratégico\ncontratacion@positiva.gov.co\nPBX: (1)6502200 Ext: 10641","SI","SI","NO","SI",{"$f":"IF(U565=\"SI\",\"Pública clasificada\",\"Pública\")","v":"Pública clasificada"},{"$f":"CONCATENATE(D565,\"-\",\"Tipo de información\",\" \",V565,\"-\",F565)","v":"C66102022-Tipo de información Pública clasificada-Prestación de servicios: El CONTRATISTA se obliga con POSITIVA a la prestación de los servicios de salud para los asegurados y o afiliados a POSITIVA que accedan a los servicios habilitados del CONTRATISTA en calidad de asegurados a los ramos Administración de Riesgos Laborales ARL por causa exclusiva de un accidente de trabajo una enfermedad profesional) Accidentes Personales AP Educativo Generación Positiva AP Colectivos APCorto Plazo AP Individual y demás Ramos de Seguros autorizados a Positiva encontrándose excluidos del presente contrato los servicios y todas aquellas actividades procedimientos e intervenciones que no tengan por objeto contribuir al diagnóstico tratamiento o rehabilitación de la patología derivada del siniestro o los servicios considerados como experimentales cosméticos y suntuarios."}]
["VICEPRESIDENCIA TÉCNICA","Gerencia Médica","NO","C66112022",85100000,"Prestación de servicios: El CONTRATISTA se obliga con POSITIVA a la prestación de los servicios de salud para los asegurados y o afiliados a POSITIVA que accedan a los servicios habilitados del CONTRATISTA en calidad de asegurados a los ramos Administración de Riesgos Laborales ARL por causa exclusiva de un accidente de trabajo una enfermedad profesional) Accidentes Personales AP Educativo Generación Positiva AP Colectivos APCorto Plazo AP Individual y demás Ramos de Seguros autorizados a Positiva encontrándose excluidos del presente contrato los servicios y todas aquellas actividades procedimientos e intervenciones que no tengan por objeto contribuir al diagnóstico tratamiento o rehabilitación de la patología derivada del siniestro o los servicios considerados como experimentales cosméticos y suntuarios.","2022-03-04",{"$f":"MONTH(G566)","v":3},"2027-03-24",{"$f":"(I566-G566)/30","v":61.533333333333331},"Invitación directa","CargoAReserva",0,0,"NO",null,"Gerencia de Abastecimiento Estratégico\ncontratacion@positiva.gov.co\nPBX: (1)6502200 Ext: 10641","SI","SI","NO","SI",{"$f":"IF(U566=\"SI\",\"Pública clasificada\",\"Pública\")","v":"Pública clasificada"},{"$f":"CONCATENATE(D566,\"-\",\"Tipo de información\",\" \",V566,\"-\",F566)","v":"C66112022-Tipo de información Pública clasificada-Prestación de servicios: El CONTRATISTA se obliga con POSITIVA a la prestación de los servicios de salud para los asegurados y o afiliados a POSITIVA que accedan a los servicios habilitados del CONTRATISTA en calidad de asegurados a los ramos Administración de Riesgos Laborales ARL por causa exclusiva de un accidente de trabajo una enfermedad profesional) Accidentes Personales AP Educativo Generación Positiva AP Colectivos APCorto Plazo AP Individual y demás Ramos de Seguros autorizados a Positiva encontrándose excluidos del presente contrato los servicios y todas aquellas actividades procedimientos e intervenciones que no tengan por objeto contribuir al diagnóstico tratamiento o rehabilitación de la patología derivada del siniestro o los servicios considerados como experimentales cosméticos y suntuarios."}]
["VICEPRESIDENCIA TÉCNICA","Gerencia Médica","NO","C66122022",85100000,"Prestación de servicios: El CONTRATISTA se obliga con POSITIVA a la prestación de los servicios de salud para los asegurados y o afiliados a POSITIVA que accedan a los servicios habilitados del CONTRATISTA en calidad de asegurados a los ramos Administración de Riesgos Laborales ARL por causa exclusiva de un accidente de trabajo una enfermedad profesional) Accidentes Personales AP Educativo Generación Positiva AP Colectivos APCorto Plazo AP Individual y demás Ramos de Seguros autorizados a Positiva encontrándose excluidos del presente contrato los servicios y todas aquellas actividades procedimientos e intervenciones que no tengan por objeto contribuir al diagnóstico tratamiento o rehabilitación de la patología derivada del siniestro o los servicios considerados como experimentales cosméticos y suntuarios.","2022-03-15",{"$f":"MONTH(G567)","v":3},"2024-03-15",{"$f":"(I567-G567)/30","v":24.366666666666667},"Invitación directa","CargoAReserva",0,0,"NO",null,"Gerencia de Abastecimiento Estratégico\ncontratacion@positiva.gov.co\nPBX: (1)6502200 Ext: 10641","SI","SI","NO","SI",{"$f":"IF(U567=\"SI\",\"Pública clasificada\",\"Pública\")","v":"Pública clasificada"},{"$f":"CONCATENATE(D567,\"-\",\"Tipo de información\",\" \",V567,\"-\",F567)","v":"C66122022-Tipo de información Pública clasificada-Prestación de servicios: El CONTRATISTA se obliga con POSITIVA a la prestación de los servicios de salud para los asegurados y o afiliados a POSITIVA que accedan a los servicios habilitados del CONTRATISTA en calidad de asegurados a los ramos Administración de Riesgos Laborales ARL por causa exclusiva de un accidente de trabajo una enfermedad profesional) Accidentes Personales AP Educativo Generación Positiva AP Colectivos APCorto Plazo AP Individual y demás Ramos de Seguros autorizados a Positiva encontrándose excluidos del presente contrato los servicios y todas aquellas actividades procedimientos e intervenciones que no tengan por objeto contribuir al diagnóstico tratamiento o rehabilitación de la patología derivada del siniestro o los servicios considerados como experimentales cosméticos y suntuarios."}]
["VICEPRESIDENCIA TÉCNICA","Gerencia Médica","NO","C66132022",85100000,"Prestación de servicios: El CONTRATISTA se obliga con POSITIVA a la prestación de los servicios de salud para los asegurados y o afiliados a POSITIVA que accedan a los servicios habilitados del CONTRATISTA en calidad de asegurados a los ramos Administración de Riesgos Laborales ARL por causa exclusiva de un accidente de trabajo una enfermedad profesional) Accidentes Personales AP Educativo Generación Positiva AP Colectivos APCorto Plazo AP Individual y demás Ramos de Seguros autorizados a Positiva encontrándose excluidos del presente contrato los servicios y todas aquellas actividades procedimientos e intervenciones que no tengan por objeto contribuir al diagnóstico tratamiento o rehabilitación de la patología derivada del siniestro o los servicios considerados como experimentales cosméticos y suntuarios.","2022-04-21",{"$f":"MONTH(G568)","v":4},"2024-04-21",{"$f":"(I568-G568)/30","v":24.366666666666667},"Invitación directa","CargoAReserva",0,0,"NO",null,"Gerencia de Abastecimiento Estratégico\ncontratacion@positiva.gov.co\nPBX: (1)6502200 Ext: 10641","SI","SI","NO","SI",{"$f":"IF(U568=\"SI\",\"Pública clasificada\",\"Pública\")","v":"Pública clasificada"},{"$f":"CONCATENATE(D568,\"-\",\"Tipo de información\",\" \",V568,\"-\",F568)","v":"C66132022-Tipo de información Pública clasificada-Prestación de servicios: El CONTRATISTA se obliga con POSITIVA a la prestación de los servicios de salud para los asegurados y o afiliados a POSITIVA que accedan a los servicios habilitados del CONTRATISTA en calidad de asegurados a los ramos Administración de Riesgos Laborales ARL por causa exclusiva de un accidente de trabajo una enfermedad profesional) Accidentes Personales AP Educativo Generación Positiva AP Colectivos APCorto Plazo AP Individual y demás Ramos de Seguros autorizados a Positiva encontrándose excluidos del presente contrato los servicios y todas aquellas actividades procedimientos e intervenciones que no tengan por objeto contribuir al diagnóstico tratamiento o rehabilitación de la patología derivada del siniestro o los servicios considerados como experimentales cosméticos y suntuarios."}]
["VICEPRESIDENCIA TÉCNICA","Gerencia Médica","NO","C66162022",85100000,"Prestación de servicios: El CONTRATISTA se obliga con POSITIVA a la prestación de los servicios de salud para los asegurados y o afiliados a POSITIVA que accedan a los servicios habilitados del CONTRATISTA en calidad de asegurados a los ramos Administración de Riesgos Laborales ARL por causa exclusiva de un accidente de trabajo una enfermedad profesional) Accidentes Personales AP Educativo Generación Positiva AP Colectivos APCorto Plazo AP Individual y demás Ramos de Seguros autorizados a Positiva encontrándose excluidos del presente contrato los servicios y todas aquellas actividades procedimientos e intervenciones que no tengan por objeto contribuir al diagnóstico tratamiento o rehabilitación de la patología derivada del siniestro o los servicios considerados como experimentales cosméticos y suntuarios.","2022-09-20",{"$f":"MONTH(G569)","v":9},"2024-09-20",{"$f":"(I569-G569)/30","v":24.366666666666667},"Invitación directa","CargoAReserva",0,0,"NO",null,"Gerencia de Abastecimiento Estratégico\ncontratacion@positiva.gov.co\nPBX: (1)6502200 Ext: 10641","SI","SI","NO","SI",{"$f":"IF(U569=\"SI\",\"Pública clasificada\",\"Pública\")","v":"Pública clasificada"},{"$f":"CONCATENATE(D569,\"-\",\"Tipo de información\",\" \",V569,\"-\",F569)","v":"C66162022-Tipo de información Pública clasificada-Prestación de servicios: El CONTRATISTA se obliga con POSITIVA a la prestación de los servicios de salud para los asegurados y o afiliados a POSITIVA que accedan a los servicios habilitados del CONTRATISTA en calidad de asegurados a los ramos Administración de Riesgos Laborales ARL por causa exclusiva de un accidente de trabajo una enfermedad profesional) Accidentes Personales AP Educativo Generación Positiva AP Colectivos APCorto Plazo AP Individual y demás Ramos de Seguros autorizados a Positiva encontrándose excluidos del presente contrato los servicios y todas aquellas actividades procedimientos e intervenciones que no tengan por objeto contribuir al diagnóstico tratamiento o rehabilitación de la patología derivada del siniestro o los servicios considerados como experimentales cosméticos y suntuarios."}]
["VICEPRESIDENCIA TÉCNICA","Gerencia Médica","NO","C66172022",85100000,"Prestación de servicios: El CONTRATISTA se obliga con POSITIVA a la prestación de los servicios de salud para los asegurados y o afiliados a POSITIVA que accedan a los servicios habilitados del CONTRATISTA en calidad de asegurados a los ramos Administración de Riesgos Laborales ARL por causa exclusiva de un accidente de trabajo una enfermedad profesional) Accidentes Personales AP Educativo Generación Positiva AP Colectivos APCorto Plazo AP Individual y demás Ramos de Seguros autorizados a Positiva encontrándose excluidos del presente contrato los servicios y todas aquellas actividades procedimientos e intervenciones que no tengan por objeto contribuir al diagnóstico tratamiento o rehabilitación de la patología derivada del siniestro o los servicios considerados como experimentales cosméticos y suntuarios.","2022-12-27",{"$f":"MONTH(G570)","v":12},"2024-12-27",{"$f":"(I570-G570)/30","v":24.366666666666667},"Invitación directa","CargoAReserva",0,0,"NO",null,"Gerencia de Abastecimiento Estratégico\ncontratacion@positiva.gov.co\nPBX: (1)6502200 Ext: 10641","SI","SI","NO","SI",{"$f":"IF(U570=\"SI\",\"Pública clasificada\",\"Pública\")","v":"Pública clasificada"},{"$f":"CONCATENATE(D570,\"-\",\"Tipo de información\",\" \",V570,\"-\",F570)","v":"C66172022-Tipo de información Pública clasificada-Prestación de servicios: El CONTRATISTA se obliga con POSITIVA a la prestación de los servicios de salud para los asegurados y o afiliados a POSITIVA que accedan a los servicios habilitados del CONTRATISTA en calidad de asegurados a los ramos Administración de Riesgos Laborales ARL por causa exclusiva de un accidente de trabajo una enfermedad profesional) Accidentes Personales AP Educativo Generación Positiva AP Colectivos APCorto Plazo AP Individual y demás Ramos de Seguros autorizados a Positiva encontrándose excluidos del presente contrato los servicios y todas aquellas actividades procedimientos e intervenciones que no tengan por objeto contribuir al diagnóstico tratamiento o rehabilitación de la patología derivada del siniestro o los servicios considerados como experimentales cosméticos y suntuarios."}]
["VICEPRESIDENCIA TÉCNICA","Gerencia Médica","NO","C66182022",85100000,"Prestación de servicios: El CONTRATISTA se obliga con POSITIVA a la prestación de los servicios de salud para los asegurados y o afiliados a POSITIVA que accedan a los servicios habilitados del CONTRATISTA en calidad de asegurados a los ramos Administración de Riesgos Laborales ARL por causa exclusiva de un accidente de trabajo una enfermedad profesional) Accidentes Personales AP Educativo Generación Positiva AP Colectivos APCorto Plazo AP Individual y demás Ramos de Seguros autorizados a Positiva encontrándose excluidos del presente contrato los servicios y todas aquellas actividades procedimientos e intervenciones que no tengan por objeto contribuir al diagnóstico tratamiento o rehabilitación de la patología derivada del siniestro o los servicios considerados como experimentales cosméticos y suntuarios.","2022-10-01",{"$f":"MONTH(G571)","v":10},"2024-10-30",{"$f":"(I571-G571)/30","v":25.333333333333332},"Invitación directa","CargoAReserva",0,0,"NO",null,"Gerencia de Abastecimiento Estratégico\ncontratacion@positiva.gov.co\nPBX: (1)6502200 Ext: 10641","SI","SI","NO","SI",{"$f":"IF(U571=\"SI\",\"Pública clasificada\",\"Pública\")","v":"Pública clasificada"},{"$f":"CONCATENATE(D571,\"-\",\"Tipo de información\",\" \",V571,\"-\",F571)","v":"C66182022-Tipo de información Pública clasificada-Prestación de servicios: El CONTRATISTA se obliga con POSITIVA a la prestación de los servicios de salud para los asegurados y o afiliados a POSITIVA que accedan a los servicios habilitados del CONTRATISTA en calidad de asegurados a los ramos Administración de Riesgos Laborales ARL por causa exclusiva de un accidente de trabajo una enfermedad profesional) Accidentes Personales AP Educativo Generación Positiva AP Colectivos APCorto Plazo AP Individual y demás Ramos de Seguros autorizados a Positiva encontrándose excluidos del presente contrato los servicios y todas aquellas actividades procedimientos e intervenciones que no tengan por objeto contribuir al diagnóstico tratamiento o rehabilitación de la patología derivada del siniestro o los servicios considerados como experimentales cosméticos y suntuarios."}]
["VICEPRESIDENCIA TÉCNICA","Gerencia Médica","NO","C66192022",85100000,"Prestación de servicios: El CONTRATISTA se obliga con POSITIVA a la prestación de los servicios de salud para los asegurados y o afiliados a POSITIVA que accedan a los servicios habilitados del CONTRATISTA en calidad de asegurados a los ramos Administración de Riesgos Laborales ARL por causa exclusiva de un accidente de trabajo una enfermedad profesional) Accidentes Personales AP Educativo Generación Positiva AP Colectivos APCorto Plazo AP Individual y demás Ramos de Seguros autorizados a Positiva encontrándose excluidos del presente contrato los servicios y todas aquellas actividades procedimientos e intervenciones que no tengan por objeto contribuir al diagnóstico tratamiento o rehabilitación de la patología derivada del siniestro o los servicios considerados como experimentales cosméticos y suntuarios.","2022-08-01",{"$f":"MONTH(G572)","v":8},"2024-08-01",{"$f":"(I572-G572)/30","v":24.366666666666667},"Invitación directa","CargoAReserva",0,0,"NO",null,"Gerencia de Abastecimiento Estratégico\ncontratacion@positiva.gov.co\nPBX: (1)6502200 Ext: 10641","SI","SI","NO","SI",{"$f":"IF(U572=\"SI\",\"Pública clasificada\",\"Pública\")","v":"Pública clasificada"},{"$f":"CONCATENATE(D572,\"-\",\"Tipo de información\",\" \",V572,\"-\",F572)","v":"C66192022-Tipo de información Pública clasificada-Prestación de servicios: El CONTRATISTA se obliga con POSITIVA a la prestación de los servicios de salud para los asegurados y o afiliados a POSITIVA que accedan a los servicios habilitados del CONTRATISTA en calidad de asegurados a los ramos Administración de Riesgos Laborales ARL por causa exclusiva de un accidente de trabajo una enfermedad profesional) Accidentes Personales AP Educativo Generación Positiva AP Colectivos APCorto Plazo AP Individual y demás Ramos de Seguros autorizados a Positiva encontrándose excluidos del presente contrato los servicios y todas aquellas actividades procedimientos e intervenciones que no tengan por objeto contribuir al diagnóstico tratamiento o rehabilitación de la patología derivada del siniestro o los servicios considerados como experimentales cosméticos y suntuarios."}]
["VICEPRESIDENCIA TÉCNICA","Gerencia Médica","NO","C66222022",85100000,"Prestación de servicios: El CONTRATISTA se obliga con POSITIVA a la prestación de los servicios de salud para los asegurados y o afiliados a POSITIVA que accedan a los servicios habilitados del CONTRATISTA en calidad de asegurados a los ramos Administración de Riesgos Laborales ARL por causa exclusiva de un accidente de trabajo una enfermedad profesional) Accidentes Personales AP Educativo Generación Positiva AP Colectivos APCorto Plazo AP Individual y demás Ramos de Seguros autorizados a Positiva encontrándose excluidos del presente contrato los servicios y todas aquellas actividades procedimientos e intervenciones que no tengan por objeto contribuir al diagnóstico tratamiento o rehabilitación de la patología derivada del siniestro o los servicios considerados como experimentales cosméticos y suntuarios.","2022-08-15",{"$f":"MONTH(G573)","v":8},"2024-08-15",{"$f":"(I573-G573)/30","v":24.366666666666667},"Invitación directa","CargoAReserva",0,0,"NO",null,"Gerencia de Abastecimiento Estratégico\ncontratacion@positiva.gov.co\nPBX: (1)6502200 Ext: 10641","SI","SI","NO","SI",{"$f":"IF(U573=\"SI\",\"Pública clasificada\",\"Pública\")","v":"Pública clasificada"},{"$f":"CONCATENATE(D573,\"-\",\"Tipo de información\",\" \",V573,\"-\",F573)","v":"C66222022-Tipo de información Pública clasificada-Prestación de servicios: El CONTRATISTA se obliga con POSITIVA a la prestación de los servicios de salud para los asegurados y o afiliados a POSITIVA que accedan a los servicios habilitados del CONTRATISTA en calidad de asegurados a los ramos Administración de Riesgos Laborales ARL por causa exclusiva de un accidente de trabajo una enfermedad profesional) Accidentes Personales AP Educativo Generación Positiva AP Colectivos APCorto Plazo AP Individual y demás Ramos de Seguros autorizados a Positiva encontrándose excluidos del presente contrato los servicios y todas aquellas actividades procedimientos e intervenciones que no tengan por objeto contribuir al diagnóstico tratamiento o rehabilitación de la patología derivada del siniestro o los servicios considerados como experimentales cosméticos y suntuarios."}]
["VICEPRESIDENCIA TÉCNICA","Gerencia Médica","NO","C66232022",85100000,"Prestación de servicios: El CONTRATISTA se obliga con POSITIVA a la prestación de los servicios de salud para los asegurados y o afiliados a POSITIVA que accedan a los servicios habilitados del CONTRATISTA en calidad de asegurados a los ramos Administración de Riesgos Laborales ARL por causa exclusiva de un accidente de trabajo una enfermedad profesional) Accidentes Personales AP Educativo Generación Positiva AP Colectivos APCorto Plazo AP Individual y demás Ramos de Seguros autorizados a Positiva encontrándose excluidos del presente contrato los servicios y todas aquellas actividades procedimientos e intervenciones que no tengan por objeto contribuir al diagnóstico tratamiento o rehabilitación de la patología derivada del siniestro o los servicios considerados como experimentales cosméticos y suntuarios.","2022-10-18",{"$f":"MONTH(G574)","v":10},"2024-10-18",{"$f":"(I574-G574)/30","v":24.366666666666667},"Invitación directa","CargoAReserva",0,0,"NO",null,"Gerencia de Abastecimiento Estratégico\ncontratacion@positiva.gov.co\nPBX: (1)6502200 Ext: 10641","SI","SI","NO","SI",{"$f":"IF(U574=\"SI\",\"Pública clasificada\",\"Pública\")","v":"Pública clasificada"},{"$f":"CONCATENATE(D574,\"-\",\"Tipo de información\",\" \",V574,\"-\",F574)","v":"C66232022-Tipo de información Pública clasificada-Prestación de servicios: El CONTRATISTA se obliga con POSITIVA a la prestación de los servicios de salud para los asegurados y o afiliados a POSITIVA que accedan a los servicios habilitados del CONTRATISTA en calidad de asegurados a los ramos Administración de Riesgos Laborales ARL por causa exclusiva de un accidente de trabajo una enfermedad profesional) Accidentes Personales AP Educativo Generación Positiva AP Colectivos APCorto Plazo AP Individual y demás Ramos de Seguros autorizados a Positiva encontrándose excluidos del presente contrato los servicios y todas aquellas actividades procedimientos e intervenciones que no tengan por objeto contribuir al diagnóstico tratamiento o rehabilitación de la patología derivada del siniestro o los servicios considerados como experimentales cosméticos y suntuarios."}]
["VICEPRESIDENCIA TÉCNICA","Gerencia Médica","NO","C66242022",85100000,"Prestación de servicios: El CONTRATISTA se obliga con POSITIVA a la prestación de los servicios de salud para los asegurados y o afiliados a POSITIVA que accedan a los servicios habilitados del CONTRATISTA en calidad de asegurados a los ramos Administración de Riesgos Laborales ARL por causa exclusiva de un accidente de trabajo una enfermedad profesional) Accidentes Personales AP Educativo Generación Positiva AP Colectivos APCorto Plazo AP Individual y demás Ramos de Seguros autorizados a Positiva encontrándose excluidos del presente contrato los servicios y todas aquellas actividades procedimientos e intervenciones que no tengan por objeto contribuir al diagnóstico tratamiento o rehabilitación de la patología derivada del siniestro o los servicios considerados como experimentales cosméticos y suntuarios.","2022-09-25",{"$f":"MONTH(G575)","v":9},"2024-09-25",{"$f":"(I575-G575)/30","v":24.366666666666667},"Invitación directa","CargoAReserva",0,0,"NO",null,"Gerencia de Abastecimiento Estratégico\ncontratacion@positiva.gov.co\nPBX: (1)6502200 Ext: 10641","SI","SI","NO","SI",{"$f":"IF(U575=\"SI\",\"Pública clasificada\",\"Pública\")","v":"Pública clasificada"},{"$f":"CONCATENATE(D575,\"-\",\"Tipo de información\",\" \",V575,\"-\",F575)","v":"C66242022-Tipo de información Pública clasificada-Prestación de servicios: El CONTRATISTA se obliga con POSITIVA a la prestación de los servicios de salud para los asegurados y o afiliados a POSITIVA que accedan a los servicios habilitados del CONTRATISTA en calidad de asegurados a los ramos Administración de Riesgos Laborales ARL por causa exclusiva de un accidente de trabajo una enfermedad profesional) Accidentes Personales AP Educativo Generación Positiva AP Colectivos APCorto Plazo AP Individual y demás Ramos de Seguros autorizados a Positiva encontrándose excluidos del presente contrato los servicios y todas aquellas actividades procedimientos e intervenciones que no tengan por objeto contribuir al diagnóstico tratamiento o rehabilitación de la patología derivada del siniestro o los servicios considerados como experimentales cosméticos y suntuarios."}]
["VICEPRESIDENCIA TÉCNICA","Gerencia Médica","NO","C66252022",85100000,"Prestación de servicios: El CONTRATISTA se obliga con POSITIVA a la prestación de los servicios de salud para los asegurados y o afiliados a POSITIVA que accedan a los servicios habilitados del CONTRATISTA en calidad de asegurados a los ramos Administración de Riesgos Laborales ARL por causa exclusiva de un accidente de trabajo una enfermedad profesional) Accidentes Personales AP Educativo Generación Positiva AP Colectivos APCorto Plazo AP Individual y demás Ramos de Seguros autorizados a Positiva encontrándose excluidos del presente contrato los servicios y todas aquellas actividades procedimientos e intervenciones que no tengan por objeto contribuir al diagnóstico tratamiento o rehabilitación de la patología derivada del siniestro o los servicios considerados como experimentales cosméticos y suntuarios.","2022-09-24",{"$f":"MONTH(G576)","v":9},"2027-09-24",{"$f":"(I576-G576)/30","v":60.866666666666667},"Invitación directa","CargoAReserva",0,0,"NO",null,"Gerencia de Abastecimiento Estratégico\ncontratacion@positiva.gov.co\nPBX: (1)6502200 Ext: 10641","SI","SI","NO","SI",{"$f":"IF(U576=\"SI\",\"Pública clasificada\",\"Pública\")","v":"Pública clasificada"},{"$f":"CONCATENATE(D576,\"-\",\"Tipo de información\",\" \",V576,\"-\",F576)","v":"C66252022-Tipo de información Pública clasificada-Prestación de servicios: El CONTRATISTA se obliga con POSITIVA a la prestación de los servicios de salud para los asegurados y o afiliados a POSITIVA que accedan a los servicios habilitados del CONTRATISTA en calidad de asegurados a los ramos Administración de Riesgos Laborales ARL por causa exclusiva de un accidente de trabajo una enfermedad profesional) Accidentes Personales AP Educativo Generación Positiva AP Colectivos APCorto Plazo AP Individual y demás Ramos de Seguros autorizados a Positiva encontrándose excluidos del presente contrato los servicios y todas aquellas actividades procedimientos e intervenciones que no tengan por objeto contribuir al diagnóstico tratamiento o rehabilitación de la patología derivada del siniestro o los servicios considerados como experimentales cosméticos y suntuarios."}]
["VICEPRESIDENCIA TÉCNICA","Gerencia Médica","NO","C66262022",85100000,"Prestación de servicios: El CONTRATISTA se obliga con POSITIVA a la prestación de los servicios de salud para los asegurados y o afiliados a POSITIVA que accedan a los servicios habilitados del CONTRATISTA en calidad de asegurados a los ramos Administración de Riesgos Laborales ARL por causa exclusiva de un accidente de trabajo una enfermedad profesional) Accidentes Personales AP Educativo Generación Positiva AP Colectivos APCorto Plazo AP Individual y demás Ramos de Seguros autorizados a Positiva encontrándose excluidos del presente contrato los servicios y todas aquellas actividades procedimientos e intervenciones que no tengan por objeto contribuir al diagnóstico tratamiento o rehabilitación de la patología derivada del siniestro o los servicios considerados como experimentales cosméticos y suntuarios.","2022-07-01",{"$f":"MONTH(G577)","v":7},"2027-04-01",{"$f":"(I577-G577)/30","v":57.833333333333336},"Invitación directa","CargoAReserva",0,0,"NO",null,"Gerencia de Abastecimiento Estratégico\ncontratacion@positiva.gov.co\nPBX: (1)6502200 Ext: 10641","SI","SI","NO","SI",{"$f":"IF(U577=\"SI\",\"Pública clasificada\",\"Pública\")","v":"Pública clasificada"},{"$f":"CONCATENATE(D577,\"-\",\"Tipo de información\",\" \",V577,\"-\",F577)","v":"C66262022-Tipo de información Pública clasificada-Prestación de servicios: El CONTRATISTA se obliga con POSITIVA a la prestación de los servicios de salud para los asegurados y o afiliados a POSITIVA que accedan a los servicios habilitados del CONTRATISTA en calidad de asegurados a los ramos Administración de Riesgos Laborales ARL por causa exclusiva de un accidente de trabajo una enfermedad profesional) Accidentes Personales AP Educativo Generación Positiva AP Colectivos APCorto Plazo AP Individual y demás Ramos de Seguros autorizados a Positiva encontrándose excluidos del presente contrato los servicios y todas aquellas actividades procedimientos e intervenciones que no tengan por objeto contribuir al diagnóstico tratamiento o rehabilitación de la patología derivada del siniestro o los servicios considerados como experimentales cosméticos y suntuarios."}]
["VICEPRESIDENCIA TÉCNICA","Gerencia Médica","NO","C66272022",85100000,"Prestación de servicios: El CONTRATISTA se obliga con POSITIVA a la prestación de los servicios de salud para los asegurados y o afiliados a POSITIVA que accedan a los servicios habilitados del CONTRATISTA en calidad de asegurados a los ramos Administración de Riesgos Laborales ARL por causa exclusiva de un accidente de trabajo una enfermedad profesional) Accidentes Personales AP Educativo Generación Positiva AP Colectivos APCorto Plazo AP Individual y demás Ramos de Seguros autorizados a Positiva encontrándose excluidos del presente contrato los servicios y todas aquellas actividades procedimientos e intervenciones que no tengan por objeto contribuir al diagnóstico tratamiento o rehabilitación de la patología derivada del siniestro o los servicios considerados como experimentales cosméticos y suntuarios.","2022-07-19",{"$f":"MONTH(G578)","v":7},"2024-07-19",{"$f":"(I578-G578)/30","v":24.366666666666667},"Invitación directa","CargoAReserva",0,0,"NO",null,"Gerencia de Abastecimiento Estratégico\ncontratacion@positiva.gov.co\nPBX: (1)6502200 Ext: 10641","SI","SI","NO","SI",{"$f":"IF(U578=\"SI\",\"Pública clasificada\",\"Pública\")","v":"Pública clasificada"},{"$f":"CONCATENATE(D578,\"-\",\"Tipo de información\",\" \",V578,\"-\",F578)","v":"C66272022-Tipo de información Pública clasificada-Prestación de servicios: El CONTRATISTA se obliga con POSITIVA a la prestación de los servicios de salud para los asegurados y o afiliados a POSITIVA que accedan a los servicios habilitados del CONTRATISTA en calidad de asegurados a los ramos Administración de Riesgos Laborales ARL por causa exclusiva de un accidente de trabajo una enfermedad profesional) Accidentes Personales AP Educativo Generación Positiva AP Colectivos APCorto Plazo AP Individual y demás Ramos de Seguros autorizados a Positiva encontrándose excluidos del presente contrato los servicios y todas aquellas actividades procedimientos e intervenciones que no tengan por objeto contribuir al diagnóstico tratamiento o rehabilitación de la patología derivada del siniestro o los servicios considerados como experimentales cosméticos y suntuarios."}]
["VICEPRESIDENCIA TÉCNICA","Gerencia Médica","NO","C66292022",85100000,"Prestación de servicios: El CONTRATISTA se obliga con POSITIVA a la prestación de los servicios de salud para los asegurados y o afiliados a POSITIVA que accedan a los servicios habilitados del CONTRATISTA en calidad de asegurados a los ramos Administración de Riesgos Laborales ARL por causa exclusiva de un accidente de trabajo una enfermedad profesional) Accidentes Personales AP Educativo Generación Positiva AP Colectivos APCorto Plazo AP Individual y demás Ramos de Seguros autorizados a Positiva encontrándose excluidos del presente contrato los servicios y todas aquellas actividades procedimientos e intervenciones que no tengan por objeto contribuir al diagnóstico tratamiento o rehabilitación de la patología derivada del siniestro o los servicios considerados como experimentales cosméticos y suntuarios.","2022-03-24",{"$f":"MONTH(G579)","v":3},"2024-03-24",{"$f":"(I579-G579)/30","v":24.366666666666667},"Invitación directa","CargoAReserva",0,0,"NO",null,"Gerencia de Abastecimiento Estratégico\ncontratacion@positiva.gov.co\nPBX: (1)6502200 Ext: 10641","SI","SI","NO","SI",{"$f":"IF(U579=\"SI\",\"Pública clasificada\",\"Pública\")","v":"Pública clasificada"},{"$f":"CONCATENATE(D579,\"-\",\"Tipo de información\",\" \",V579,\"-\",F579)","v":"C66292022-Tipo de información Pública clasificada-Prestación de servicios: El CONTRATISTA se obliga con POSITIVA a la prestación de los servicios de salud para los asegurados y o afiliados a POSITIVA que accedan a los servicios habilitados del CONTRATISTA en calidad de asegurados a los ramos Administración de Riesgos Laborales ARL por causa exclusiva de un accidente de trabajo una enfermedad profesional) Accidentes Personales AP Educativo Generación Positiva AP Colectivos APCorto Plazo AP Individual y demás Ramos de Seguros autorizados a Positiva encontrándose excluidos del presente contrato los servicios y todas aquellas actividades procedimientos e intervenciones que no tengan por objeto contribuir al diagnóstico tratamiento o rehabilitación de la patología derivada del siniestro o los servicios considerados como experimentales cosméticos y suntuarios."}]
["VICEPRESIDENCIA TÉCNICA","Gerencia Médica","NO","C66302022",85100000,"Prestación de servicios: El CONTRATISTA se obliga con POSITIVA a la prestación de los servicios de salud para los asegurados y o afiliados a POSITIVA que accedan a los servicios habilitados del CONTRATISTA en calidad de asegurados a los ramos Administración de Riesgos Laborales ARL por causa exclusiva de un accidente de trabajo una enfermedad profesional) Accidentes Personales AP Educativo Generación Positiva AP Colectivos APCorto Plazo AP Individual y demás Ramos de Seguros autorizados a Positiva encontrándose excluidos del presente contrato los servicios y todas aquellas actividades procedimientos e intervenciones que no tengan por objeto contribuir al diagnóstico tratamiento o rehabilitación de la patología derivada del siniestro o los servicios considerados como experimentales cosméticos y suntuarios.","2022-07-13",{"$f":"MONTH(G580)","v":7},"2024-07-13",{"$f":"(I580-G580)/30","v":24.366666666666667},"Invitación directa","CargoAReserva",0,0,"NO",null,"Gerencia de Abastecimiento Estratégico\ncontratacion@positiva.gov.co\nPBX: (1)6502200 Ext: 10641","SI","SI","NO","SI",{"$f":"IF(U580=\"SI\",\"Pública clasificada\",\"Pública\")","v":"Pública clasificada"},{"$f":"CONCATENATE(D580,\"-\",\"Tipo de información\",\" \",V580,\"-\",F580)","v":"C66302022-Tipo de información Pública clasificada-Prestación de servicios: El CONTRATISTA se obliga con POSITIVA a la prestación de los servicios de salud para los asegurados y o afiliados a POSITIVA que accedan a los servicios habilitados del CONTRATISTA en calidad de asegurados a los ramos Administración de Riesgos Laborales ARL por causa exclusiva de un accidente de trabajo una enfermedad profesional) Accidentes Personales AP Educativo Generación Positiva AP Colectivos APCorto Plazo AP Individual y demás Ramos de Seguros autorizados a Positiva encontrándose excluidos del presente contrato los servicios y todas aquellas actividades procedimientos e intervenciones que no tengan por objeto contribuir al diagnóstico tratamiento o rehabilitación de la patología derivada del siniestro o los servicios considerados como experimentales cosméticos y suntuarios."}]
["VICEPRESIDENCIA TÉCNICA","Gerencia Médica","NO","C66312022",85100000,"Prestación de servicios: El CONTRATISTA se obliga con POSITIVA a la prestación de los servicios de salud para los asegurados y o afiliados a POSITIVA que accedan a los servicios habilitados del CONTRATISTA en calidad de asegurados a los ramos Administración de Riesgos Laborales ARL por causa exclusiva de un accidente de trabajo una enfermedad profesional) Accidentes Personales AP Educativo Generación Positiva AP Colectivos APCorto Plazo AP Individual y demás Ramos de Seguros autorizados a Positiva encontrándose excluidos del presente contrato los servicios y todas aquellas actividades procedimientos e intervenciones que no tengan por objeto contribuir al diagnóstico tratamiento o rehabilitación de la patología derivada del siniestro o los servicios considerados como experimentales cosméticos y suntuarios.","2022-08-04",{"$f":"MONTH(G581)","v":8},"2024-08-04",{"$f":"(I581-G581)/30","v":24.366666666666667},"Invitación directa","CargoAReserva",0,0,"NO",null,"Gerencia de Abastecimiento Estratégico\ncontratacion@positiva.gov.co\nPBX: (1)6502200 Ext: 10641","SI","SI","NO","SI",{"$f":"IF(U581=\"SI\",\"Pública clasificada\",\"Pública\")","v":"Pública clasificada"},{"$f":"CONCATENATE(D581,\"-\",\"Tipo de información\",\" \",V581,\"-\",F581)","v":"C66312022-Tipo de información Pública clasificada-Prestación de servicios: El CONTRATISTA se obliga con POSITIVA a la prestación de los servicios de salud para los asegurados y o afiliados a POSITIVA que accedan a los servicios habilitados del CONTRATISTA en calidad de asegurados a los ramos Administración de Riesgos Laborales ARL por causa exclusiva de un accidente de trabajo una enfermedad profesional) Accidentes Personales AP Educativo Generación Positiva AP Colectivos APCorto Plazo AP Individual y demás Ramos de Seguros autorizados a Positiva encontrándose excluidos del presente contrato los servicios y todas aquellas actividades procedimientos e intervenciones que no tengan por objeto contribuir al diagnóstico tratamiento o rehabilitación de la patología derivada del siniestro o los servicios considerados como experimentales cosméticos y suntuarios."}]
["VICEPRESIDENCIA TÉCNICA","Gerencia Médica","NO","C66322022",85100000,"Prestación de servicios: El CONTRATISTA se obliga con POSITIVA a la prestación de los servicios de salud para los asegurados y o afiliados a POSITIVA que accedan a los servicios habilitados del CONTRATISTA en calidad de asegurados a los ramos Administración de Riesgos Laborales ARL por causa exclusiva de un accidente de trabajo una enfermedad profesional) Accidentes Personales AP Educativo Generación Positiva AP Colectivos APCorto Plazo AP Individual y demás Ramos de Seguros autorizados a Positiva encontrándose excluidos del presente contrato los servicios y todas aquellas actividades procedimientos e intervenciones que no tengan por objeto contribuir al diagnóstico tratamiento o rehabilitación de la patología derivada del siniestro o los servicios considerados como experimentales cosméticos y suntuarios.","2022-10-18",{"$f":"MONTH(G582)","v":10},"2024-10-18",{"$f":"(I582-G582)/30","v":24.366666666666667},"Invitación directa","CargoAReserva",0,0,"NO",null,"Gerencia de Abastecimiento Estratégico\ncontratacion@positiva.gov.co\nPBX: (1)6502200 Ext: 10641","SI","SI","NO","SI",{"$f":"IF(U582=\"SI\",\"Pública clasificada\",\"Pública\")","v":"Pública clasificada"},{"$f":"CONCATENATE(D582,\"-\",\"Tipo de información\",\" \",V582,\"-\",F582)","v":"C66322022-Tipo de información Pública clasificada-Prestación de servicios: El CONTRATISTA se obliga con POSITIVA a la prestación de los servicios de salud para los asegurados y o afiliados a POSITIVA que accedan a los servicios habilitados del CONTRATISTA en calidad de asegurados a los ramos Administración de Riesgos Laborales ARL por causa exclusiva de un accidente de trabajo una enfermedad profesional) Accidentes Personales AP Educativo Generación Positiva AP Colectivos APCorto Plazo AP Individual y demás Ramos de Seguros autorizados a Positiva encontrándose excluidos del presente contrato los servicios y todas aquellas actividades procedimientos e intervenciones que no tengan por objeto contribuir al diagnóstico tratamiento o rehabilitación de la patología derivada del siniestro o los servicios considerados como experimentales cosméticos y suntuarios."}]
["VICEPRESIDENCIA TÉCNICA","Gerencia Médica","NO","C66332022",85100000,"Prestación de servicios: El CONTRATISTA se obliga con POSITIVA a la prestación de los servicios de salud para los asegurados y o afiliados a POSITIVA que accedan a los servicios habilitados del CONTRATISTA en calidad de asegurados a los ramos Administración de Riesgos Laborales ARL por causa exclusiva de un accidente de trabajo una enfermedad profesional) Accidentes Personales AP Educativo Generación Positiva AP Colectivos APCorto Plazo AP Individual y demás Ramos de Seguros autorizados a Positiva encontrándose excluidos del presente contrato los servicios y todas aquellas actividades procedimientos e intervenciones que no tengan por objeto contribuir al diagnóstico tratamiento o rehabilitación de la patología derivada del siniestro o los servicios considerados como experimentales cosméticos y suntuarios.","2022-11-17",{"$f":"MONTH(G583)","v":11},"2024-11-17",{"$f":"(I583-G583)/30","v":24.366666666666667},"Invitación directa","CargoAReserva",0,0,"NO",null,"Gerencia de Abastecimiento Estratégico\ncontratacion@positiva.gov.co\nPBX: (1)6502200 Ext: 10641","SI","SI","NO","SI",{"$f":"IF(U583=\"SI\",\"Pública clasificada\",\"Pública\")","v":"Pública clasificada"},{"$f":"CONCATENATE(D583,\"-\",\"Tipo de información\",\" \",V583,\"-\",F583)","v":"C66332022-Tipo de información Pública clasificada-Prestación de servicios: El CONTRATISTA se obliga con POSITIVA a la prestación de los servicios de salud para los asegurados y o afiliados a POSITIVA que accedan a los servicios habilitados del CONTRATISTA en calidad de asegurados a los ramos Administración de Riesgos Laborales ARL por causa exclusiva de un accidente de trabajo una enfermedad profesional) Accidentes Personales AP Educativo Generación Positiva AP Colectivos APCorto Plazo AP Individual y demás Ramos de Seguros autorizados a Positiva encontrándose excluidos del presente contrato los servicios y todas aquellas actividades procedimientos e intervenciones que no tengan por objeto contribuir al diagnóstico tratamiento o rehabilitación de la patología derivada del siniestro o los servicios considerados como experimentales cosméticos y suntuarios."}]
["VICEPRESIDENCIA TÉCNICA","Gerencia Médica","NO","C66342022",85100000,"Prestación de servicios: El CONTRATISTA se obliga con POSITIVA a la prestación de los servicios de salud para los asegurados y o afiliados a POSITIVA que accedan a los servicios habilitados del CONTRATISTA en calidad de asegurados a los ramos Administración de Riesgos Laborales ARL por causa exclusiva de un accidente de trabajo una enfermedad profesional) Accidentes Personales AP Educativo Generación Positiva AP Colectivos APCorto Plazo AP Individual y demás Ramos de Seguros autorizados a Positiva encontrándose excluidos del presente contrato los servicios y todas aquellas actividades procedimientos e intervenciones que no tengan por objeto contribuir al diagnóstico tratamiento o rehabilitación de la patología derivada del siniestro o los servicios considerados como experimentales cosméticos y suntuarios.","2022-12-07",{"$f":"MONTH(G584)","v":12},"2024-12-07",{"$f":"(I584-G584)/30","v":24.366666666666667},"Invitación directa","CargoAReserva",0,0,"NO",null,"Gerencia de Abastecimiento Estratégico\ncontratacion@positiva.gov.co\nPBX: (1)6502200 Ext: 10641","SI","SI","NO","SI",{"$f":"IF(U584=\"SI\",\"Pública clasificada\",\"Pública\")","v":"Pública clasificada"},{"$f":"CONCATENATE(D584,\"-\",\"Tipo de información\",\" \",V584,\"-\",F584)","v":"C66342022-Tipo de información Pública clasificada-Prestación de servicios: El CONTRATISTA se obliga con POSITIVA a la prestación de los servicios de salud para los asegurados y o afiliados a POSITIVA que accedan a los servicios habilitados del CONTRATISTA en calidad de asegurados a los ramos Administración de Riesgos Laborales ARL por causa exclusiva de un accidente de trabajo una enfermedad profesional) Accidentes Personales AP Educativo Generación Positiva AP Colectivos APCorto Plazo AP Individual y demás Ramos de Seguros autorizados a Positiva encontrándose excluidos del presente contrato los servicios y todas aquellas actividades procedimientos e intervenciones que no tengan por objeto contribuir al diagnóstico tratamiento o rehabilitación de la patología derivada del siniestro o los servicios considerados como experimentales cosméticos y suntuarios."}]
["VICEPRESIDENCIA TÉCNICA","Gerencia Médica","NO","C66352022",85100000,"Prestación de servicios: El CONTRATISTA se obliga con POSITIVA a la prestación de los servicios de salud para los asegurados y o afiliados a POSITIVA que accedan a los servicios habilitados del CONTRATISTA en calidad de asegurados a los ramos Administración de Riesgos Laborales ARL por causa exclusiva de un accidente de trabajo una enfermedad profesional) Accidentes Personales AP Educativo Generación Positiva AP Colectivos APCorto Plazo AP Individual y demás Ramos de Seguros autorizados a Positiva encontrándose excluidos del presente contrato los servicios y todas aquellas actividades procedimientos e intervenciones que no tengan por objeto contribuir al diagnóstico tratamiento o rehabilitación de la patología derivada del siniestro o los servicios considerados como experimentales cosméticos y suntuarios.","2022-10-01",{"$f":"MONTH(G585)","v":10},"2024-10-30",{"$f":"(I585-G585)/30","v":25.333333333333332},"Invitación directa","CargoAReserva",0,0,"NO",null,"Gerencia de Abastecimiento Estratégico\ncontratacion@positiva.gov.co\nPBX: (1)6502200 Ext: 10641","SI","SI","NO","SI",{"$f":"IF(U585=\"SI\",\"Pública clasificada\",\"Pública\")","v":"Pública clasificada"},{"$f":"CONCATENATE(D585,\"-\",\"Tipo de información\",\" \",V585,\"-\",F585)","v":"C66352022-Tipo de información Pública clasificada-Prestación de servicios: El CONTRATISTA se obliga con POSITIVA a la prestación de los servicios de salud para los asegurados y o afiliados a POSITIVA que accedan a los servicios habilitados del CONTRATISTA en calidad de asegurados a los ramos Administración de Riesgos Laborales ARL por causa exclusiva de un accidente de trabajo una enfermedad profesional) Accidentes Personales AP Educativo Generación Positiva AP Colectivos APCorto Plazo AP Individual y demás Ramos de Seguros autorizados a Positiva encontrándose excluidos del presente contrato los servicios y todas aquellas actividades procedimientos e intervenciones que no tengan por objeto contribuir al diagnóstico tratamiento o rehabilitación de la patología derivada del siniestro o los servicios considerados como experimentales cosméticos y suntuarios."}]
["VICEPRESIDENCIA TÉCNICA","Gerencia Médica","NO","C66362022",85100000,"Prestación de servicios: El CONTRATISTA se obliga con POSITIVA a la prestación de los servicios de salud para los asegurados y o afiliados a POSITIVA que accedan a los servicios habilitados del CONTRATISTA en calidad de asegurados a los ramos Administración de Riesgos Laborales ARL por causa exclusiva de un accidente de trabajo una enfermedad profesional) Accidentes Personales AP Educativo Generación Positiva AP Colectivos APCorto Plazo AP Individual y demás Ramos de Seguros autorizados a Positiva encontrándose excluidos del presente contrato los servicios y todas aquellas actividades procedimientos e intervenciones que no tengan por objeto contribuir al diagnóstico tratamiento o rehabilitación de la patología derivada del siniestro o los servicios considerados como experimentales cosméticos y suntuarios.","2022-03-02",{"$f":"MONTH(G586)","v":3},"2024-03-02",{"$f":"(I586-G586)/30","v":24.366666666666667},"Invitación directa","CargoAReserva",0,0,"NO",null,"Gerencia de Abastecimiento Estratégico\ncontratacion@positiva.gov.co\nPBX: (1)6502200 Ext: 10641","SI","SI","NO","SI",{"$f":"IF(U586=\"SI\",\"Pública clasificada\",\"Pública\")","v":"Pública clasificada"},{"$f":"CONCATENATE(D586,\"-\",\"Tipo de información\",\" \",V586,\"-\",F586)","v":"C66362022-Tipo de información Pública clasificada-Prestación de servicios: El CONTRATISTA se obliga con POSITIVA a la prestación de los servicios de salud para los asegurados y o afiliados a POSITIVA que accedan a los servicios habilitados del CONTRATISTA en calidad de asegurados a los ramos Administración de Riesgos Laborales ARL por causa exclusiva de un accidente de trabajo una enfermedad profesional) Accidentes Personales AP Educativo Generación Positiva AP Colectivos APCorto Plazo AP Individual y demás Ramos de Seguros autorizados a Positiva encontrándose excluidos del presente contrato los servicios y todas aquellas actividades procedimientos e intervenciones que no tengan por objeto contribuir al diagnóstico tratamiento o rehabilitación de la patología derivada del siniestro o los servicios considerados como experimentales cosméticos y suntuarios."}]
["VICEPRESIDENCIA TÉCNICA","Gerencia Médica","NO","C66372022",85100000,"Prestación de servicios: El CONTRATISTA se obliga con POSITIVA a la prestación de los servicios de salud para los asegurados y o afiliados a POSITIVA que accedan a los servicios habilitados del CONTRATISTA en calidad de asegurados a los ramos Administración de Riesgos Laborales ARL por causa exclusiva de un accidente de trabajo una enfermedad profesional) Accidentes Personales AP Educativo Generación Positiva AP Colectivos APCorto Plazo AP Individual y demás Ramos de Seguros autorizados a Positiva encontrándose excluidos del presente contrato los servicios y todas aquellas actividades procedimientos e intervenciones que no tengan por objeto contribuir al diagnóstico tratamiento o rehabilitación de la patología derivada del siniestro o los servicios considerados como experimentales cosméticos y suntuarios.","2022-08-05",{"$f":"MONTH(G587)","v":8},"2024-08-05",{"$f":"(I587-G587)/30","v":24.366666666666667},"Invitación directa","CargoAReserva",0,0,"NO",null,"Gerencia de Abastecimiento Estratégico\ncontratacion@positiva.gov.co\nPBX: (1)6502200 Ext: 10641","SI","SI","NO","SI",{"$f":"IF(U587=\"SI\",\"Pública clasificada\",\"Pública\")","v":"Pública clasificada"},{"$f":"CONCATENATE(D587,\"-\",\"Tipo de información\",\" \",V587,\"-\",F587)","v":"C66372022-Tipo de información Pública clasificada-Prestación de servicios: El CONTRATISTA se obliga con POSITIVA a la prestación de los servicios de salud para los asegurados y o afiliados a POSITIVA que accedan a los servicios habilitados del CONTRATISTA en calidad de asegurados a los ramos Administración de Riesgos Laborales ARL por causa exclusiva de un accidente de trabajo una enfermedad profesional) Accidentes Personales AP Educativo Generación Positiva AP Colectivos APCorto Plazo AP Individual y demás Ramos de Seguros autorizados a Positiva encontrándose excluidos del presente contrato los servicios y todas aquellas actividades procedimientos e intervenciones que no tengan por objeto contribuir al diagnóstico tratamiento o rehabilitación de la patología derivada del siniestro o los servicios considerados como experimentales cosméticos y suntuarios."}]
["VICEPRESIDENCIA TÉCNICA","Gerencia Médica","NO","C66382022",85100000,"Prestación de servicios: El CONTRATISTA se obliga con POSITIVA a la prestación de los servicios de salud para los asegurados y o afiliados a POSITIVA que accedan a los servicios habilitados del CONTRATISTA en calidad de asegurados a los ramos Administración de Riesgos Laborales ARL por causa exclusiva de un accidente de trabajo una enfermedad profesional) Accidentes Personales AP Educativo Generación Positiva AP Colectivos APCorto Plazo AP Individual y demás Ramos de Seguros autorizados a Positiva encontrándose excluidos del presente contrato los servicios y todas aquellas actividades procedimientos e intervenciones que no tengan por objeto contribuir al diagnóstico tratamiento o rehabilitación de la patología derivada del siniestro o los servicios considerados como experimentales cosméticos y suntuarios.","2022-04-04",{"$f":"MONTH(G588)","v":4},"2024-04-04",{"$f":"(I588-G588)/30","v":24.366666666666667},"Invitación directa","CargoAReserva",0,0,"NO",null,"Gerencia de Abastecimiento Estratégico\ncontratacion@positiva.gov.co\nPBX: (1)6502200 Ext: 10641","SI","SI","NO","SI",{"$f":"IF(U588=\"SI\",\"Pública clasificada\",\"Pública\")","v":"Pública clasificada"},{"$f":"CONCATENATE(D588,\"-\",\"Tipo de información\",\" \",V588,\"-\",F588)","v":"C66382022-Tipo de información Pública clasificada-Prestación de servicios: El CONTRATISTA se obliga con POSITIVA a la prestación de los servicios de salud para los asegurados y o afiliados a POSITIVA que accedan a los servicios habilitados del CONTRATISTA en calidad de asegurados a los ramos Administración de Riesgos Laborales ARL por causa exclusiva de un accidente de trabajo una enfermedad profesional) Accidentes Personales AP Educativo Generación Positiva AP Colectivos APCorto Plazo AP Individual y demás Ramos de Seguros autorizados a Positiva encontrándose excluidos del presente contrato los servicios y todas aquellas actividades procedimientos e intervenciones que no tengan por objeto contribuir al diagnóstico tratamiento o rehabilitación de la patología derivada del siniestro o los servicios considerados como experimentales cosméticos y suntuarios."}]
["VICEPRESIDENCIA TÉCNICA","Gerencia Médica","NO","C66392022",85100000,"Prestación de servicios: El CONTRATISTA se obliga con POSITIVA a la prestación de los servicios de salud para los asegurados y o afiliados a POSITIVA que accedan a los servicios habilitados del CONTRATISTA en calidad de asegurados a los ramos Administración de Riesgos Laborales ARL por causa exclusiva de un accidente de trabajo una enfermedad profesional) Accidentes Personales AP Educativo Generación Positiva AP Colectivos APCorto Plazo AP Individual y demás Ramos de Seguros autorizados a Positiva encontrándose excluidos del presente contrato los servicios y todas aquellas actividades procedimientos e intervenciones que no tengan por objeto contribuir al diagnóstico tratamiento o rehabilitación de la patología derivada del siniestro o los servicios considerados como experimentales cosméticos y suntuarios.","2022-10-03",{"$f":"MONTH(G589)","v":10},"2027-10-02",{"$f":"(I589-G589)/30","v":60.833333333333336},"Invitación directa","CargoAReserva",0,0,"NO",null,"Gerencia de Abastecimiento Estratégico\ncontratacion@positiva.gov.co\nPBX: (1)6502200 Ext: 10641","SI","SI","NO","SI",{"$f":"IF(U589=\"SI\",\"Pública clasificada\",\"Pública\")","v":"Pública clasificada"},{"$f":"CONCATENATE(D589,\"-\",\"Tipo de información\",\" \",V589,\"-\",F589)","v":"C66392022-Tipo de información Pública clasificada-Prestación de servicios: El CONTRATISTA se obliga con POSITIVA a la prestación de los servicios de salud para los asegurados y o afiliados a POSITIVA que accedan a los servicios habilitados del CONTRATISTA en calidad de asegurados a los ramos Administración de Riesgos Laborales ARL por causa exclusiva de un accidente de trabajo una enfermedad profesional) Accidentes Personales AP Educativo Generación Positiva AP Colectivos APCorto Plazo AP Individual y demás Ramos de Seguros autorizados a Positiva encontrándose excluidos del presente contrato los servicios y todas aquellas actividades procedimientos e intervenciones que no tengan por objeto contribuir al diagnóstico tratamiento o rehabilitación de la patología derivada del siniestro o los servicios considerados como experimentales cosméticos y suntuarios."}]
["VICEPRESIDENCIA TÉCNICA","Gerencia Médica","NO","C66402022",85100000,"Prestación de servicios: El CONTRATISTA se obliga con POSITIVA a la prestación de los servicios de salud para los asegurados y o afiliados a POSITIVA que accedan a los servicios habilitados del CONTRATISTA en calidad de asegurados a los ramos Administración de Riesgos Laborales ARL por causa exclusiva de un accidente de trabajo una enfermedad profesional) Accidentes Personales AP Educativo Generación Positiva AP Colectivos APCorto Plazo AP Individual y demás Ramos de Seguros autorizados a Positiva encontrándose excluidos del presente contrato los servicios y todas aquellas actividades procedimientos e intervenciones que no tengan por objeto contribuir al diagnóstico tratamiento o rehabilitación de la patología derivada del siniestro o los servicios considerados como experimentales cosméticos y suntuarios.","2022-09-03",{"$f":"MONTH(G590)","v":9},"2027-06-03",{"$f":"(I590-G590)/30","v":57.8},"Invitación directa","CargoAReserva",0,0,"NO",null,"Gerencia de Abastecimiento Estratégico\ncontratacion@positiva.gov.co\nPBX: (1)6502200 Ext: 10641","SI","SI","NO","SI",{"$f":"IF(U590=\"SI\",\"Pública clasificada\",\"Pública\")","v":"Pública clasificada"},{"$f":"CONCATENATE(D590,\"-\",\"Tipo de información\",\" \",V590,\"-\",F590)","v":"C66402022-Tipo de información Pública clasificada-Prestación de servicios: El CONTRATISTA se obliga con POSITIVA a la prestación de los servicios de salud para los asegurados y o afiliados a POSITIVA que accedan a los servicios habilitados del CONTRATISTA en calidad de asegurados a los ramos Administración de Riesgos Laborales ARL por causa exclusiva de un accidente de trabajo una enfermedad profesional) Accidentes Personales AP Educativo Generación Positiva AP Colectivos APCorto Plazo AP Individual y demás Ramos de Seguros autorizados a Positiva encontrándose excluidos del presente contrato los servicios y todas aquellas actividades procedimientos e intervenciones que no tengan por objeto contribuir al diagnóstico tratamiento o rehabilitación de la patología derivada del siniestro o los servicios considerados como experimentales cosméticos y suntuarios."}]
["VICEPRESIDENCIA TÉCNICA","Gerencia Médica","NO","C66412022",85100000,"Prestación de servicios: El CONTRATISTA se obliga con POSITIVA a la prestación de los servicios de salud para los asegurados y o afiliados a POSITIVA que accedan a los servicios habilitados del CONTRATISTA en calidad de asegurados a los ramos Administración de Riesgos Laborales ARL por causa exclusiva de un accidente de trabajo una enfermedad profesional) Accidentes Personales AP Educativo Generación Positiva AP Colectivos APCorto Plazo AP Individual y demás Ramos de Seguros autorizados a Positiva encontrándose excluidos del presente contrato los servicios y todas aquellas actividades procedimientos e intervenciones que no tengan por objeto contribuir al diagnóstico tratamiento o rehabilitación de la patología derivada del siniestro o los servicios considerados como experimentales cosméticos y suntuarios.","2022-04-22",{"$f":"MONTH(G591)","v":4},"2027-04-22",{"$f":"(I591-G591)/30","v":60.866666666666667},"Invitación directa","CargoAReserva",0,0,"NO",null,"Gerencia de Abastecimiento Estratégico\ncontratacion@positiva.gov.co\nPBX: (1)6502200 Ext: 10641","SI","SI","NO","SI",{"$f":"IF(U591=\"SI\",\"Pública clasificada\",\"Pública\")","v":"Pública clasificada"},{"$f":"CONCATENATE(D591,\"-\",\"Tipo de información\",\" \",V591,\"-\",F591)","v":"C66412022-Tipo de información Pública clasificada-Prestación de servicios: El CONTRATISTA se obliga con POSITIVA a la prestación de los servicios de salud para los asegurados y o afiliados a POSITIVA que accedan a los servicios habilitados del CONTRATISTA en calidad de asegurados a los ramos Administración de Riesgos Laborales ARL por causa exclusiva de un accidente de trabajo una enfermedad profesional) Accidentes Personales AP Educativo Generación Positiva AP Colectivos APCorto Plazo AP Individual y demás Ramos de Seguros autorizados a Positiva encontrándose excluidos del presente contrato los servicios y todas aquellas actividades procedimientos e intervenciones que no tengan por objeto contribuir al diagnóstico tratamiento o rehabilitación de la patología derivada del siniestro o los servicios considerados como experimentales cosméticos y suntuarios."}]
["VICEPRESIDENCIA TÉCNICA","Gerencia Médica","NO","C66442022",85100000,"Prestación de servicios: El CONTRATISTA se obliga con POSITIVA a la prestación de los servicios de salud para los asegurados y o afiliados a POSITIVA que accedan a los servicios habilitados del CONTRATISTA en calidad de asegurados a los ramos Administración de Riesgos Laborales ARL por causa exclusiva de un accidente de trabajo una enfermedad profesional) Accidentes Personales AP Educativo Generación Positiva AP Colectivos APCorto Plazo AP Individual y demás Ramos de Seguros autorizados a Positiva encontrándose excluidos del presente contrato los servicios y todas aquellas actividades procedimientos e intervenciones que no tengan por objeto contribuir al diagnóstico tratamiento o rehabilitación de la patología derivada del siniestro o los servicios considerados como experimentales cosméticos y suntuarios.","2022-08-24",{"$f":"MONTH(G592)","v":8},"2024-08-24",{"$f":"(I592-G592)/30","v":24.366666666666667},"Invitación directa","CargoAReserva",0,0,"NO",null,"Gerencia de Abastecimiento Estratégico\ncontratacion@positiva.gov.co\nPBX: (1)6502200 Ext: 10641","SI","SI","NO","SI",{"$f":"IF(U592=\"SI\",\"Pública clasificada\",\"Pública\")","v":"Pública clasificada"},{"$f":"CONCATENATE(D592,\"-\",\"Tipo de información\",\" \",V592,\"-\",F592)","v":"C66442022-Tipo de información Pública clasificada-Prestación de servicios: El CONTRATISTA se obliga con POSITIVA a la prestación de los servicios de salud para los asegurados y o afiliados a POSITIVA que accedan a los servicios habilitados del CONTRATISTA en calidad de asegurados a los ramos Administración de Riesgos Laborales ARL por causa exclusiva de un accidente de trabajo una enfermedad profesional) Accidentes Personales AP Educativo Generación Positiva AP Colectivos APCorto Plazo AP Individual y demás Ramos de Seguros autorizados a Positiva encontrándose excluidos del presente contrato los servicios y todas aquellas actividades procedimientos e intervenciones que no tengan por objeto contribuir al diagnóstico tratamiento o rehabilitación de la patología derivada del siniestro o los servicios considerados como experimentales cosméticos y suntuarios."}]
["VICEPRESIDENCIA TÉCNICA","Gerencia Médica","NO","C66452022",85100000,"Prestación de servicios: El CONTRATISTA se obliga con POSITIVA a la prestación de los servicios de salud para los asegurados y o afiliados a POSITIVA que accedan a los servicios habilitados del CONTRATISTA en calidad de asegurados a los ramos Administración de Riesgos Laborales ARL por causa exclusiva de un accidente de trabajo una enfermedad profesional) Accidentes Personales AP Educativo Generación Positiva AP Colectivos APCorto Plazo AP Individual y demás Ramos de Seguros autorizados a Positiva encontrándose excluidos del presente contrato los servicios y todas aquellas actividades procedimientos e intervenciones que no tengan por objeto contribuir al diagnóstico tratamiento o rehabilitación de la patología derivada del siniestro o los servicios considerados como experimentales cosméticos y suntuarios.","2022-10-01",{"$f":"MONTH(G593)","v":10},"2024-10-30",{"$f":"(I593-G593)/30","v":25.333333333333332},"Invitación directa","CargoAReserva",0,0,"NO",null,"Gerencia de Abastecimiento Estratégico\ncontratacion@positiva.gov.co\nPBX: (1)6502200 Ext: 10641","SI","SI","NO","SI",{"$f":"IF(U593=\"SI\",\"Pública clasificada\",\"Pública\")","v":"Pública clasificada"},{"$f":"CONCATENATE(D593,\"-\",\"Tipo de información\",\" \",V593,\"-\",F593)","v":"C66452022-Tipo de información Pública clasificada-Prestación de servicios: El CONTRATISTA se obliga con POSITIVA a la prestación de los servicios de salud para los asegurados y o afiliados a POSITIVA que accedan a los servicios habilitados del CONTRATISTA en calidad de asegurados a los ramos Administración de Riesgos Laborales ARL por causa exclusiva de un accidente de trabajo una enfermedad profesional) Accidentes Personales AP Educativo Generación Positiva AP Colectivos APCorto Plazo AP Individual y demás Ramos de Seguros autorizados a Positiva encontrándose excluidos del presente contrato los servicios y todas aquellas actividades procedimientos e intervenciones que no tengan por objeto contribuir al diagnóstico tratamiento o rehabilitación de la patología derivada del siniestro o los servicios considerados como experimentales cosméticos y suntuarios."}]
["VICEPRESIDENCIA TÉCNICA","Gerencia Médica","NO","C66462022",85100000,"Prestación de servicios: El CONTRATISTA se obliga con POSITIVA a la prestación de los servicios de salud para los asegurados y o afiliados a POSITIVA que accedan a los servicios habilitados del CONTRATISTA en calidad de asegurados a los ramos Administración de Riesgos Laborales ARL por causa exclusiva de un accidente de trabajo una enfermedad profesional) Accidentes Personales AP Educativo Generación Positiva AP Colectivos APCorto Plazo AP Individual y demás Ramos de Seguros autorizados a Positiva encontrándose excluidos del presente contrato los servicios y todas aquellas actividades procedimientos e intervenciones que no tengan por objeto contribuir al diagnóstico tratamiento o rehabilitación de la patología derivada del siniestro o los servicios considerados como experimentales cosméticos y suntuarios.","2022-05-16",{"$f":"MONTH(G594)","v":5},"2024-05-16",{"$f":"(I594-G594)/30","v":24.366666666666667},"Invitación directa","CargoAReserva",0,0,"NO",null,"Gerencia de Abastecimiento Estratégico\ncontratacion@positiva.gov.co\nPBX: (1)6502200 Ext: 10641","SI","SI","NO","SI",{"$f":"IF(U594=\"SI\",\"Pública clasificada\",\"Pública\")","v":"Pública clasificada"},{"$f":"CONCATENATE(D594,\"-\",\"Tipo de información\",\" \",V594,\"-\",F594)","v":"C66462022-Tipo de información Pública clasificada-Prestación de servicios: El CONTRATISTA se obliga con POSITIVA a la prestación de los servicios de salud para los asegurados y o afiliados a POSITIVA que accedan a los servicios habilitados del CONTRATISTA en calidad de asegurados a los ramos Administración de Riesgos Laborales ARL por causa exclusiva de un accidente de trabajo una enfermedad profesional) Accidentes Personales AP Educativo Generación Positiva AP Colectivos APCorto Plazo AP Individual y demás Ramos de Seguros autorizados a Positiva encontrándose excluidos del presente contrato los servicios y todas aquellas actividades procedimientos e intervenciones que no tengan por objeto contribuir al diagnóstico tratamiento o rehabilitación de la patología derivada del siniestro o los servicios considerados como experimentales cosméticos y suntuarios."}]
["VICEPRESIDENCIA TÉCNICA","Gerencia Médica","NO","C66472022",85100000,"Prestación de servicios: El CONTRATISTA se obliga con POSITIVA a la prestación de los servicios de salud para los asegurados y o afiliados a POSITIVA que accedan a los servicios habilitados del CONTRATISTA en calidad de asegurados a los ramos Administración de Riesgos Laborales ARL por causa exclusiva de un accidente de trabajo una enfermedad profesional) Accidentes Personales AP Educativo Generación Positiva AP Colectivos APCorto Plazo AP Individual y demás Ramos de Seguros autorizados a Positiva encontrándose excluidos del presente contrato los servicios y todas aquellas actividades procedimientos e intervenciones que no tengan por objeto contribuir al diagnóstico tratamiento o rehabilitación de la patología derivada del siniestro o los servicios considerados como experimentales cosméticos y suntuarios.","2022-02-01",{"$f":"MONTH(G595)","v":2},"2024-02-01",{"$f":"(I595-G595)/30","v":24.333333333333332},"Invitación directa","CargoAReserva",0,0,"NO",null,"Gerencia de Abastecimiento Estratégico\ncontratacion@positiva.gov.co\nPBX: (1)6502200 Ext: 10641","SI","SI","NO","SI",{"$f":"IF(U595=\"SI\",\"Pública clasificada\",\"Pública\")","v":"Pública clasificada"},{"$f":"CONCATENATE(D595,\"-\",\"Tipo de información\",\" \",V595,\"-\",F595)","v":"C66472022-Tipo de información Pública clasificada-Prestación de servicios: El CONTRATISTA se obliga con POSITIVA a la prestación de los servicios de salud para los asegurados y o afiliados a POSITIVA que accedan a los servicios habilitados del CONTRATISTA en calidad de asegurados a los ramos Administración de Riesgos Laborales ARL por causa exclusiva de un accidente de trabajo una enfermedad profesional) Accidentes Personales AP Educativo Generación Positiva AP Colectivos APCorto Plazo AP Individual y demás Ramos de Seguros autorizados a Positiva encontrándose excluidos del presente contrato los servicios y todas aquellas actividades procedimientos e intervenciones que no tengan por objeto contribuir al diagnóstico tratamiento o rehabilitación de la patología derivada del siniestro o los servicios considerados como experimentales cosméticos y suntuarios."}]
["VICEPRESIDENCIA TÉCNICA","Gerencia Médica","NO","C66482022",85100000,"Prestación de servicios: El CONTRATISTA se obliga con POSITIVA a la prestación de los servicios de salud para los asegurados y o afiliados a POSITIVA que accedan a los servicios habilitados del CONTRATISTA en calidad de asegurados a los ramos Administración de Riesgos Laborales ARL por causa exclusiva de un accidente de trabajo una enfermedad profesional) Accidentes Personales AP Educativo Generación Positiva AP Colectivos APCorto Plazo AP Individual y demás Ramos de Seguros autorizados a Positiva encontrándose excluidos del presente contrato los servicios y todas aquellas actividades procedimientos e intervenciones que no tengan por objeto contribuir al diagnóstico tratamiento o rehabilitación de la patología derivada del siniestro o los servicios considerados como experimentales cosméticos y suntuarios.","2022-02-01",{"$f":"MONTH(G596)","v":2},"2024-02-02",{"$f":"(I596-G596)/30","v":24.366666666666667},"Invitación directa","CargoAReserva",0,0,"NO",null,"Gerencia de Abastecimiento Estratégico\ncontratacion@positiva.gov.co\nPBX: (1)6502200 Ext: 10641","SI","SI","NO","SI",{"$f":"IF(U596=\"SI\",\"Pública clasificada\",\"Pública\")","v":"Pública clasificada"},{"$f":"CONCATENATE(D596,\"-\",\"Tipo de información\",\" \",V596,\"-\",F596)","v":"C66482022-Tipo de información Pública clasificada-Prestación de servicios: El CONTRATISTA se obliga con POSITIVA a la prestación de los servicios de salud para los asegurados y o afiliados a POSITIVA que accedan a los servicios habilitados del CONTRATISTA en calidad de asegurados a los ramos Administración de Riesgos Laborales ARL por causa exclusiva de un accidente de trabajo una enfermedad profesional) Accidentes Personales AP Educativo Generación Positiva AP Colectivos APCorto Plazo AP Individual y demás Ramos de Seguros autorizados a Positiva encontrándose excluidos del presente contrato los servicios y todas aquellas actividades procedimientos e intervenciones que no tengan por objeto contribuir al diagnóstico tratamiento o rehabilitación de la patología derivada del siniestro o los servicios considerados como experimentales cosméticos y suntuarios."}]
["VICEPRESIDENCIA TÉCNICA","Gerencia Médica","NO","C66492022",85100000,"Prestación de servicios: El CONTRATISTA se obliga con POSITIVA a la prestación de los servicios de salud para los asegurados y o afiliados a POSITIVA que accedan a los servicios habilitados del CONTRATISTA en calidad de asegurados a los ramos Administración de Riesgos Laborales ARL por causa exclusiva de un accidente de trabajo una enfermedad profesional) Accidentes Personales AP Educativo Generación Positiva AP Colectivos APCorto Plazo AP Individual y demás Ramos de Seguros autorizados a Positiva encontrándose excluidos del presente contrato los servicios y todas aquellas actividades procedimientos e intervenciones que no tengan por objeto contribuir al diagnóstico tratamiento o rehabilitación de la patología derivada del siniestro o los servicios considerados como experimentales cosméticos y suntuarios.","2022-02-01",{"$f":"MONTH(G597)","v":2},"2024-02-01",{"$f":"(I597-G597)/30","v":24.333333333333332},"Invitación directa","CargoAReserva",0,0,"NO",null,"Gerencia de Abastecimiento Estratégico\ncontratacion@positiva.gov.co\nPBX: (1)6502200 Ext: 10641","SI","SI","NO","SI",{"$f":"IF(U597=\"SI\",\"Pública clasificada\",\"Pública\")","v":"Pública clasificada"},{"$f":"CONCATENATE(D597,\"-\",\"Tipo de información\",\" \",V597,\"-\",F597)","v":"C66492022-Tipo de información Pública clasificada-Prestación de servicios: El CONTRATISTA se obliga con POSITIVA a la prestación de los servicios de salud para los asegurados y o afiliados a POSITIVA que accedan a los servicios habilitados del CONTRATISTA en calidad de asegurados a los ramos Administración de Riesgos Laborales ARL por causa exclusiva de un accidente de trabajo una enfermedad profesional) Accidentes Personales AP Educativo Generación Positiva AP Colectivos APCorto Plazo AP Individual y demás Ramos de Seguros autorizados a Positiva encontrándose excluidos del presente contrato los servicios y todas aquellas actividades procedimientos e intervenciones que no tengan por objeto contribuir al diagnóstico tratamiento o rehabilitación de la patología derivada del siniestro o los servicios considerados como experimentales cosméticos y suntuarios."}]
["VICEPRESIDENCIA TÉCNICA","Gerencia Médica","NO","C66502022",85100000,"Prestación de servicios: El CONTRATISTA se obliga con POSITIVA a la prestación de los servicios de salud para los asegurados y o afiliados a POSITIVA que accedan a los servicios habilitados del CONTRATISTA en calidad de asegurados a los ramos Administración de Riesgos Laborales ARL por causa exclusiva de un accidente de trabajo una enfermedad profesional) Accidentes Personales AP Educativo Generación Positiva AP Colectivos APCorto Plazo AP Individual y demás Ramos de Seguros autorizados a Positiva encontrándose excluidos del presente contrato los servicios y todas aquellas actividades procedimientos e intervenciones que no tengan por objeto contribuir al diagnóstico tratamiento o rehabilitación de la patología derivada del siniestro o los servicios considerados como experimentales cosméticos y suntuarios.","2022-10-01",{"$f":"MONTH(G598)","v":10},"2024-10-30",{"$f":"(I598-G598)/30","v":25.333333333333332},"Invitación directa","CargoAReserva",0,0,"NO",null,"Gerencia de Abastecimiento Estratégico\ncontratacion@positiva.gov.co\nPBX: (1)6502200 Ext: 10641","SI","SI","NO","SI",{"$f":"IF(U598=\"SI\",\"Pública clasificada\",\"Pública\")","v":"Pública clasificada"},{"$f":"CONCATENATE(D598,\"-\",\"Tipo de información\",\" \",V598,\"-\",F598)","v":"C66502022-Tipo de información Pública clasificada-Prestación de servicios: El CONTRATISTA se obliga con POSITIVA a la prestación de los servicios de salud para los asegurados y o afiliados a POSITIVA que accedan a los servicios habilitados del CONTRATISTA en calidad de asegurados a los ramos Administración de Riesgos Laborales ARL por causa exclusiva de un accidente de trabajo una enfermedad profesional) Accidentes Personales AP Educativo Generación Positiva AP Colectivos APCorto Plazo AP Individual y demás Ramos de Seguros autorizados a Positiva encontrándose excluidos del presente contrato los servicios y todas aquellas actividades procedimientos e intervenciones que no tengan por objeto contribuir al diagnóstico tratamiento o rehabilitación de la patología derivada del siniestro o los servicios considerados como experimentales cosméticos y suntuarios."}]
["VICEPRESIDENCIA TÉCNICA","Gerencia Médica","NO","C66512022",85100000,"Prestación de servicios: El CONTRATISTA se obliga con POSITIVA a la prestación de los servicios de salud para los asegurados y o afiliados a POSITIVA que accedan a los servicios habilitados del CONTRATISTA en calidad de asegurados a los ramos Administración de Riesgos Laborales ARL por causa exclusiva de un accidente de trabajo una enfermedad profesional) Accidentes Personales AP Educativo Generación Positiva AP Colectivos APCorto Plazo AP Individual y demás Ramos de Seguros autorizados a Positiva encontrándose excluidos del presente contrato los servicios y todas aquellas actividades procedimientos e intervenciones que no tengan por objeto contribuir al diagnóstico tratamiento o rehabilitación de la patología derivada del siniestro o los servicios considerados como experimentales cosméticos y suntuarios.","2022-10-01",{"$f":"MONTH(G599)","v":10},"2024-10-30",{"$f":"(I599-G599)/30","v":25.333333333333332},"Invitación directa","CargoAReserva",0,0,"NO",null,"Gerencia de Abastecimiento Estratégico\ncontratacion@positiva.gov.co\nPBX: (1)6502200 Ext: 10641","SI","SI","NO","SI",{"$f":"IF(U599=\"SI\",\"Pública clasificada\",\"Pública\")","v":"Pública clasificada"},{"$f":"CONCATENATE(D599,\"-\",\"Tipo de información\",\" \",V599,\"-\",F599)","v":"C66512022-Tipo de información Pública clasificada-Prestación de servicios: El CONTRATISTA se obliga con POSITIVA a la prestación de los servicios de salud para los asegurados y o afiliados a POSITIVA que accedan a los servicios habilitados del CONTRATISTA en calidad de asegurados a los ramos Administración de Riesgos Laborales ARL por causa exclusiva de un accidente de trabajo una enfermedad profesional) Accidentes Personales AP Educativo Generación Positiva AP Colectivos APCorto Plazo AP Individual y demás Ramos de Seguros autorizados a Positiva encontrándose excluidos del presente contrato los servicios y todas aquellas actividades procedimientos e intervenciones que no tengan por objeto contribuir al diagnóstico tratamiento o rehabilitación de la patología derivada del siniestro o los servicios considerados como experimentales cosméticos y suntuarios."}]
["VICEPRESIDENCIA TÉCNICA","Gerencia Médica","NO","C66522022",85100000,"Prestación de servicios: El CONTRATISTA se obliga con POSITIVA a la prestación de los servicios de salud para los asegurados y o afiliados a POSITIVA que accedan a los servicios habilitados del CONTRATISTA en calidad de asegurados a los ramos Administración de Riesgos Laborales ARL por causa exclusiva de un accidente de trabajo una enfermedad profesional) Accidentes Personales AP Educativo Generación Positiva AP Colectivos APCorto Plazo AP Individual y demás Ramos de Seguros autorizados a Positiva encontrándose excluidos del presente contrato los servicios y todas aquellas actividades procedimientos e intervenciones que no tengan por objeto contribuir al diagnóstico tratamiento o rehabilitación de la patología derivada del siniestro o los servicios considerados como experimentales cosméticos y suntuarios.","2022-09-19",{"$f":"MONTH(G600)","v":9},"2024-09-19",{"$f":"(I600-G600)/30","v":24.366666666666667},"Invitación directa","CargoAReserva",0,0,"NO",null,"Gerencia de Abastecimiento Estratégico\ncontratacion@positiva.gov.co\nPBX: (1)6502200 Ext: 10641","SI","SI","NO","SI",{"$f":"IF(U600=\"SI\",\"Pública clasificada\",\"Pública\")","v":"Pública clasificada"},{"$f":"CONCATENATE(D600,\"-\",\"Tipo de información\",\" \",V600,\"-\",F600)","v":"C66522022-Tipo de información Pública clasificada-Prestación de servicios: El CONTRATISTA se obliga con POSITIVA a la prestación de los servicios de salud para los asegurados y o afiliados a POSITIVA que accedan a los servicios habilitados del CONTRATISTA en calidad de asegurados a los ramos Administración de Riesgos Laborales ARL por causa exclusiva de un accidente de trabajo una enfermedad profesional) Accidentes Personales AP Educativo Generación Positiva AP Colectivos APCorto Plazo AP Individual y demás Ramos de Seguros autorizados a Positiva encontrándose excluidos del presente contrato los servicios y todas aquellas actividades procedimientos e intervenciones que no tengan por objeto contribuir al diagnóstico tratamiento o rehabilitación de la patología derivada del siniestro o los servicios considerados como experimentales cosméticos y suntuarios."}]
["VICEPRESIDENCIA TÉCNICA","Gerencia Médica","NO","C66532022",85100000,"Prestación de servicios: El CONTRATISTA se obliga con POSITIVA a la prestación de los servicios de salud para los asegurados y o afiliados a POSITIVA que accedan a los servicios habilitados del CONTRATISTA en calidad de asegurados a los ramos Administración de Riesgos Laborales ARL por causa exclusiva de un accidente de trabajo una enfermedad profesional) Accidentes Personales AP Educativo Generación Positiva AP Colectivos APCorto Plazo AP Individual y demás Ramos de Seguros autorizados a Positiva encontrándose excluidos del presente contrato los servicios y todas aquellas actividades procedimientos e intervenciones que no tengan por objeto contribuir al diagnóstico tratamiento o rehabilitación de la patología derivada del siniestro o los servicios considerados como experimentales cosméticos y suntuarios.","2022-09-01",{"$f":"MONTH(G601)","v":9},"2024-09-01",{"$f":"(I601-G601)/30","v":24.366666666666667},"Invitación directa","CargoAReserva",0,0,"NO",null,"Gerencia de Abastecimiento Estratégico\ncontratacion@positiva.gov.co\nPBX: (1)6502200 Ext: 10641","SI","SI","NO","SI",{"$f":"IF(U601=\"SI\",\"Pública clasificada\",\"Pública\")","v":"Pública clasificada"},{"$f":"CONCATENATE(D601,\"-\",\"Tipo de información\",\" \",V601,\"-\",F601)","v":"C66532022-Tipo de información Pública clasificada-Prestación de servicios: El CONTRATISTA se obliga con POSITIVA a la prestación de los servicios de salud para los asegurados y o afiliados a POSITIVA que accedan a los servicios habilitados del CONTRATISTA en calidad de asegurados a los ramos Administración de Riesgos Laborales ARL por causa exclusiva de un accidente de trabajo una enfermedad profesional) Accidentes Personales AP Educativo Generación Positiva AP Colectivos APCorto Plazo AP Individual y demás Ramos de Seguros autorizados a Positiva encontrándose excluidos del presente contrato los servicios y todas aquellas actividades procedimientos e intervenciones que no tengan por objeto contribuir al diagnóstico tratamiento o rehabilitación de la patología derivada del siniestro o los servicios considerados como experimentales cosméticos y suntuarios."}]
["VICEPRESIDENCIA TÉCNICA","Gerencia Médica","NO","C66542022",85100000,"Prestación de servicios: El CONTRATISTA se obliga con POSITIVA a la prestación de los servicios de salud para los asegurados y o afiliados a POSITIVA que accedan a los servicios habilitados del CONTRATISTA en calidad de asegurados a los ramos Administración de Riesgos Laborales ARL por causa exclusiva de un accidente de trabajo una enfermedad profesional) Accidentes Personales AP Educativo Generación Positiva AP Colectivos APCorto Plazo AP Individual y demás Ramos de Seguros autorizados a Positiva encontrándose excluidos del presente contrato los servicios y todas aquellas actividades procedimientos e intervenciones que no tengan por objeto contribuir al diagnóstico tratamiento o rehabilitación de la patología derivada del siniestro o los servicios considerados como experimentales cosméticos y suntuarios.","2022-10-01",{"$f":"MONTH(G602)","v":10},"2024-10-01",{"$f":"(I602-G602)/30","v":24.366666666666667},"Invitación directa","CargoAReserva",0,0,"NO",null,"Gerencia de Abastecimiento Estratégico\ncontratacion@positiva.gov.co\nPBX: (1)6502200 Ext: 10641","SI","SI","NO","SI",{"$f":"IF(U602=\"SI\",\"Pública clasificada\",\"Pública\")","v":"Pública clasificada"},{"$f":"CONCATENATE(D602,\"-\",\"Tipo de información\",\" \",V602,\"-\",F602)","v":"C66542022-Tipo de información Pública clasificada-Prestación de servicios: El CONTRATISTA se obliga con POSITIVA a la prestación de los servicios de salud para los asegurados y o afiliados a POSITIVA que accedan a los servicios habilitados del CONTRATISTA en calidad de asegurados a los ramos Administración de Riesgos Laborales ARL por causa exclusiva de un accidente de trabajo una enfermedad profesional) Accidentes Personales AP Educativo Generación Positiva AP Colectivos APCorto Plazo AP Individual y demás Ramos de Seguros autorizados a Positiva encontrándose excluidos del presente contrato los servicios y todas aquellas actividades procedimientos e intervenciones que no tengan por objeto contribuir al diagnóstico tratamiento o rehabilitación de la patología derivada del siniestro o los servicios considerados como experimentales cosméticos y suntuarios."}]
["VICEPRESIDENCIA TÉCNICA","Gerencia Médica","NO","C66552022",85100000,"Prestación de servicios: El CONTRATISTA se obliga con POSITIVA a la prestación de los servicios de salud para los asegurados y o afiliados a POSITIVA que accedan a los servicios habilitados del CONTRATISTA en calidad de asegurados a los ramos Administración de Riesgos Laborales ARL por causa exclusiva de un accidente de trabajo una enfermedad profesional) Accidentes Personales AP Educativo Generación Positiva AP Colectivos APCorto Plazo AP Individual y demás Ramos de Seguros autorizados a Positiva encontrándose excluidos del presente contrato los servicios y todas aquellas actividades procedimientos e intervenciones que no tengan por objeto contribuir al diagnóstico tratamiento o rehabilitación de la patología derivada del siniestro o los servicios considerados como experimentales cosméticos y suntuarios.","2022-11-01",{"$f":"MONTH(G603)","v":11},"2024-11-01",{"$f":"(I603-G603)/30","v":24.366666666666667},"Invitación directa","CargoAReserva",0,0,"NO",null,"Gerencia de Abastecimiento Estratégico\ncontratacion@positiva.gov.co\nPBX: (1)6502200 Ext: 10641","SI","SI","NO","SI",{"$f":"IF(U603=\"SI\",\"Pública clasificada\",\"Pública\")","v":"Pública clasificada"},{"$f":"CONCATENATE(D603,\"-\",\"Tipo de información\",\" \",V603,\"-\",F603)","v":"C66552022-Tipo de información Pública clasificada-Prestación de servicios: El CONTRATISTA se obliga con POSITIVA a la prestación de los servicios de salud para los asegurados y o afiliados a POSITIVA que accedan a los servicios habilitados del CONTRATISTA en calidad de asegurados a los ramos Administración de Riesgos Laborales ARL por causa exclusiva de un accidente de trabajo una enfermedad profesional) Accidentes Personales AP Educativo Generación Positiva AP Colectivos APCorto Plazo AP Individual y demás Ramos de Seguros autorizados a Positiva encontrándose excluidos del presente contrato los servicios y todas aquellas actividades procedimientos e intervenciones que no tengan por objeto contribuir al diagnóstico tratamiento o rehabilitación de la patología derivada del siniestro o los servicios considerados como experimentales cosméticos y suntuarios."}]
["VICEPRESIDENCIA TÉCNICA","Gerencia Médica","NO","C66562022",85100000,"Prestación de servicios: El CONTRATISTA se obliga con POSITIVA a la prestación de los servicios de salud para los asegurados y o afiliados a POSITIVA que accedan a los servicios habilitados del CONTRATISTA en calidad de asegurados a los ramos Administración de Riesgos Laborales ARL por causa exclusiva de un accidente de trabajo una enfermedad profesional) Accidentes Personales AP Educativo Generación Positiva AP Colectivos APCorto Plazo AP Individual y demás Ramos de Seguros autorizados a Positiva encontrándose excluidos del presente contrato los servicios y todas aquellas actividades procedimientos e intervenciones que no tengan por objeto contribuir al diagnóstico tratamiento o rehabilitación de la patología derivada del siniestro o los servicios considerados como experimentales cosméticos y suntuarios.","2022-02-01",{"$f":"MONTH(G604)","v":2},"2024-02-01",{"$f":"(I604-G604)/30","v":24.333333333333332},"Invitación directa","CargoAReserva",0,0,"NO",null,"Gerencia de Abastecimiento Estratégico\ncontratacion@positiva.gov.co\nPBX: (1)6502200 Ext: 10641","SI","SI","NO","SI",{"$f":"IF(U604=\"SI\",\"Pública clasificada\",\"Pública\")","v":"Pública clasificada"},{"$f":"CONCATENATE(D604,\"-\",\"Tipo de información\",\" \",V604,\"-\",F604)","v":"C66562022-Tipo de información Pública clasificada-Prestación de servicios: El CONTRATISTA se obliga con POSITIVA a la prestación de los servicios de salud para los asegurados y o afiliados a POSITIVA que accedan a los servicios habilitados del CONTRATISTA en calidad de asegurados a los ramos Administración de Riesgos Laborales ARL por causa exclusiva de un accidente de trabajo una enfermedad profesional) Accidentes Personales AP Educativo Generación Positiva AP Colectivos APCorto Plazo AP Individual y demás Ramos de Seguros autorizados a Positiva encontrándose excluidos del presente contrato los servicios y todas aquellas actividades procedimientos e intervenciones que no tengan por objeto contribuir al diagnóstico tratamiento o rehabilitación de la patología derivada del siniestro o los servicios considerados como experimentales cosméticos y suntuarios."}]
["VICEPRESIDENCIA TÉCNICA","Gerencia Médica","NO","C66572022",85100000,"Prestación de servicios: El CONTRATISTA se obliga con POSITIVA a la prestación de los servicios de salud para los asegurados y o afiliados a POSITIVA que accedan a los servicios habilitados del CONTRATISTA en calidad de asegurados a los ramos Administración de Riesgos Laborales ARL por causa exclusiva de un accidente de trabajo una enfermedad profesional) Accidentes Personales AP Educativo Generación Positiva AP Colectivos APCorto Plazo AP Individual y demás Ramos de Seguros autorizados a Positiva encontrándose excluidos del presente contrato los servicios y todas aquellas actividades procedimientos e intervenciones que no tengan por objeto contribuir al diagnóstico tratamiento o rehabilitación de la patología derivada del siniestro o los servicios considerados como experimentales cosméticos y suntuarios.","2022-03-01",{"$f":"MONTH(G605)","v":3},"2024-03-01",{"$f":"(I605-G605)/30","v":24.366666666666667},"Invitación directa","CargoAReserva",0,0,"NO",null,"Gerencia de Abastecimiento Estratégico\ncontratacion@positiva.gov.co\nPBX: (1)6502200 Ext: 10641","SI","SI","NO","SI",{"$f":"IF(U605=\"SI\",\"Pública clasificada\",\"Pública\")","v":"Pública clasificada"},{"$f":"CONCATENATE(D605,\"-\",\"Tipo de información\",\" \",V605,\"-\",F605)","v":"C66572022-Tipo de información Pública clasificada-Prestación de servicios: El CONTRATISTA se obliga con POSITIVA a la prestación de los servicios de salud para los asegurados y o afiliados a POSITIVA que accedan a los servicios habilitados del CONTRATISTA en calidad de asegurados a los ramos Administración de Riesgos Laborales ARL por causa exclusiva de un accidente de trabajo una enfermedad profesional) Accidentes Personales AP Educativo Generación Positiva AP Colectivos APCorto Plazo AP Individual y demás Ramos de Seguros autorizados a Positiva encontrándose excluidos del presente contrato los servicios y todas aquellas actividades procedimientos e intervenciones que no tengan por objeto contribuir al diagnóstico tratamiento o rehabilitación de la patología derivada del siniestro o los servicios considerados como experimentales cosméticos y suntuarios."}]
["VICEPRESIDENCIA TÉCNICA","Gerencia Médica","NO","C66582022",85100000,"Prestación de servicios: El CONTRATISTA se obliga con POSITIVA a la prestación de los servicios de salud para los asegurados y o afiliados a POSITIVA que accedan a los servicios habilitados del CONTRATISTA en calidad de asegurados a los ramos Administración de Riesgos Laborales ARL por causa exclusiva de un accidente de trabajo una enfermedad profesional) Accidentes Personales AP Educativo Generación Positiva AP Colectivos APCorto Plazo AP Individual y demás Ramos de Seguros autorizados a Positiva encontrándose excluidos del presente contrato los servicios y todas aquellas actividades procedimientos e intervenciones que no tengan por objeto contribuir al diagnóstico tratamiento o rehabilitación de la patología derivada del siniestro o los servicios considerados como experimentales cosméticos y suntuarios.","2022-04-01",{"$f":"MONTH(G606)","v":4},"2024-04-01",{"$f":"(I606-G606)/30","v":24.366666666666667},"Invitación directa","CargoAReserva",0,0,"NO",null,"Gerencia de Abastecimiento Estratégico\ncontratacion@positiva.gov.co\nPBX: (1)6502200 Ext: 10641","SI","SI","NO","SI",{"$f":"IF(U606=\"SI\",\"Pública clasificada\",\"Pública\")","v":"Pública clasificada"},{"$f":"CONCATENATE(D606,\"-\",\"Tipo de información\",\" \",V606,\"-\",F606)","v":"C66582022-Tipo de información Pública clasificada-Prestación de servicios: El CONTRATISTA se obliga con POSITIVA a la prestación de los servicios de salud para los asegurados y o afiliados a POSITIVA que accedan a los servicios habilitados del CONTRATISTA en calidad de asegurados a los ramos Administración de Riesgos Laborales ARL por causa exclusiva de un accidente de trabajo una enfermedad profesional) Accidentes Personales AP Educativo Generación Positiva AP Colectivos APCorto Plazo AP Individual y demás Ramos de Seguros autorizados a Positiva encontrándose excluidos del presente contrato los servicios y todas aquellas actividades procedimientos e intervenciones que no tengan por objeto contribuir al diagnóstico tratamiento o rehabilitación de la patología derivada del siniestro o los servicios considerados como experimentales cosméticos y suntuarios."}]
["VICEPRESIDENCIA TÉCNICA","Gerencia Médica","NO","C66592022",85100000,"Prestación de servicios: El CONTRATISTA se obliga con POSITIVA a la prestación de los servicios de salud para los asegurados y o afiliados a POSITIVA que accedan a los servicios habilitados del CONTRATISTA en calidad de asegurados a los ramos Administración de Riesgos Laborales ARL por causa exclusiva de un accidente de trabajo una enfermedad profesional) Accidentes Personales AP Educativo Generación Positiva AP Colectivos APCorto Plazo AP Individual y demás Ramos de Seguros autorizados a Positiva encontrándose excluidos del presente contrato los servicios y todas aquellas actividades procedimientos e intervenciones que no tengan por objeto contribuir al diagnóstico tratamiento o rehabilitación de la patología derivada del siniestro o los servicios considerados como experimentales cosméticos y suntuarios.","2022-05-01",{"$f":"MONTH(G607)","v":5},"2024-05-01",{"$f":"(I607-G607)/30","v":24.366666666666667},"Invitación directa","CargoAReserva",0,0,"NO",null,"Gerencia de Abastecimiento Estratégico\ncontratacion@positiva.gov.co\nPBX: (1)6502200 Ext: 10641","SI","SI","NO","SI",{"$f":"IF(U607=\"SI\",\"Pública clasificada\",\"Pública\")","v":"Pública clasificada"},{"$f":"CONCATENATE(D607,\"-\",\"Tipo de información\",\" \",V607,\"-\",F607)","v":"C66592022-Tipo de información Pública clasificada-Prestación de servicios: El CONTRATISTA se obliga con POSITIVA a la prestación de los servicios de salud para los asegurados y o afiliados a POSITIVA que accedan a los servicios habilitados del CONTRATISTA en calidad de asegurados a los ramos Administración de Riesgos Laborales ARL por causa exclusiva de un accidente de trabajo una enfermedad profesional) Accidentes Personales AP Educativo Generación Positiva AP Colectivos APCorto Plazo AP Individual y demás Ramos de Seguros autorizados a Positiva encontrándose excluidos del presente contrato los servicios y todas aquellas actividades procedimientos e intervenciones que no tengan por objeto contribuir al diagnóstico tratamiento o rehabilitación de la patología derivada del siniestro o los servicios considerados como experimentales cosméticos y suntuarios."}]
["VICEPRESIDENCIA TÉCNICA","Gerencia Médica","NO","C66602022",85100000,"Prestación de servicios: El CONTRATISTA se obliga con POSITIVA a la prestación de los servicios de salud para los asegurados y o afiliados a POSITIVA que accedan a los servicios habilitados del CONTRATISTA en calidad de asegurados a los ramos Administración de Riesgos Laborales ARL por causa exclusiva de un accidente de trabajo una enfermedad profesional) Accidentes Personales AP Educativo Generación Positiva AP Colectivos APCorto Plazo AP Individual y demás Ramos de Seguros autorizados a Positiva encontrándose excluidos del presente contrato los servicios y todas aquellas actividades procedimientos e intervenciones que no tengan por objeto contribuir al diagnóstico tratamiento o rehabilitación de la patología derivada del siniestro o los servicios considerados como experimentales cosméticos y suntuarios.","2022-05-05",{"$f":"MONTH(G608)","v":5},"2024-05-05",{"$f":"(I608-G608)/30","v":24.366666666666667},"Invitación directa","CargoAReserva",0,0,"NO",null,"Gerencia de Abastecimiento Estratégico\ncontratacion@positiva.gov.co\nPBX: (1)6502200 Ext: 10641","SI","SI","NO","SI",{"$f":"IF(U608=\"SI\",\"Pública clasificada\",\"Pública\")","v":"Pública clasificada"},{"$f":"CONCATENATE(D608,\"-\",\"Tipo de información\",\" \",V608,\"-\",F608)","v":"C66602022-Tipo de información Pública clasificada-Prestación de servicios: El CONTRATISTA se obliga con POSITIVA a la prestación de los servicios de salud para los asegurados y o afiliados a POSITIVA que accedan a los servicios habilitados del CONTRATISTA en calidad de asegurados a los ramos Administración de Riesgos Laborales ARL por causa exclusiva de un accidente de trabajo una enfermedad profesional) Accidentes Personales AP Educativo Generación Positiva AP Colectivos APCorto Plazo AP Individual y demás Ramos de Seguros autorizados a Positiva encontrándose excluidos del presente contrato los servicios y todas aquellas actividades procedimientos e intervenciones que no tengan por objeto contribuir al diagnóstico tratamiento o rehabilitación de la patología derivada del siniestro o los servicios considerados como experimentales cosméticos y suntuarios."}]
["VICEPRESIDENCIA TÉCNICA","Gerencia Médica","NO","C66612022",85100000,"Prestación de servicios: El CONTRATISTA se obliga con POSITIVA a la prestación de los servicios de salud para los asegurados y o afiliados a POSITIVA que accedan a los servicios habilitados del CONTRATISTA en calidad de asegurados a los ramos Administración de Riesgos Laborales ARL por causa exclusiva de un accidente de trabajo una enfermedad profesional) Accidentes Personales AP Educativo Generación Positiva AP Colectivos APCorto Plazo AP Individual y demás Ramos de Seguros autorizados a Positiva encontrándose excluidos del presente contrato los servicios y todas aquellas actividades procedimientos e intervenciones que no tengan por objeto contribuir al diagnóstico tratamiento o rehabilitación de la patología derivada del siniestro o los servicios considerados como experimentales cosméticos y suntuarios.","2022-04-20",{"$f":"MONTH(G609)","v":4},"2024-04-20",{"$f":"(I609-G609)/30","v":24.366666666666667},"Invitación directa","CargoAReserva",0,0,"NO",null,"Gerencia de Abastecimiento Estratégico\ncontratacion@positiva.gov.co\nPBX: (1)6502200 Ext: 10641","SI","SI","NO","SI",{"$f":"IF(U609=\"SI\",\"Pública clasificada\",\"Pública\")","v":"Pública clasificada"},{"$f":"CONCATENATE(D609,\"-\",\"Tipo de información\",\" \",V609,\"-\",F609)","v":"C66612022-Tipo de información Pública clasificada-Prestación de servicios: El CONTRATISTA se obliga con POSITIVA a la prestación de los servicios de salud para los asegurados y o afiliados a POSITIVA que accedan a los servicios habilitados del CONTRATISTA en calidad de asegurados a los ramos Administración de Riesgos Laborales ARL por causa exclusiva de un accidente de trabajo una enfermedad profesional) Accidentes Personales AP Educativo Generación Positiva AP Colectivos APCorto Plazo AP Individual y demás Ramos de Seguros autorizados a Positiva encontrándose excluidos del presente contrato los servicios y todas aquellas actividades procedimientos e intervenciones que no tengan por objeto contribuir al diagnóstico tratamiento o rehabilitación de la patología derivada del siniestro o los servicios considerados como experimentales cosméticos y suntuarios."}]
["VICEPRESIDENCIA TÉCNICA","Gerencia Médica","NO","C66622022",85100000,"Prestación de servicios: El CONTRATISTA se obliga con POSITIVA a la prestación de los servicios de salud para los asegurados y o afiliados a POSITIVA que accedan a los servicios habilitados del CONTRATISTA en calidad de asegurados a los ramos Administración de Riesgos Laborales ARL por causa exclusiva de un accidente de trabajo una enfermedad profesional) Accidentes Personales AP Educativo Generación Positiva AP Colectivos APCorto Plazo AP Individual y demás Ramos de Seguros autorizados a Positiva encontrándose excluidos del presente contrato los servicios y todas aquellas actividades procedimientos e intervenciones que no tengan por objeto contribuir al diagnóstico tratamiento o rehabilitación de la patología derivada del siniestro o los servicios considerados como experimentales cosméticos y suntuarios.","2022-05-16",{"$f":"MONTH(G610)","v":5},"2024-05-16",{"$f":"(I610-G610)/30","v":24.366666666666667},"Invitación directa","CargoAReserva",0,0,"NO",null,"Gerencia de Abastecimiento Estratégico\ncontratacion@positiva.gov.co\nPBX: (1)6502200 Ext: 10641","SI","SI","NO","SI",{"$f":"IF(U610=\"SI\",\"Pública clasificada\",\"Pública\")","v":"Pública clasificada"},{"$f":"CONCATENATE(D610,\"-\",\"Tipo de información\",\" \",V610,\"-\",F610)","v":"C66622022-Tipo de información Pública clasificada-Prestación de servicios: El CONTRATISTA se obliga con POSITIVA a la prestación de los servicios de salud para los asegurados y o afiliados a POSITIVA que accedan a los servicios habilitados del CONTRATISTA en calidad de asegurados a los ramos Administración de Riesgos Laborales ARL por causa exclusiva de un accidente de trabajo una enfermedad profesional) Accidentes Personales AP Educativo Generación Positiva AP Colectivos APCorto Plazo AP Individual y demás Ramos de Seguros autorizados a Positiva encontrándose excluidos del presente contrato los servicios y todas aquellas actividades procedimientos e intervenciones que no tengan por objeto contribuir al diagnóstico tratamiento o rehabilitación de la patología derivada del siniestro o los servicios considerados como experimentales cosméticos y suntuarios."}]
["VICEPRESIDENCIA TÉCNICA","Gerencia Médica","NO","C66632022",85100000,"Prestación de servicios: El CONTRATISTA se obliga con POSITIVA a la prestación de los servicios de salud para los asegurados y o afiliados a POSITIVA que accedan a los servicios habilitados del CONTRATISTA en calidad de asegurados a los ramos Administración de Riesgos Laborales ARL por causa exclusiva de un accidente de trabajo una enfermedad profesional) Accidentes Personales AP Educativo Generación Positiva AP Colectivos APCorto Plazo AP Individual y demás Ramos de Seguros autorizados a Positiva encontrándose excluidos del presente contrato los servicios y todas aquellas actividades procedimientos e intervenciones que no tengan por objeto contribuir al diagnóstico tratamiento o rehabilitación de la patología derivada del siniestro o los servicios considerados como experimentales cosméticos y suntuarios.","2022-02-24",{"$f":"MONTH(G611)","v":2},"2024-02-24",{"$f":"(I611-G611)/30","v":24.333333333333332},"Invitación directa","CargoAReserva",0,0,"NO",null,"Gerencia de Abastecimiento Estratégico\ncontratacion@positiva.gov.co\nPBX: (1)6502200 Ext: 10641","SI","SI","NO","SI",{"$f":"IF(U611=\"SI\",\"Pública clasificada\",\"Pública\")","v":"Pública clasificada"},{"$f":"CONCATENATE(D611,\"-\",\"Tipo de información\",\" \",V611,\"-\",F611)","v":"C66632022-Tipo de información Pública clasificada-Prestación de servicios: El CONTRATISTA se obliga con POSITIVA a la prestación de los servicios de salud para los asegurados y o afiliados a POSITIVA que accedan a los servicios habilitados del CONTRATISTA en calidad de asegurados a los ramos Administración de Riesgos Laborales ARL por causa exclusiva de un accidente de trabajo una enfermedad profesional) Accidentes Personales AP Educativo Generación Positiva AP Colectivos APCorto Plazo AP Individual y demás Ramos de Seguros autorizados a Positiva encontrándose excluidos del presente contrato los servicios y todas aquellas actividades procedimientos e intervenciones que no tengan por objeto contribuir al diagnóstico tratamiento o rehabilitación de la patología derivada del siniestro o los servicios considerados como experimentales cosméticos y suntuarios."}]
["VICEPRESIDENCIA TÉCNICA","Gerencia Médica","NO","C66642022",85100000,"Prestación de servicios: El CONTRATISTA se obliga con POSITIVA a la prestación de los servicios de salud para los asegurados y o afiliados a POSITIVA que accedan a los servicios habilitados del CONTRATISTA en calidad de asegurados a los ramos Administración de Riesgos Laborales ARL por causa exclusiva de un accidente de trabajo una enfermedad profesional) Accidentes Personales AP Educativo Generación Positiva AP Colectivos APCorto Plazo AP Individual y demás Ramos de Seguros autorizados a Positiva encontrándose excluidos del presente contrato los servicios y todas aquellas actividades procedimientos e intervenciones que no tengan por objeto contribuir al diagnóstico tratamiento o rehabilitación de la patología derivada del siniestro o los servicios considerados como experimentales cosméticos y suntuarios.","2022-05-30",{"$f":"MONTH(G612)","v":5},"2024-05-30",{"$f":"(I612-G612)/30","v":24.366666666666667},"Invitación directa","CargoAReserva",0,0,"NO",null,"Gerencia de Abastecimiento Estratégico\ncontratacion@positiva.gov.co\nPBX: (1)6502200 Ext: 10641","SI","SI","NO","SI",{"$f":"IF(U612=\"SI\",\"Pública clasificada\",\"Pública\")","v":"Pública clasificada"},{"$f":"CONCATENATE(D612,\"-\",\"Tipo de información\",\" \",V612,\"-\",F612)","v":"C66642022-Tipo de información Pública clasificada-Prestación de servicios: El CONTRATISTA se obliga con POSITIVA a la prestación de los servicios de salud para los asegurados y o afiliados a POSITIVA que accedan a los servicios habilitados del CONTRATISTA en calidad de asegurados a los ramos Administración de Riesgos Laborales ARL por causa exclusiva de un accidente de trabajo una enfermedad profesional) Accidentes Personales AP Educativo Generación Positiva AP Colectivos APCorto Plazo AP Individual y demás Ramos de Seguros autorizados a Positiva encontrándose excluidos del presente contrato los servicios y todas aquellas actividades procedimientos e intervenciones que no tengan por objeto contribuir al diagnóstico tratamiento o rehabilitación de la patología derivada del siniestro o los servicios considerados como experimentales cosméticos y suntuarios."}]
["VICEPRESIDENCIA TÉCNICA","Gerencia Médica","NO","C66652022",85100000,"Prestación de servicios: El CONTRATISTA se obliga con POSITIVA a la prestación de los servicios de salud para los asegurados y o afiliados a POSITIVA que accedan a los servicios habilitados del CONTRATISTA en calidad de asegurados a los ramos Administración de Riesgos Laborales ARL por causa exclusiva de un accidente de trabajo una enfermedad profesional) Accidentes Personales AP Educativo Generación Positiva AP Colectivos APCorto Plazo AP Individual y demás Ramos de Seguros autorizados a Positiva encontrándose excluidos del presente contrato los servicios y todas aquellas actividades procedimientos e intervenciones que no tengan por objeto contribuir al diagnóstico tratamiento o rehabilitación de la patología derivada del siniestro o los servicios considerados como experimentales cosméticos y suntuarios.","2022-08-15",{"$f":"MONTH(G613)","v":8},"2027-08-15",{"$f":"(I613-G613)/30","v":60.866666666666667},"Invitación directa","CargoAReserva",0,0,"NO",null,"Gerencia de Abastecimiento Estratégico\ncontratacion@positiva.gov.co\nPBX: (1)6502200 Ext: 10641","SI","SI","NO","SI",{"$f":"IF(U613=\"SI\",\"Pública clasificada\",\"Pública\")","v":"Pública clasificada"},{"$f":"CONCATENATE(D613,\"-\",\"Tipo de información\",\" \",V613,\"-\",F613)","v":"C66652022-Tipo de información Pública clasificada-Prestación de servicios: El CONTRATISTA se obliga con POSITIVA a la prestación de los servicios de salud para los asegurados y o afiliados a POSITIVA que accedan a los servicios habilitados del CONTRATISTA en calidad de asegurados a los ramos Administración de Riesgos Laborales ARL por causa exclusiva de un accidente de trabajo una enfermedad profesional) Accidentes Personales AP Educativo Generación Positiva AP Colectivos APCorto Plazo AP Individual y demás Ramos de Seguros autorizados a Positiva encontrándose excluidos del presente contrato los servicios y todas aquellas actividades procedimientos e intervenciones que no tengan por objeto contribuir al diagnóstico tratamiento o rehabilitación de la patología derivada del siniestro o los servicios considerados como experimentales cosméticos y suntuarios."}]
["VICEPRESIDENCIA TÉCNICA","Gerencia Médica","NO","C66662022",85100000,"Prestación de servicios: El CONTRATISTA se obliga con POSITIVA a la prestación de los servicios de salud para los asegurados y o afiliados a POSITIVA que accedan a los servicios habilitados del CONTRATISTA en calidad de asegurados a los ramos Administración de Riesgos Laborales ARL por causa exclusiva de un accidente de trabajo una enfermedad profesional) Accidentes Personales AP Educativo Generación Positiva AP Colectivos APCorto Plazo AP Individual y demás Ramos de Seguros autorizados a Positiva encontrándose excluidos del presente contrato los servicios y todas aquellas actividades procedimientos e intervenciones que no tengan por objeto contribuir al diagnóstico tratamiento o rehabilitación de la patología derivada del siniestro o los servicios considerados como experimentales cosméticos y suntuarios.","2022-12-28",{"$f":"MONTH(G614)","v":12},"2024-12-28",{"$f":"(I614-G614)/30","v":24.366666666666667},"Invitación directa","CargoAReserva",0,0,"NO",null,"Gerencia de Abastecimiento Estratégico\ncontratacion@positiva.gov.co\nPBX: (1)6502200 Ext: 10641","SI","SI","NO","SI",{"$f":"IF(U614=\"SI\",\"Pública clasificada\",\"Pública\")","v":"Pública clasificada"},{"$f":"CONCATENATE(D614,\"-\",\"Tipo de información\",\" \",V614,\"-\",F614)","v":"C66662022-Tipo de información Pública clasificada-Prestación de servicios: El CONTRATISTA se obliga con POSITIVA a la prestación de los servicios de salud para los asegurados y o afiliados a POSITIVA que accedan a los servicios habilitados del CONTRATISTA en calidad de asegurados a los ramos Administración de Riesgos Laborales ARL por causa exclusiva de un accidente de trabajo una enfermedad profesional) Accidentes Personales AP Educativo Generación Positiva AP Colectivos APCorto Plazo AP Individual y demás Ramos de Seguros autorizados a Positiva encontrándose excluidos del presente contrato los servicios y todas aquellas actividades procedimientos e intervenciones que no tengan por objeto contribuir al diagnóstico tratamiento o rehabilitación de la patología derivada del siniestro o los servicios considerados como experimentales cosméticos y suntuarios."}]
["VICEPRESIDENCIA TÉCNICA","Gerencia Médica","NO","C66682022",85100000,"Prestación de servicios: El CONTRATISTA se obliga con POSITIVA a la prestación de los servicios de salud para los asegurados y o afiliados a POSITIVA que accedan a los servicios habilitados del CONTRATISTA en calidad de asegurados a los ramos Administración de Riesgos Laborales ARL por causa exclusiva de un accidente de trabajo una enfermedad profesional) Accidentes Personales AP Educativo Generación Positiva AP Colectivos APCorto Plazo AP Individual y demás Ramos de Seguros autorizados a Positiva encontrándose excluidos del presente contrato los servicios y todas aquellas actividades procedimientos e intervenciones que no tengan por objeto contribuir al diagnóstico tratamiento o rehabilitación de la patología derivada del siniestro o los servicios considerados como experimentales cosméticos y suntuarios.","2022-10-09",{"$f":"MONTH(G615)","v":10},"2024-10-09",{"$f":"(I615-G615)/30","v":24.366666666666667},"Invitación directa","CargoAReserva",0,0,"NO",null,"Gerencia de Abastecimiento Estratégico\ncontratacion@positiva.gov.co\nPBX: (1)6502200 Ext: 10641","SI","SI","NO","SI",{"$f":"IF(U615=\"SI\",\"Pública clasificada\",\"Pública\")","v":"Pública clasificada"},{"$f":"CONCATENATE(D615,\"-\",\"Tipo de información\",\" \",V615,\"-\",F615)","v":"C66682022-Tipo de información Pública clasificada-Prestación de servicios: El CONTRATISTA se obliga con POSITIVA a la prestación de los servicios de salud para los asegurados y o afiliados a POSITIVA que accedan a los servicios habilitados del CONTRATISTA en calidad de asegurados a los ramos Administración de Riesgos Laborales ARL por causa exclusiva de un accidente de trabajo una enfermedad profesional) Accidentes Personales AP Educativo Generación Positiva AP Colectivos APCorto Plazo AP Individual y demás Ramos de Seguros autorizados a Positiva encontrándose excluidos del presente contrato los servicios y todas aquellas actividades procedimientos e intervenciones que no tengan por objeto contribuir al diagnóstico tratamiento o rehabilitación de la patología derivada del siniestro o los servicios considerados como experimentales cosméticos y suntuarios."}]
["VICEPRESIDENCIA TÉCNICA","Gerencia Médica","NO","C66692022",85100000,"Prestación de servicios: El CONTRATISTA se obliga con POSITIVA a la prestación de los servicios de salud para los asegurados y o afiliados a POSITIVA que accedan a los servicios habilitados del CONTRATISTA en calidad de asegurados a los ramos Administración de Riesgos Laborales ARL por causa exclusiva de un accidente de trabajo una enfermedad profesional) Accidentes Personales AP Educativo Generación Positiva AP Colectivos APCorto Plazo AP Individual y demás Ramos de Seguros autorizados a Positiva encontrándose excluidos del presente contrato los servicios y todas aquellas actividades procedimientos e intervenciones que no tengan por objeto contribuir al diagnóstico tratamiento o rehabilitación de la patología derivada del siniestro o los servicios considerados como experimentales cosméticos y suntuarios.","2022-05-28",{"$f":"MONTH(G616)","v":5},"2024-05-28",{"$f":"(I616-G616)/30","v":24.366666666666667},"Invitación directa","CargoAReserva",0,0,"NO",null,"Gerencia de Abastecimiento Estratégico\ncontratacion@positiva.gov.co\nPBX: (1)6502200 Ext: 10641","SI","SI","NO","SI",{"$f":"IF(U616=\"SI\",\"Pública clasificada\",\"Pública\")","v":"Pública clasificada"},{"$f":"CONCATENATE(D616,\"-\",\"Tipo de información\",\" \",V616,\"-\",F616)","v":"C66692022-Tipo de información Pública clasificada-Prestación de servicios: El CONTRATISTA se obliga con POSITIVA a la prestación de los servicios de salud para los asegurados y o afiliados a POSITIVA que accedan a los servicios habilitados del CONTRATISTA en calidad de asegurados a los ramos Administración de Riesgos Laborales ARL por causa exclusiva de un accidente de trabajo una enfermedad profesional) Accidentes Personales AP Educativo Generación Positiva AP Colectivos APCorto Plazo AP Individual y demás Ramos de Seguros autorizados a Positiva encontrándose excluidos del presente contrato los servicios y todas aquellas actividades procedimientos e intervenciones que no tengan por objeto contribuir al diagnóstico tratamiento o rehabilitación de la patología derivada del siniestro o los servicios considerados como experimentales cosméticos y suntuarios."}]
["VICEPRESIDENCIA TÉCNICA","Gerencia Médica","NO","C66702022",85100000,"Prestación de servicios: El CONTRATISTA se obliga con POSITIVA a la prestación de los servicios de salud para los asegurados y o afiliados a POSITIVA que accedan a los servicios habilitados del CONTRATISTA en calidad de asegurados a los ramos Administración de Riesgos Laborales ARL por causa exclusiva de un accidente de trabajo una enfermedad profesional) Accidentes Personales AP Educativo Generación Positiva AP Colectivos APCorto Plazo AP Individual y demás Ramos de Seguros autorizados a Positiva encontrándose excluidos del presente contrato los servicios y todas aquellas actividades procedimientos e intervenciones que no tengan por objeto contribuir al diagnóstico tratamiento o rehabilitación de la patología derivada del siniestro o los servicios considerados como experimentales cosméticos y suntuarios.","2022-10-01",{"$f":"MONTH(G617)","v":10},"2024-10-30",{"$f":"(I617-G617)/30","v":25.333333333333332},"Invitación directa","CargoAReserva",0,0,"NO",null,"Gerencia de Abastecimiento Estratégico\ncontratacion@positiva.gov.co\nPBX: (1)6502200 Ext: 10641","SI","SI","NO","SI",{"$f":"IF(U617=\"SI\",\"Pública clasificada\",\"Pública\")","v":"Pública clasificada"},{"$f":"CONCATENATE(D617,\"-\",\"Tipo de información\",\" \",V617,\"-\",F617)","v":"C66702022-Tipo de información Pública clasificada-Prestación de servicios: El CONTRATISTA se obliga con POSITIVA a la prestación de los servicios de salud para los asegurados y o afiliados a POSITIVA que accedan a los servicios habilitados del CONTRATISTA en calidad de asegurados a los ramos Administración de Riesgos Laborales ARL por causa exclusiva de un accidente de trabajo una enfermedad profesional) Accidentes Personales AP Educativo Generación Positiva AP Colectivos APCorto Plazo AP Individual y demás Ramos de Seguros autorizados a Positiva encontrándose excluidos del presente contrato los servicios y todas aquellas actividades procedimientos e intervenciones que no tengan por objeto contribuir al diagnóstico tratamiento o rehabilitación de la patología derivada del siniestro o los servicios considerados como experimentales cosméticos y suntuarios."}]
["VICEPRESIDENCIA TÉCNICA","Gerencia Médica","NO","C66712022",85100000,"Prestación de servicios: El CONTRATISTA se obliga con POSITIVA a la prestación de los servicios de salud para los asegurados y o afiliados a POSITIVA que accedan a los servicios habilitados del CONTRATISTA en calidad de asegurados a los ramos Administración de Riesgos Laborales ARL por causa exclusiva de un accidente de trabajo una enfermedad profesional) Accidentes Personales AP Educativo Generación Positiva AP Colectivos APCorto Plazo AP Individual y demás Ramos de Seguros autorizados a Positiva encontrándose excluidos del presente contrato los servicios y todas aquellas actividades procedimientos e intervenciones que no tengan por objeto contribuir al diagnóstico tratamiento o rehabilitación de la patología derivada del siniestro o los servicios considerados como experimentales cosméticos y suntuarios.","2022-08-01",{"$f":"MONTH(G618)","v":8},"2027-08-01",{"$f":"(I618-G618)/30","v":60.866666666666667},"Invitación directa","CargoAReserva",0,0,"NO",null,"Gerencia de Abastecimiento Estratégico\ncontratacion@positiva.gov.co\nPBX: (1)6502200 Ext: 10641","SI","SI","NO","SI",{"$f":"IF(U618=\"SI\",\"Pública clasificada\",\"Pública\")","v":"Pública clasificada"},{"$f":"CONCATENATE(D618,\"-\",\"Tipo de información\",\" \",V618,\"-\",F618)","v":"C66712022-Tipo de información Pública clasificada-Prestación de servicios: El CONTRATISTA se obliga con POSITIVA a la prestación de los servicios de salud para los asegurados y o afiliados a POSITIVA que accedan a los servicios habilitados del CONTRATISTA en calidad de asegurados a los ramos Administración de Riesgos Laborales ARL por causa exclusiva de un accidente de trabajo una enfermedad profesional) Accidentes Personales AP Educativo Generación Positiva AP Colectivos APCorto Plazo AP Individual y demás Ramos de Seguros autorizados a Positiva encontrándose excluidos del presente contrato los servicios y todas aquellas actividades procedimientos e intervenciones que no tengan por objeto contribuir al diagnóstico tratamiento o rehabilitación de la patología derivada del siniestro o los servicios considerados como experimentales cosméticos y suntuarios."}]
["VICEPRESIDENCIA TÉCNICA","Gerencia Médica","NO","C66722022",85100000,"Prestación de servicios: El CONTRATISTA se obliga con POSITIVA a la prestación de los servicios de salud para los asegurados y o afiliados a POSITIVA que accedan a los servicios habilitados del CONTRATISTA en calidad de asegurados a los ramos Administración de Riesgos Laborales ARL por causa exclusiva de un accidente de trabajo una enfermedad profesional) Accidentes Personales AP Educativo Generación Positiva AP Colectivos APCorto Plazo AP Individual y demás Ramos de Seguros autorizados a Positiva encontrándose excluidos del presente contrato los servicios y todas aquellas actividades procedimientos e intervenciones que no tengan por objeto contribuir al diagnóstico tratamiento o rehabilitación de la patología derivada del siniestro o los servicios considerados como experimentales cosméticos y suntuarios.","2022-07-01",{"$f":"MONTH(G619)","v":7},"2024-07-01",{"$f":"(I619-G619)/30","v":24.366666666666667},"Invitación directa","CargoAReserva",0,0,"NO",null,"Gerencia de Abastecimiento Estratégico\ncontratacion@positiva.gov.co\nPBX: (1)6502200 Ext: 10641","SI","SI","NO","SI",{"$f":"IF(U619=\"SI\",\"Pública clasificada\",\"Pública\")","v":"Pública clasificada"},{"$f":"CONCATENATE(D619,\"-\",\"Tipo de información\",\" \",V619,\"-\",F619)","v":"C66722022-Tipo de información Pública clasificada-Prestación de servicios: El CONTRATISTA se obliga con POSITIVA a la prestación de los servicios de salud para los asegurados y o afiliados a POSITIVA que accedan a los servicios habilitados del CONTRATISTA en calidad de asegurados a los ramos Administración de Riesgos Laborales ARL por causa exclusiva de un accidente de trabajo una enfermedad profesional) Accidentes Personales AP Educativo Generación Positiva AP Colectivos APCorto Plazo AP Individual y demás Ramos de Seguros autorizados a Positiva encontrándose excluidos del presente contrato los servicios y todas aquellas actividades procedimientos e intervenciones que no tengan por objeto contribuir al diagnóstico tratamiento o rehabilitación de la patología derivada del siniestro o los servicios considerados como experimentales cosméticos y suntuarios."}]
["VICEPRESIDENCIA TÉCNICA","Gerencia Médica","NO","C66732022",85100000,"Prestación de servicios: El CONTRATISTA se obliga con POSITIVA a la prestación de los servicios de salud para los asegurados y o afiliados a POSITIVA que accedan a los servicios habilitados del CONTRATISTA en calidad de asegurados a los ramos Administración de Riesgos Laborales ARL por causa exclusiva de un accidente de trabajo una enfermedad profesional) Accidentes Personales AP Educativo Generación Positiva AP Colectivos APCorto Plazo AP Individual y demás Ramos de Seguros autorizados a Positiva encontrándose excluidos del presente contrato los servicios y todas aquellas actividades procedimientos e intervenciones que no tengan por objeto contribuir al diagnóstico tratamiento o rehabilitación de la patología derivada del siniestro o los servicios considerados como experimentales cosméticos y suntuarios.","2022-09-01",{"$f":"MONTH(G620)","v":9},"2027-09-01",{"$f":"(I620-G620)/30","v":60.866666666666667},"Invitación directa","CargoAReserva",0,0,"NO",null,"Gerencia de Abastecimiento Estratégico\ncontratacion@positiva.gov.co\nPBX: (1)6502200 Ext: 10641","SI","SI","NO","SI",{"$f":"IF(U620=\"SI\",\"Pública clasificada\",\"Pública\")","v":"Pública clasificada"},{"$f":"CONCATENATE(D620,\"-\",\"Tipo de información\",\" \",V620,\"-\",F620)","v":"C66732022-Tipo de información Pública clasificada-Prestación de servicios: El CONTRATISTA se obliga con POSITIVA a la prestación de los servicios de salud para los asegurados y o afiliados a POSITIVA que accedan a los servicios habilitados del CONTRATISTA en calidad de asegurados a los ramos Administración de Riesgos Laborales ARL por causa exclusiva de un accidente de trabajo una enfermedad profesional) Accidentes Personales AP Educativo Generación Positiva AP Colectivos APCorto Plazo AP Individual y demás Ramos de Seguros autorizados a Positiva encontrándose excluidos del presente contrato los servicios y todas aquellas actividades procedimientos e intervenciones que no tengan por objeto contribuir al diagnóstico tratamiento o rehabilitación de la patología derivada del siniestro o los servicios considerados como experimentales cosméticos y suntuarios."}]
["VICEPRESIDENCIA TÉCNICA","Gerencia Médica","NO","C66742022",85100000,"Prestación de servicios: El CONTRATISTA se obliga con POSITIVA a la prestación de los servicios de salud para los asegurados y o afiliados a POSITIVA que accedan a los servicios habilitados del CONTRATISTA en calidad de asegurados a los ramos Administración de Riesgos Laborales ARL por causa exclusiva de un accidente de trabajo una enfermedad profesional) Accidentes Personales AP Educativo Generación Positiva AP Colectivos APCorto Plazo AP Individual y demás Ramos de Seguros autorizados a Positiva encontrándose excluidos del presente contrato los servicios y todas aquellas actividades procedimientos e intervenciones que no tengan por objeto contribuir al diagnóstico tratamiento o rehabilitación de la patología derivada del siniestro o los servicios considerados como experimentales cosméticos y suntuarios.","2022-10-01",{"$f":"MONTH(G621)","v":10},"2027-10-01",{"$f":"(I621-G621)/30","v":60.866666666666667},"Invitación directa","CargoAReserva",0,0,"NO",null,"Gerencia de Abastecimiento Estratégico\ncontratacion@positiva.gov.co\nPBX: (1)6502200 Ext: 10641","SI","SI","NO","SI",{"$f":"IF(U621=\"SI\",\"Pública clasificada\",\"Pública\")","v":"Pública clasificada"},{"$f":"CONCATENATE(D621,\"-\",\"Tipo de información\",\" \",V621,\"-\",F621)","v":"C66742022-Tipo de información Pública clasificada-Prestación de servicios: El CONTRATISTA se obliga con POSITIVA a la prestación de los servicios de salud para los asegurados y o afiliados a POSITIVA que accedan a los servicios habilitados del CONTRATISTA en calidad de asegurados a los ramos Administración de Riesgos Laborales ARL por causa exclusiva de un accidente de trabajo una enfermedad profesional) Accidentes Personales AP Educativo Generación Positiva AP Colectivos APCorto Plazo AP Individual y demás Ramos de Seguros autorizados a Positiva encontrándose excluidos del presente contrato los servicios y todas aquellas actividades procedimientos e intervenciones que no tengan por objeto contribuir al diagnóstico tratamiento o rehabilitación de la patología derivada del siniestro o los servicios considerados como experimentales cosméticos y suntuarios."}]
["VICEPRESIDENCIA TÉCNICA","Gerencia Médica","NO","C66752022",85100000,"Prestación de servicios: El CONTRATISTA se obliga con POSITIVA a la prestación de los servicios de salud para los asegurados y o afiliados a POSITIVA que accedan a los servicios habilitados del CONTRATISTA en calidad de asegurados a los ramos Administración de Riesgos Laborales ARL por causa exclusiva de un accidente de trabajo una enfermedad profesional) Accidentes Personales AP Educativo Generación Positiva AP Colectivos APCorto Plazo AP Individual y demás Ramos de Seguros autorizados a Positiva encontrándose excluidos del presente contrato los servicios y todas aquellas actividades procedimientos e intervenciones que no tengan por objeto contribuir al diagnóstico tratamiento o rehabilitación de la patología derivada del siniestro o los servicios considerados como experimentales cosméticos y suntuarios.","2022-11-01",{"$f":"MONTH(G622)","v":11},"2027-11-01",{"$f":"(I622-G622)/30","v":60.866666666666667},"Invitación directa","CargoAReserva",0,0,"NO",null,"Gerencia de Abastecimiento Estratégico\ncontratacion@positiva.gov.co\nPBX: (1)6502200 Ext: 10641","SI","SI","NO","SI",{"$f":"IF(U622=\"SI\",\"Pública clasificada\",\"Pública\")","v":"Pública clasificada"},{"$f":"CONCATENATE(D622,\"-\",\"Tipo de información\",\" \",V622,\"-\",F622)","v":"C66752022-Tipo de información Pública clasificada-Prestación de servicios: El CONTRATISTA se obliga con POSITIVA a la prestación de los servicios de salud para los asegurados y o afiliados a POSITIVA que accedan a los servicios habilitados del CONTRATISTA en calidad de asegurados a los ramos Administración de Riesgos Laborales ARL por causa exclusiva de un accidente de trabajo una enfermedad profesional) Accidentes Personales AP Educativo Generación Positiva AP Colectivos APCorto Plazo AP Individual y demás Ramos de Seguros autorizados a Positiva encontrándose excluidos del presente contrato los servicios y todas aquellas actividades procedimientos e intervenciones que no tengan por objeto contribuir al diagnóstico tratamiento o rehabilitación de la patología derivada del siniestro o los servicios considerados como experimentales cosméticos y suntuarios."}]
["VICEPRESIDENCIA TÉCNICA","Gerencia Médica","NO","C66762022",85100000,"Prestación de servicios: El CONTRATISTA se obliga con POSITIVA a la prestación de los servicios de salud para los asegurados y o afiliados a POSITIVA que accedan a los servicios habilitados del CONTRATISTA en calidad de asegurados a los ramos Administración de Riesgos Laborales ARL por causa exclusiva de un accidente de trabajo una enfermedad profesional) Accidentes Personales AP Educativo Generación Positiva AP Colectivos APCorto Plazo AP Individual y demás Ramos de Seguros autorizados a Positiva encontrándose excluidos del presente contrato los servicios y todas aquellas actividades procedimientos e intervenciones que no tengan por objeto contribuir al diagnóstico tratamiento o rehabilitación de la patología derivada del siniestro o los servicios considerados como experimentales cosméticos y suntuarios.","2022-08-01",{"$f":"MONTH(G623)","v":8},"2024-08-01",{"$f":"(I623-G623)/30","v":24.366666666666667},"Invitación directa","CargoAReserva",0,0,"NO",null,"Gerencia de Abastecimiento Estratégico\ncontratacion@positiva.gov.co\nPBX: (1)6502200 Ext: 10641","SI","SI","NO","SI",{"$f":"IF(U623=\"SI\",\"Pública clasificada\",\"Pública\")","v":"Pública clasificada"},{"$f":"CONCATENATE(D623,\"-\",\"Tipo de información\",\" \",V623,\"-\",F623)","v":"C66762022-Tipo de información Pública clasificada-Prestación de servicios: El CONTRATISTA se obliga con POSITIVA a la prestación de los servicios de salud para los asegurados y o afiliados a POSITIVA que accedan a los servicios habilitados del CONTRATISTA en calidad de asegurados a los ramos Administración de Riesgos Laborales ARL por causa exclusiva de un accidente de trabajo una enfermedad profesional) Accidentes Personales AP Educativo Generación Positiva AP Colectivos APCorto Plazo AP Individual y demás Ramos de Seguros autorizados a Positiva encontrándose excluidos del presente contrato los servicios y todas aquellas actividades procedimientos e intervenciones que no tengan por objeto contribuir al diagnóstico tratamiento o rehabilitación de la patología derivada del siniestro o los servicios considerados como experimentales cosméticos y suntuarios."}]
["VICEPRESIDENCIA TÉCNICA","Gerencia Médica","NO","C66772022",85100000,"Prestación de servicios: El CONTRATISTA se obliga con POSITIVA a la prestación de los servicios de salud para los asegurados y o afiliados a POSITIVA que accedan a los servicios habilitados del CONTRATISTA en calidad de asegurados a los ramos Administración de Riesgos Laborales ARL por causa exclusiva de un accidente de trabajo una enfermedad profesional) Accidentes Personales AP Educativo Generación Positiva AP Colectivos APCorto Plazo AP Individual y demás Ramos de Seguros autorizados a Positiva encontrándose excluidos del presente contrato los servicios y todas aquellas actividades procedimientos e intervenciones que no tengan por objeto contribuir al diagnóstico tratamiento o rehabilitación de la patología derivada del siniestro o los servicios considerados como experimentales cosméticos y suntuarios.","2022-09-01",{"$f":"MONTH(G624)","v":9},"2024-09-01",{"$f":"(I624-G624)/30","v":24.366666666666667},"Invitación directa","CargoAReserva",0,0,"NO",null,"Gerencia de Abastecimiento Estratégico\ncontratacion@positiva.gov.co\nPBX: (1)6502200 Ext: 10641","SI","SI","NO","SI",{"$f":"IF(U624=\"SI\",\"Pública clasificada\",\"Pública\")","v":"Pública clasificada"},{"$f":"CONCATENATE(D624,\"-\",\"Tipo de información\",\" \",V624,\"-\",F624)","v":"C66772022-Tipo de información Pública clasificada-Prestación de servicios: El CONTRATISTA se obliga con POSITIVA a la prestación de los servicios de salud para los asegurados y o afiliados a POSITIVA que accedan a los servicios habilitados del CONTRATISTA en calidad de asegurados a los ramos Administración de Riesgos Laborales ARL por causa exclusiva de un accidente de trabajo una enfermedad profesional) Accidentes Personales AP Educativo Generación Positiva AP Colectivos APCorto Plazo AP Individual y demás Ramos de Seguros autorizados a Positiva encontrándose excluidos del presente contrato los servicios y todas aquellas actividades procedimientos e intervenciones que no tengan por objeto contribuir al diagnóstico tratamiento o rehabilitación de la patología derivada del siniestro o los servicios considerados como experimentales cosméticos y suntuarios."}]
["VICEPRESIDENCIA TÉCNICA","Gerencia Médica","NO","C66782022",85100000,"Prestación de servicios: El CONTRATISTA se obliga con POSITIVA a la prestación de los servicios de salud para los asegurados y o afiliados a POSITIVA que accedan a los servicios habilitados del CONTRATISTA en calidad de asegurados a los ramos Administración de Riesgos Laborales ARL por causa exclusiva de un accidente de trabajo una enfermedad profesional) Accidentes Personales AP Educativo Generación Positiva AP Colectivos APCorto Plazo AP Individual y demás Ramos de Seguros autorizados a Positiva encontrándose excluidos del presente contrato los servicios y todas aquellas actividades procedimientos e intervenciones que no tengan por objeto contribuir al diagnóstico tratamiento o rehabilitación de la patología derivada del siniestro o los servicios considerados como experimentales cosméticos y suntuarios.","2022-02-01",{"$f":"MONTH(G625)","v":2},"2027-02-01",{"$f":"(I625-G625)/30","v":60.866666666666667},"Invitación directa","CargoAReserva",0,0,"NO",null,"Gerencia de Abastecimiento Estratégico\ncontratacion@positiva.gov.co\nPBX: (1)6502200 Ext: 10641","SI","SI","NO","SI",{"$f":"IF(U625=\"SI\",\"Pública clasificada\",\"Pública\")","v":"Pública clasificada"},{"$f":"CONCATENATE(D625,\"-\",\"Tipo de información\",\" \",V625,\"-\",F625)","v":"C66782022-Tipo de información Pública clasificada-Prestación de servicios: El CONTRATISTA se obliga con POSITIVA a la prestación de los servicios de salud para los asegurados y o afiliados a POSITIVA que accedan a los servicios habilitados del CONTRATISTA en calidad de asegurados a los ramos Administración de Riesgos Laborales ARL por causa exclusiva de un accidente de trabajo una enfermedad profesional) Accidentes Personales AP Educativo Generación Positiva AP Colectivos APCorto Plazo AP Individual y demás Ramos de Seguros autorizados a Positiva encontrándose excluidos del presente contrato los servicios y todas aquellas actividades procedimientos e intervenciones que no tengan por objeto contribuir al diagnóstico tratamiento o rehabilitación de la patología derivada del siniestro o los servicios considerados como experimentales cosméticos y suntuarios."}]
["VICEPRESIDENCIA TÉCNICA","Gerencia Médica","NO","C66792022",85100000,"Prestación de servicios: El CONTRATISTA se obliga con POSITIVA a la prestación de los servicios de salud para los asegurados y o afiliados a POSITIVA que accedan a los servicios habilitados del CONTRATISTA en calidad de asegurados a los ramos Administración de Riesgos Laborales ARL por causa exclusiva de un accidente de trabajo una enfermedad profesional) Accidentes Personales AP Educativo Generación Positiva AP Colectivos APCorto Plazo AP Individual y demás Ramos de Seguros autorizados a Positiva encontrándose excluidos del presente contrato los servicios y todas aquellas actividades procedimientos e intervenciones que no tengan por objeto contribuir al diagnóstico tratamiento o rehabilitación de la patología derivada del siniestro o los servicios considerados como experimentales cosméticos y suntuarios.","2022-03-01",{"$f":"MONTH(G626)","v":3},"2027-03-01",{"$f":"(I626-G626)/30","v":60.866666666666667},"Invitación directa","CargoAReserva",0,0,"NO",null,"Gerencia de Abastecimiento Estratégico\ncontratacion@positiva.gov.co\nPBX: (1)6502200 Ext: 10641","SI","SI","NO","SI",{"$f":"IF(U626=\"SI\",\"Pública clasificada\",\"Pública\")","v":"Pública clasificada"},{"$f":"CONCATENATE(D626,\"-\",\"Tipo de información\",\" \",V626,\"-\",F626)","v":"C66792022-Tipo de información Pública clasificada-Prestación de servicios: El CONTRATISTA se obliga con POSITIVA a la prestación de los servicios de salud para los asegurados y o afiliados a POSITIVA que accedan a los servicios habilitados del CONTRATISTA en calidad de asegurados a los ramos Administración de Riesgos Laborales ARL por causa exclusiva de un accidente de trabajo una enfermedad profesional) Accidentes Personales AP Educativo Generación Positiva AP Colectivos APCorto Plazo AP Individual y demás Ramos de Seguros autorizados a Positiva encontrándose excluidos del presente contrato los servicios y todas aquellas actividades procedimientos e intervenciones que no tengan por objeto contribuir al diagnóstico tratamiento o rehabilitación de la patología derivada del siniestro o los servicios considerados como experimentales cosméticos y suntuarios."}]
["VICEPRESIDENCIA TÉCNICA","Gerencia Médica","NO","C66802022",85100000,"Prestación de servicios: El CONTRATISTA se obliga con POSITIVA a la prestación de los servicios de salud para los asegurados y o afiliados a POSITIVA que accedan a los servicios habilitados del CONTRATISTA en calidad de asegurados a los ramos Administración de Riesgos Laborales ARL por causa exclusiva de un accidente de trabajo una enfermedad profesional) Accidentes Personales AP Educativo Generación Positiva AP Colectivos APCorto Plazo AP Individual y demás Ramos de Seguros autorizados a Positiva encontrándose excluidos del presente contrato los servicios y todas aquellas actividades procedimientos e intervenciones que no tengan por objeto contribuir al diagnóstico tratamiento o rehabilitación de la patología derivada del siniestro o los servicios considerados como experimentales cosméticos y suntuarios.","2022-04-01",{"$f":"MONTH(G627)","v":4},"2027-04-01",{"$f":"(I627-G627)/30","v":60.866666666666667},"Invitación directa","CargoAReserva",0,0,"NO",null,"Gerencia de Abastecimiento Estratégico\ncontratacion@positiva.gov.co\nPBX: (1)6502200 Ext: 10641","SI","SI","NO","SI",{"$f":"IF(U627=\"SI\",\"Pública clasificada\",\"Pública\")","v":"Pública clasificada"},{"$f":"CONCATENATE(D627,\"-\",\"Tipo de información\",\" \",V627,\"-\",F627)","v":"C66802022-Tipo de información Pública clasificada-Prestación de servicios: El CONTRATISTA se obliga con POSITIVA a la prestación de los servicios de salud para los asegurados y o afiliados a POSITIVA que accedan a los servicios habilitados del CONTRATISTA en calidad de asegurados a los ramos Administración de Riesgos Laborales ARL por causa exclusiva de un accidente de trabajo una enfermedad profesional) Accidentes Personales AP Educativo Generación Positiva AP Colectivos APCorto Plazo AP Individual y demás Ramos de Seguros autorizados a Positiva encontrándose excluidos del presente contrato los servicios y todas aquellas actividades procedimientos e intervenciones que no tengan por objeto contribuir al diagnóstico tratamiento o rehabilitación de la patología derivada del siniestro o los servicios considerados como experimentales cosméticos y suntuarios."}]
["VICEPRESIDENCIA TÉCNICA","Gerencia Médica","NO","C66812022",85100000,"Prestación de servicios: El CONTRATISTA se obliga con POSITIVA a la prestación de los servicios de salud para los asegurados y o afiliados a POSITIVA que accedan a los servicios habilitados del CONTRATISTA en calidad de asegurados a los ramos Administración de Riesgos Laborales ARL por causa exclusiva de un accidente de trabajo una enfermedad profesional) Accidentes Personales AP Educativo Generación Positiva AP Colectivos APCorto Plazo AP Individual y demás Ramos de Seguros autorizados a Positiva encontrándose excluidos del presente contrato los servicios y todas aquellas actividades procedimientos e intervenciones que no tengan por objeto contribuir al diagnóstico tratamiento o rehabilitación de la patología derivada del siniestro o los servicios considerados como experimentales cosméticos y suntuarios.","2022-10-01",{"$f":"MONTH(G628)","v":10},"2024-10-30",{"$f":"(I628-G628)/30","v":25.333333333333332},"Invitación directa","CargoAReserva",0,0,"NO",null,"Gerencia de Abastecimiento Estratégico\ncontratacion@positiva.gov.co\nPBX: (1)6502200 Ext: 10641","SI","SI","NO","SI",{"$f":"IF(U628=\"SI\",\"Pública clasificada\",\"Pública\")","v":"Pública clasificada"},{"$f":"CONCATENATE(D628,\"-\",\"Tipo de información\",\" \",V628,\"-\",F628)","v":"C66812022-Tipo de información Pública clasificada-Prestación de servicios: El CONTRATISTA se obliga con POSITIVA a la prestación de los servicios de salud para los asegurados y o afiliados a POSITIVA que accedan a los servicios habilitados del CONTRATISTA en calidad de asegurados a los ramos Administración de Riesgos Laborales ARL por causa exclusiva de un accidente de trabajo una enfermedad profesional) Accidentes Personales AP Educativo Generación Positiva AP Colectivos APCorto Plazo AP Individual y demás Ramos de Seguros autorizados a Positiva encontrándose excluidos del presente contrato los servicios y todas aquellas actividades procedimientos e intervenciones que no tengan por objeto contribuir al diagnóstico tratamiento o rehabilitación de la patología derivada del siniestro o los servicios considerados como experimentales cosméticos y suntuarios."}]
["VICEPRESIDENCIA TÉCNICA","Gerencia Médica","NO","C66832022",85100000,"Prestación de servicios: El CONTRATISTA se obliga con POSITIVA a la prestación de los servicios de salud para los asegurados y o afiliados a POSITIVA que accedan a los servicios habilitados del CONTRATISTA en calidad de asegurados a los ramos Administración de Riesgos Laborales ARL por causa exclusiva de un accidente de trabajo una enfermedad profesional) Accidentes Personales AP Educativo Generación Positiva AP Colectivos APCorto Plazo AP Individual y demás Ramos de Seguros autorizados a Positiva encontrándose excluidos del presente contrato los servicios y todas aquellas actividades procedimientos e intervenciones que no tengan por objeto contribuir al diagnóstico tratamiento o rehabilitación de la patología derivada del siniestro o los servicios considerados como experimentales cosméticos y suntuarios.","2022-09-20",{"$f":"MONTH(G629)","v":9},"2024-09-20",{"$f":"(I629-G629)/30","v":24.366666666666667},"Invitación directa","CargoAReserva",0,0,"NO",null,"Gerencia de Abastecimiento Estratégico\ncontratacion@positiva.gov.co\nPBX: (1)6502200 Ext: 10641","SI","SI","NO","SI",{"$f":"IF(U629=\"SI\",\"Pública clasificada\",\"Pública\")","v":"Pública clasificada"},{"$f":"CONCATENATE(D629,\"-\",\"Tipo de información\",\" \",V629,\"-\",F629)","v":"C66832022-Tipo de información Pública clasificada-Prestación de servicios: El CONTRATISTA se obliga con POSITIVA a la prestación de los servicios de salud para los asegurados y o afiliados a POSITIVA que accedan a los servicios habilitados del CONTRATISTA en calidad de asegurados a los ramos Administración de Riesgos Laborales ARL por causa exclusiva de un accidente de trabajo una enfermedad profesional) Accidentes Personales AP Educativo Generación Positiva AP Colectivos APCorto Plazo AP Individual y demás Ramos de Seguros autorizados a Positiva encontrándose excluidos del presente contrato los servicios y todas aquellas actividades procedimientos e intervenciones que no tengan por objeto contribuir al diagnóstico tratamiento o rehabilitación de la patología derivada del siniestro o los servicios considerados como experimentales cosméticos y suntuarios."}]
["VICEPRESIDENCIA TÉCNICA","Gerencia Médica","NO","C66842022",85100000,"Prestación de servicios: El CONTRATISTA se obliga con POSITIVA a la prestación de los servicios de salud para los asegurados y o afiliados a POSITIVA que accedan a los servicios habilitados del CONTRATISTA en calidad de asegurados a los ramos Administración de Riesgos Laborales ARL por causa exclusiva de un accidente de trabajo una enfermedad profesional) Accidentes Personales AP Educativo Generación Positiva AP Colectivos APCorto Plazo AP Individual y demás Ramos de Seguros autorizados a Positiva encontrándose excluidos del presente contrato los servicios y todas aquellas actividades procedimientos e intervenciones que no tengan por objeto contribuir al diagnóstico tratamiento o rehabilitación de la patología derivada del siniestro o los servicios considerados como experimentales cosméticos y suntuarios.","2022-10-01",{"$f":"MONTH(G630)","v":10},"2024-10-01",{"$f":"(I630-G630)/30","v":24.366666666666667},"Invitación directa","CargoAReserva",0,0,"NO",null,"Gerencia de Abastecimiento Estratégico\ncontratacion@positiva.gov.co\nPBX: (1)6502200 Ext: 10641","SI","SI","NO","SI",{"$f":"IF(U630=\"SI\",\"Pública clasificada\",\"Pública\")","v":"Pública clasificada"},{"$f":"CONCATENATE(D630,\"-\",\"Tipo de información\",\" \",V630,\"-\",F630)","v":"C66842022-Tipo de información Pública clasificada-Prestación de servicios: El CONTRATISTA se obliga con POSITIVA a la prestación de los servicios de salud para los asegurados y o afiliados a POSITIVA que accedan a los servicios habilitados del CONTRATISTA en calidad de asegurados a los ramos Administración de Riesgos Laborales ARL por causa exclusiva de un accidente de trabajo una enfermedad profesional) Accidentes Personales AP Educativo Generación Positiva AP Colectivos APCorto Plazo AP Individual y demás Ramos de Seguros autorizados a Positiva encontrándose excluidos del presente contrato los servicios y todas aquellas actividades procedimientos e intervenciones que no tengan por objeto contribuir al diagnóstico tratamiento o rehabilitación de la patología derivada del siniestro o los servicios considerados como experimentales cosméticos y suntuarios."}]
["VICEPRESIDENCIA TÉCNICA","Gerencia Médica","NO","C66862022",85100000,"Prestación de servicios: El CONTRATISTA se obliga con POSITIVA a la prestación de los servicios de salud para los asegurados y o afiliados a POSITIVA que accedan a los servicios habilitados del CONTRATISTA en calidad de asegurados a los ramos Administración de Riesgos Laborales ARL por causa exclusiva de un accidente de trabajo una enfermedad profesional) Accidentes Personales AP Educativo Generación Positiva AP Colectivos APCorto Plazo AP Individual y demás Ramos de Seguros autorizados a Positiva encontrándose excluidos del presente contrato los servicios y todas aquellas actividades procedimientos e intervenciones que no tengan por objeto contribuir al diagnóstico tratamiento o rehabilitación de la patología derivada del siniestro o los servicios considerados como experimentales cosméticos y suntuarios.","2022-08-29",{"$f":"MONTH(G631)","v":8},"2024-08-29",{"$f":"(I631-G631)/30","v":24.366666666666667},"Invitación directa","CargoAReserva",0,0,"NO",null,"Gerencia de Abastecimiento Estratégico\ncontratacion@positiva.gov.co\nPBX: (1)6502200 Ext: 10641","SI","SI","NO","SI",{"$f":"IF(U631=\"SI\",\"Pública clasificada\",\"Pública\")","v":"Pública clasificada"},{"$f":"CONCATENATE(D631,\"-\",\"Tipo de información\",\" \",V631,\"-\",F631)","v":"C66862022-Tipo de información Pública clasificada-Prestación de servicios: El CONTRATISTA se obliga con POSITIVA a la prestación de los servicios de salud para los asegurados y o afiliados a POSITIVA que accedan a los servicios habilitados del CONTRATISTA en calidad de asegurados a los ramos Administración de Riesgos Laborales ARL por causa exclusiva de un accidente de trabajo una enfermedad profesional) Accidentes Personales AP Educativo Generación Positiva AP Colectivos APCorto Plazo AP Individual y demás Ramos de Seguros autorizados a Positiva encontrándose excluidos del presente contrato los servicios y todas aquellas actividades procedimientos e intervenciones que no tengan por objeto contribuir al diagnóstico tratamiento o rehabilitación de la patología derivada del siniestro o los servicios considerados como experimentales cosméticos y suntuarios."}]
["VICEPRESIDENCIA TÉCNICA","Gerencia Médica","NO","C66872022",85100000,"Prestación de servicios: El CONTRATISTA se obliga con POSITIVA a la prestación de los servicios de salud para los asegurados y o afiliados a POSITIVA que accedan a los servicios habilitados del CONTRATISTA en calidad de asegurados a los ramos Administración de Riesgos Laborales ARL por causa exclusiva de un accidente de trabajo una enfermedad profesional) Accidentes Personales AP Educativo Generación Positiva AP Colectivos APCorto Plazo AP Individual y demás Ramos de Seguros autorizados a Positiva encontrándose excluidos del presente contrato los servicios y todas aquellas actividades procedimientos e intervenciones que no tengan por objeto contribuir al diagnóstico tratamiento o rehabilitación de la patología derivada del siniestro o los servicios considerados como experimentales cosméticos y suntuarios.","2022-08-29",{"$f":"MONTH(G632)","v":8},"2024-08-29",{"$f":"(I632-G632)/30","v":24.366666666666667},"Invitación directa","CargoAReserva",0,0,"NO",null,"Gerencia de Abastecimiento Estratégico\ncontratacion@positiva.gov.co\nPBX: (1)6502200 Ext: 10641","SI","SI","NO","SI",{"$f":"IF(U632=\"SI\",\"Pública clasificada\",\"Pública\")","v":"Pública clasificada"},{"$f":"CONCATENATE(D632,\"-\",\"Tipo de información\",\" \",V632,\"-\",F632)","v":"C66872022-Tipo de información Pública clasificada-Prestación de servicios: El CONTRATISTA se obliga con POSITIVA a la prestación de los servicios de salud para los asegurados y o afiliados a POSITIVA que accedan a los servicios habilitados del CONTRATISTA en calidad de asegurados a los ramos Administración de Riesgos Laborales ARL por causa exclusiva de un accidente de trabajo una enfermedad profesional) Accidentes Personales AP Educativo Generación Positiva AP Colectivos APCorto Plazo AP Individual y demás Ramos de Seguros autorizados a Positiva encontrándose excluidos del presente contrato los servicios y todas aquellas actividades procedimientos e intervenciones que no tengan por objeto contribuir al diagnóstico tratamiento o rehabilitación de la patología derivada del siniestro o los servicios considerados como experimentales cosméticos y suntuarios."}]
["VICEPRESIDENCIA TÉCNICA","Gerencia Médica","NO","C66882022",85100000,"Prestación de servicios: El CONTRATISTA se obliga con POSITIVA a la prestación de los servicios de salud para los asegurados y o afiliados a POSITIVA que accedan a los servicios habilitados del CONTRATISTA en calidad de asegurados a los ramos Administración de Riesgos Laborales ARL por causa exclusiva de un accidente de trabajo una enfermedad profesional) Accidentes Personales AP Educativo Generación Positiva AP Colectivos APCorto Plazo AP Individual y demás Ramos de Seguros autorizados a Positiva encontrándose excluidos del presente contrato los servicios y todas aquellas actividades procedimientos e intervenciones que no tengan por objeto contribuir al diagnóstico tratamiento o rehabilitación de la patología derivada del siniestro o los servicios considerados como experimentales cosméticos y suntuarios.","2022-02-01",{"$f":"MONTH(G633)","v":2},"2024-02-01",{"$f":"(I633-G633)/30","v":24.333333333333332},"Invitación directa","CargoAReserva",0,0,"NO",null,"Gerencia de Abastecimiento Estratégico\ncontratacion@positiva.gov.co\nPBX: (1)6502200 Ext: 10641","SI","SI","NO","SI",{"$f":"IF(U633=\"SI\",\"Pública clasificada\",\"Pública\")","v":"Pública clasificada"},{"$f":"CONCATENATE(D633,\"-\",\"Tipo de información\",\" \",V633,\"-\",F633)","v":"C66882022-Tipo de información Pública clasificada-Prestación de servicios: El CONTRATISTA se obliga con POSITIVA a la prestación de los servicios de salud para los asegurados y o afiliados a POSITIVA que accedan a los servicios habilitados del CONTRATISTA en calidad de asegurados a los ramos Administración de Riesgos Laborales ARL por causa exclusiva de un accidente de trabajo una enfermedad profesional) Accidentes Personales AP Educativo Generación Positiva AP Colectivos APCorto Plazo AP Individual y demás Ramos de Seguros autorizados a Positiva encontrándose excluidos del presente contrato los servicios y todas aquellas actividades procedimientos e intervenciones que no tengan por objeto contribuir al diagnóstico tratamiento o rehabilitación de la patología derivada del siniestro o los servicios considerados como experimentales cosméticos y suntuarios."}]
["VICEPRESIDENCIA TÉCNICA","Gerencia Médica","NO","C66892022",85100000,"Prestación de servicios: El CONTRATISTA se obliga con POSITIVA a la prestación de los servicios de salud para los asegurados y o afiliados a POSITIVA que accedan a los servicios habilitados del CONTRATISTA en calidad de asegurados a los ramos Administración de Riesgos Laborales ARL por causa exclusiva de un accidente de trabajo una enfermedad profesional) Accidentes Personales AP Educativo Generación Positiva AP Colectivos APCorto Plazo AP Individual y demás Ramos de Seguros autorizados a Positiva encontrándose excluidos del presente contrato los servicios y todas aquellas actividades procedimientos e intervenciones que no tengan por objeto contribuir al diagnóstico tratamiento o rehabilitación de la patología derivada del siniestro o los servicios considerados como experimentales cosméticos y suntuarios.","2022-03-01",{"$f":"MONTH(G634)","v":3},"2024-03-01",{"$f":"(I634-G634)/30","v":24.366666666666667},"Invitación directa","CargoAReserva",0,0,"NO",null,"Gerencia de Abastecimiento Estratégico\ncontratacion@positiva.gov.co\nPBX: (1)6502200 Ext: 10641","SI","SI","NO","SI",{"$f":"IF(U634=\"SI\",\"Pública clasificada\",\"Pública\")","v":"Pública clasificada"},{"$f":"CONCATENATE(D634,\"-\",\"Tipo de información\",\" \",V634,\"-\",F634)","v":"C66892022-Tipo de información Pública clasificada-Prestación de servicios: El CONTRATISTA se obliga con POSITIVA a la prestación de los servicios de salud para los asegurados y o afiliados a POSITIVA que accedan a los servicios habilitados del CONTRATISTA en calidad de asegurados a los ramos Administración de Riesgos Laborales ARL por causa exclusiva de un accidente de trabajo una enfermedad profesional) Accidentes Personales AP Educativo Generación Positiva AP Colectivos APCorto Plazo AP Individual y demás Ramos de Seguros autorizados a Positiva encontrándose excluidos del presente contrato los servicios y todas aquellas actividades procedimientos e intervenciones que no tengan por objeto contribuir al diagnóstico tratamiento o rehabilitación de la patología derivada del siniestro o los servicios considerados como experimentales cosméticos y suntuarios."}]
["VICEPRESIDENCIA TÉCNICA","Gerencia Médica","NO","C66902022",85100000,"Prestación de servicios: El CONTRATISTA se obliga con POSITIVA a la prestación de los servicios de salud para los asegurados y o afiliados a POSITIVA que accedan a los servicios habilitados del CONTRATISTA en calidad de asegurados a los ramos Administración de Riesgos Laborales ARL por causa exclusiva de un accidente de trabajo una enfermedad profesional) Accidentes Personales AP Educativo Generación Positiva AP Colectivos APCorto Plazo AP Individual y demás Ramos de Seguros autorizados a Positiva encontrándose excluidos del presente contrato los servicios y todas aquellas actividades procedimientos e intervenciones que no tengan por objeto contribuir al diagnóstico tratamiento o rehabilitación de la patología derivada del siniestro o los servicios considerados como experimentales cosméticos y suntuarios.","2022-04-01",{"$f":"MONTH(G635)","v":4},"2024-04-01",{"$f":"(I635-G635)/30","v":24.366666666666667},"Invitación directa","CargoAReserva",0,0,"NO",null,"Gerencia de Abastecimiento Estratégico\ncontratacion@positiva.gov.co\nPBX: (1)6502200 Ext: 10641","SI","SI","NO","SI",{"$f":"IF(U635=\"SI\",\"Pública clasificada\",\"Pública\")","v":"Pública clasificada"},{"$f":"CONCATENATE(D635,\"-\",\"Tipo de información\",\" \",V635,\"-\",F635)","v":"C66902022-Tipo de información Pública clasificada-Prestación de servicios: El CONTRATISTA se obliga con POSITIVA a la prestación de los servicios de salud para los asegurados y o afiliados a POSITIVA que accedan a los servicios habilitados del CONTRATISTA en calidad de asegurados a los ramos Administración de Riesgos Laborales ARL por causa exclusiva de un accidente de trabajo una enfermedad profesional) Accidentes Personales AP Educativo Generación Positiva AP Colectivos APCorto Plazo AP Individual y demás Ramos de Seguros autorizados a Positiva encontrándose excluidos del presente contrato los servicios y todas aquellas actividades procedimientos e intervenciones que no tengan por objeto contribuir al diagnóstico tratamiento o rehabilitación de la patología derivada del siniestro o los servicios considerados como experimentales cosméticos y suntuarios."}]
["VICEPRESIDENCIA TÉCNICA","Gerencia Médica","NO","C66912022",85100000,"Prestación de servicios: El CONTRATISTA se obliga con POSITIVA a la prestación de los servicios de salud para los asegurados y o afiliados a POSITIVA que accedan a los servicios habilitados del CONTRATISTA en calidad de asegurados a los ramos Administración de Riesgos Laborales ARL por causa exclusiva de un accidente de trabajo una enfermedad profesional) Accidentes Personales AP Educativo Generación Positiva AP Colectivos APCorto Plazo AP Individual y demás Ramos de Seguros autorizados a Positiva encontrándose excluidos del presente contrato los servicios y todas aquellas actividades procedimientos e intervenciones que no tengan por objeto contribuir al diagnóstico tratamiento o rehabilitación de la patología derivada del siniestro o los servicios considerados como experimentales cosméticos y suntuarios.","2022-10-01",{"$f":"MONTH(G636)","v":10},"2024-10-30",{"$f":"(I636-G636)/30","v":25.333333333333332},"Invitación directa","CargoAReserva",0,0,"NO",null,"Gerencia de Abastecimiento Estratégico\ncontratacion@positiva.gov.co\nPBX: (1)6502200 Ext: 10641","SI","SI","NO","SI",{"$f":"IF(U636=\"SI\",\"Pública clasificada\",\"Pública\")","v":"Pública clasificada"},{"$f":"CONCATENATE(D636,\"-\",\"Tipo de información\",\" \",V636,\"-\",F636)","v":"C66912022-Tipo de información Pública clasificada-Prestación de servicios: El CONTRATISTA se obliga con POSITIVA a la prestación de los servicios de salud para los asegurados y o afiliados a POSITIVA que accedan a los servicios habilitados del CONTRATISTA en calidad de asegurados a los ramos Administración de Riesgos Laborales ARL por causa exclusiva de un accidente de trabajo una enfermedad profesional) Accidentes Personales AP Educativo Generación Positiva AP Colectivos APCorto Plazo AP Individual y demás Ramos de Seguros autorizados a Positiva encontrándose excluidos del presente contrato los servicios y todas aquellas actividades procedimientos e intervenciones que no tengan por objeto contribuir al diagnóstico tratamiento o rehabilitación de la patología derivada del siniestro o los servicios considerados como experimentales cosméticos y suntuarios."}]
["VICEPRESIDENCIA TÉCNICA","Gerencia Médica","NO","C66922022",85100000,"Prestación de servicios: El CONTRATISTA se obliga con POSITIVA a la prestación de los servicios de salud para los asegurados y o afiliados a POSITIVA que accedan a los servicios habilitados del CONTRATISTA en calidad de asegurados a los ramos Administración de Riesgos Laborales ARL por causa exclusiva de un accidente de trabajo una enfermedad profesional) Accidentes Personales AP Educativo Generación Positiva AP Colectivos APCorto Plazo AP Individual y demás Ramos de Seguros autorizados a Positiva encontrándose excluidos del presente contrato los servicios y todas aquellas actividades procedimientos e intervenciones que no tengan por objeto contribuir al diagnóstico tratamiento o rehabilitación de la patología derivada del siniestro o los servicios considerados como experimentales cosméticos y suntuarios.","2022-02-01",{"$f":"MONTH(G637)","v":2},"2024-02-01",{"$f":"(I637-G637)/30","v":24.333333333333332},"Invitación directa","CargoAReserva",0,0,"NO",null,"Gerencia de Abastecimiento Estratégico\ncontratacion@positiva.gov.co\nPBX: (1)6502200 Ext: 10641","SI","SI","NO","SI",{"$f":"IF(U637=\"SI\",\"Pública clasificada\",\"Pública\")","v":"Pública clasificada"},{"$f":"CONCATENATE(D637,\"-\",\"Tipo de información\",\" \",V637,\"-\",F637)","v":"C66922022-Tipo de información Pública clasificada-Prestación de servicios: El CONTRATISTA se obliga con POSITIVA a la prestación de los servicios de salud para los asegurados y o afiliados a POSITIVA que accedan a los servicios habilitados del CONTRATISTA en calidad de asegurados a los ramos Administración de Riesgos Laborales ARL por causa exclusiva de un accidente de trabajo una enfermedad profesional) Accidentes Personales AP Educativo Generación Positiva AP Colectivos APCorto Plazo AP Individual y demás Ramos de Seguros autorizados a Positiva encontrándose excluidos del presente contrato los servicios y todas aquellas actividades procedimientos e intervenciones que no tengan por objeto contribuir al diagnóstico tratamiento o rehabilitación de la patología derivada del siniestro o los servicios considerados como experimentales cosméticos y suntuarios."}]
["VICEPRESIDENCIA TÉCNICA","Gerencia Médica","NO","C66932022",85100000,"Prestación de servicios: El CONTRATISTA se obliga con POSITIVA a la prestación de los servicios de salud para los asegurados y o afiliados a POSITIVA que accedan a los servicios habilitados del CONTRATISTA en calidad de asegurados a los ramos Administración de Riesgos Laborales ARL por causa exclusiva de un accidente de trabajo una enfermedad profesional) Accidentes Personales AP Educativo Generación Positiva AP Colectivos APCorto Plazo AP Individual y demás Ramos de Seguros autorizados a Positiva encontrándose excluidos del presente contrato los servicios y todas aquellas actividades procedimientos e intervenciones que no tengan por objeto contribuir al diagnóstico tratamiento o rehabilitación de la patología derivada del siniestro o los servicios considerados como experimentales cosméticos y suntuarios.","2022-02-01",{"$f":"MONTH(G638)","v":2},"2024-02-01",{"$f":"(I638-G638)/30","v":24.333333333333332},"Invitación directa","CargoAReserva",0,0,"NO",null,"Gerencia de Abastecimiento Estratégico\ncontratacion@positiva.gov.co\nPBX: (1)6502200 Ext: 10641","SI","SI","NO","SI",{"$f":"IF(U638=\"SI\",\"Pública clasificada\",\"Pública\")","v":"Pública clasificada"},{"$f":"CONCATENATE(D638,\"-\",\"Tipo de información\",\" \",V638,\"-\",F638)","v":"C66932022-Tipo de información Pública clasificada-Prestación de servicios: El CONTRATISTA se obliga con POSITIVA a la prestación de los servicios de salud para los asegurados y o afiliados a POSITIVA que accedan a los servicios habilitados del CONTRATISTA en calidad de asegurados a los ramos Administración de Riesgos Laborales ARL por causa exclusiva de un accidente de trabajo una enfermedad profesional) Accidentes Personales AP Educativo Generación Positiva AP Colectivos APCorto Plazo AP Individual y demás Ramos de Seguros autorizados a Positiva encontrándose excluidos del presente contrato los servicios y todas aquellas actividades procedimientos e intervenciones que no tengan por objeto contribuir al diagnóstico tratamiento o rehabilitación de la patología derivada del siniestro o los servicios considerados como experimentales cosméticos y suntuarios."}]
["VICEPRESIDENCIA TÉCNICA","Gerencia Médica","NO","C66942022",85100000,"Prestación de servicios: El CONTRATISTA se obliga con POSITIVA a la prestación de los servicios de salud para los asegurados y o afiliados a POSITIVA que accedan a los servicios habilitados del CONTRATISTA en calidad de asegurados a los ramos Administración de Riesgos Laborales ARL por causa exclusiva de un accidente de trabajo una enfermedad profesional) Accidentes Personales AP Educativo Generación Positiva AP Colectivos APCorto Plazo AP Individual y demás Ramos de Seguros autorizados a Positiva encontrándose excluidos del presente contrato los servicios y todas aquellas actividades procedimientos e intervenciones que no tengan por objeto contribuir al diagnóstico tratamiento o rehabilitación de la patología derivada del siniestro o los servicios considerados como experimentales cosméticos y suntuarios.","2022-02-01",{"$f":"MONTH(G639)","v":2},"2024-02-01",{"$f":"(I639-G639)/30","v":24.333333333333332},"Invitación directa","CargoAReserva",0,0,"NO",null,"Gerencia de Abastecimiento Estratégico\ncontratacion@positiva.gov.co\nPBX: (1)6502200 Ext: 10641","SI","SI","NO","SI",{"$f":"IF(U639=\"SI\",\"Pública clasificada\",\"Pública\")","v":"Pública clasificada"},{"$f":"CONCATENATE(D639,\"-\",\"Tipo de información\",\" \",V639,\"-\",F639)","v":"C66942022-Tipo de información Pública clasificada-Prestación de servicios: El CONTRATISTA se obliga con POSITIVA a la prestación de los servicios de salud para los asegurados y o afiliados a POSITIVA que accedan a los servicios habilitados del CONTRATISTA en calidad de asegurados a los ramos Administración de Riesgos Laborales ARL por causa exclusiva de un accidente de trabajo una enfermedad profesional) Accidentes Personales AP Educativo Generación Positiva AP Colectivos APCorto Plazo AP Individual y demás Ramos de Seguros autorizados a Positiva encontrándose excluidos del presente contrato los servicios y todas aquellas actividades procedimientos e intervenciones que no tengan por objeto contribuir al diagnóstico tratamiento o rehabilitación de la patología derivada del siniestro o los servicios considerados como experimentales cosméticos y suntuarios."}]
["VICEPRESIDENCIA TÉCNICA","Gerencia Médica","NO","C66952022",85100000,"Prestación de servicios: El CONTRATISTA se obliga con POSITIVA a la prestación de los servicios de salud para los asegurados y o afiliados a POSITIVA que accedan a los servicios habilitados del CONTRATISTA en calidad de asegurados a los ramos Administración de Riesgos Laborales ARL por causa exclusiva de un accidente de trabajo una enfermedad profesional) Accidentes Personales AP Educativo Generación Positiva AP Colectivos APCorto Plazo AP Individual y demás Ramos de Seguros autorizados a Positiva encontrándose excluidos del presente contrato los servicios y todas aquellas actividades procedimientos e intervenciones que no tengan por objeto contribuir al diagnóstico tratamiento o rehabilitación de la patología derivada del siniestro o los servicios considerados como experimentales cosméticos y suntuarios.","2022-02-01",{"$f":"MONTH(G640)","v":2},"2024-02-01",{"$f":"(I640-G640)/30","v":24.333333333333332},"Invitación directa","CargoAReserva",0,0,"NO",null,"Gerencia de Abastecimiento Estratégico\ncontratacion@positiva.gov.co\nPBX: (1)6502200 Ext: 10641","SI","SI","NO","SI",{"$f":"IF(U640=\"SI\",\"Pública clasificada\",\"Pública\")","v":"Pública clasificada"},{"$f":"CONCATENATE(D640,\"-\",\"Tipo de información\",\" \",V640,\"-\",F640)","v":"C66952022-Tipo de información Pública clasificada-Prestación de servicios: El CONTRATISTA se obliga con POSITIVA a la prestación de los servicios de salud para los asegurados y o afiliados a POSITIVA que accedan a los servicios habilitados del CONTRATISTA en calidad de asegurados a los ramos Administración de Riesgos Laborales ARL por causa exclusiva de un accidente de trabajo una enfermedad profesional) Accidentes Personales AP Educativo Generación Positiva AP Colectivos APCorto Plazo AP Individual y demás Ramos de Seguros autorizados a Positiva encontrándose excluidos del presente contrato los servicios y todas aquellas actividades procedimientos e intervenciones que no tengan por objeto contribuir al diagnóstico tratamiento o rehabilitación de la patología derivada del siniestro o los servicios considerados como experimentales cosméticos y suntuarios."}]
["VICEPRESIDENCIA TÉCNICA","Gerencia Médica","NO","C66962022",85100000,"Prestación de servicios: El CONTRATISTA se obliga con POSITIVA a la prestación de los servicios de salud para los asegurados y o afiliados a POSITIVA que accedan a los servicios habilitados del CONTRATISTA en calidad de asegurados a los ramos Administración de Riesgos Laborales ARL por causa exclusiva de un accidente de trabajo una enfermedad profesional) Accidentes Personales AP Educativo Generación Positiva AP Colectivos APCorto Plazo AP Individual y demás Ramos de Seguros autorizados a Positiva encontrándose excluidos del presente contrato los servicios y todas aquellas actividades procedimientos e intervenciones que no tengan por objeto contribuir al diagnóstico tratamiento o rehabilitación de la patología derivada del siniestro o los servicios considerados como experimentales cosméticos y suntuarios.","2022-02-01",{"$f":"MONTH(G641)","v":2},"2024-02-01",{"$f":"(I641-G641)/30","v":24.333333333333332},"Invitación directa","CargoAReserva",0,0,"NO",null,"Gerencia de Abastecimiento Estratégico\ncontratacion@positiva.gov.co\nPBX: (1)6502200 Ext: 10641","SI","SI","NO","SI",{"$f":"IF(U641=\"SI\",\"Pública clasificada\",\"Pública\")","v":"Pública clasificada"},{"$f":"CONCATENATE(D641,\"-\",\"Tipo de información\",\" \",V641,\"-\",F641)","v":"C66962022-Tipo de información Pública clasificada-Prestación de servicios: El CONTRATISTA se obliga con POSITIVA a la prestación de los servicios de salud para los asegurados y o afiliados a POSITIVA que accedan a los servicios habilitados del CONTRATISTA en calidad de asegurados a los ramos Administración de Riesgos Laborales ARL por causa exclusiva de un accidente de trabajo una enfermedad profesional) Accidentes Personales AP Educativo Generación Positiva AP Colectivos APCorto Plazo AP Individual y demás Ramos de Seguros autorizados a Positiva encontrándose excluidos del presente contrato los servicios y todas aquellas actividades procedimientos e intervenciones que no tengan por objeto contribuir al diagnóstico tratamiento o rehabilitación de la patología derivada del siniestro o los servicios considerados como experimentales cosméticos y suntuarios."}]
["VICEPRESIDENCIA TÉCNICA","Gerencia Médica","NO","C66972022",85100000,"Prestación de servicios: El CONTRATISTA se obliga con POSITIVA a la prestación de los servicios de salud para los asegurados y o afiliados a POSITIVA que accedan a los servicios habilitados del CONTRATISTA en calidad de asegurados a los ramos Administración de Riesgos Laborales ARL por causa exclusiva de un accidente de trabajo una enfermedad profesional) Accidentes Personales AP Educativo Generación Positiva AP Colectivos APCorto Plazo AP Individual y demás Ramos de Seguros autorizados a Positiva encontrándose excluidos del presente contrato los servicios y todas aquellas actividades procedimientos e intervenciones que no tengan por objeto contribuir al diagnóstico tratamiento o rehabilitación de la patología derivada del siniestro o los servicios considerados como experimentales cosméticos y suntuarios.","2022-06-15",{"$f":"MONTH(G642)","v":6},"2024-06-15",{"$f":"(I642-G642)/30","v":24.366666666666667},"Invitación directa","CargoAReserva",0,0,"NO",null,"Gerencia de Abastecimiento Estratégico\ncontratacion@positiva.gov.co\nPBX: (1)6502200 Ext: 10641","SI","SI","NO","SI",{"$f":"IF(U642=\"SI\",\"Pública clasificada\",\"Pública\")","v":"Pública clasificada"},{"$f":"CONCATENATE(D642,\"-\",\"Tipo de información\",\" \",V642,\"-\",F642)","v":"C66972022-Tipo de información Pública clasificada-Prestación de servicios: El CONTRATISTA se obliga con POSITIVA a la prestación de los servicios de salud para los asegurados y o afiliados a POSITIVA que accedan a los servicios habilitados del CONTRATISTA en calidad de asegurados a los ramos Administración de Riesgos Laborales ARL por causa exclusiva de un accidente de trabajo una enfermedad profesional) Accidentes Personales AP Educativo Generación Positiva AP Colectivos APCorto Plazo AP Individual y demás Ramos de Seguros autorizados a Positiva encontrándose excluidos del presente contrato los servicios y todas aquellas actividades procedimientos e intervenciones que no tengan por objeto contribuir al diagnóstico tratamiento o rehabilitación de la patología derivada del siniestro o los servicios considerados como experimentales cosméticos y suntuarios."}]
["VICEPRESIDENCIA TÉCNICA","Gerencia Médica","NO","C66982022",85100000,"Prestación de servicios: El CONTRATISTA se obliga con POSITIVA a la prestación de los servicios de salud para los asegurados y o afiliados a POSITIVA que accedan a los servicios habilitados del CONTRATISTA en calidad de asegurados a los ramos Administración de Riesgos Laborales ARL por causa exclusiva de un accidente de trabajo una enfermedad profesional) Accidentes Personales AP Educativo Generación Positiva AP Colectivos APCorto Plazo AP Individual y demás Ramos de Seguros autorizados a Positiva encontrándose excluidos del presente contrato los servicios y todas aquellas actividades procedimientos e intervenciones que no tengan por objeto contribuir al diagnóstico tratamiento o rehabilitación de la patología derivada del siniestro o los servicios considerados como experimentales cosméticos y suntuarios.","2022-09-20",{"$f":"MONTH(G643)","v":9},"2024-09-20",{"$f":"(I643-G643)/30","v":24.366666666666667},"Invitación directa","CargoAReserva",0,0,"NO",null,"Gerencia de Abastecimiento Estratégico\ncontratacion@positiva.gov.co\nPBX: (1)6502200 Ext: 10641","SI","SI","NO","SI",{"$f":"IF(U643=\"SI\",\"Pública clasificada\",\"Pública\")","v":"Pública clasificada"},{"$f":"CONCATENATE(D643,\"-\",\"Tipo de información\",\" \",V643,\"-\",F643)","v":"C66982022-Tipo de información Pública clasificada-Prestación de servicios: El CONTRATISTA se obliga con POSITIVA a la prestación de los servicios de salud para los asegurados y o afiliados a POSITIVA que accedan a los servicios habilitados del CONTRATISTA en calidad de asegurados a los ramos Administración de Riesgos Laborales ARL por causa exclusiva de un accidente de trabajo una enfermedad profesional) Accidentes Personales AP Educativo Generación Positiva AP Colectivos APCorto Plazo AP Individual y demás Ramos de Seguros autorizados a Positiva encontrándose excluidos del presente contrato los servicios y todas aquellas actividades procedimientos e intervenciones que no tengan por objeto contribuir al diagnóstico tratamiento o rehabilitación de la patología derivada del siniestro o los servicios considerados como experimentales cosméticos y suntuarios."}]
["VICEPRESIDENCIA TÉCNICA","Gerencia Médica","NO","C66992022",85100000,"Prestación de servicios: El CONTRATISTA se obliga con POSITIVA a la prestación de los servicios de salud para los asegurados y o afiliados a POSITIVA que accedan a los servicios habilitados del CONTRATISTA en calidad de asegurados a los ramos Administración de Riesgos Laborales ARL por causa exclusiva de un accidente de trabajo una enfermedad profesional) Accidentes Personales AP Educativo Generación Positiva AP Colectivos APCorto Plazo AP Individual y demás Ramos de Seguros autorizados a Positiva encontrándose excluidos del presente contrato los servicios y todas aquellas actividades procedimientos e intervenciones que no tengan por objeto contribuir al diagnóstico tratamiento o rehabilitación de la patología derivada del siniestro o los servicios considerados como experimentales cosméticos y suntuarios.","2022-12-27",{"$f":"MONTH(G644)","v":12},"2024-12-27",{"$f":"(I644-G644)/30","v":24.366666666666667},"Invitación directa","CargoAReserva",0,0,"NO",null,"Gerencia de Abastecimiento Estratégico\ncontratacion@positiva.gov.co\nPBX: (1)6502200 Ext: 10641","SI","SI","NO","SI",{"$f":"IF(U644=\"SI\",\"Pública clasificada\",\"Pública\")","v":"Pública clasificada"},{"$f":"CONCATENATE(D644,\"-\",\"Tipo de información\",\" \",V644,\"-\",F644)","v":"C66992022-Tipo de información Pública clasificada-Prestación de servicios: El CONTRATISTA se obliga con POSITIVA a la prestación de los servicios de salud para los asegurados y o afiliados a POSITIVA que accedan a los servicios habilitados del CONTRATISTA en calidad de asegurados a los ramos Administración de Riesgos Laborales ARL por causa exclusiva de un accidente de trabajo una enfermedad profesional) Accidentes Personales AP Educativo Generación Positiva AP Colectivos APCorto Plazo AP Individual y demás Ramos de Seguros autorizados a Positiva encontrándose excluidos del presente contrato los servicios y todas aquellas actividades procedimientos e intervenciones que no tengan por objeto contribuir al diagnóstico tratamiento o rehabilitación de la patología derivada del siniestro o los servicios considerados como experimentales cosméticos y suntuarios."}]
["VICEPRESIDENCIA TÉCNICA","Gerencia Médica","NO","C67002022",85100000,"Prestación de servicios: El CONTRATISTA se obliga con POSITIVA a la prestación de los servicios de salud para los asegurados y o afiliados a POSITIVA que accedan a los servicios habilitados del CONTRATISTA en calidad de asegurados a los ramos Administración de Riesgos Laborales ARL por causa exclusiva de un accidente de trabajo una enfermedad profesional) Accidentes Personales AP Educativo Generación Positiva AP Colectivos APCorto Plazo AP Individual y demás Ramos de Seguros autorizados a Positiva encontrándose excluidos del presente contrato los servicios y todas aquellas actividades procedimientos e intervenciones que no tengan por objeto contribuir al diagnóstico tratamiento o rehabilitación de la patología derivada del siniestro o los servicios considerados como experimentales cosméticos y suntuarios.","2022-03-15",{"$f":"MONTH(G645)","v":3},"2024-03-15",{"$f":"(I645-G645)/30","v":24.366666666666667},"Invitación directa","CargoAReserva",0,0,"NO",null,"Gerencia de Abastecimiento Estratégico\ncontratacion@positiva.gov.co\nPBX: (1)6502200 Ext: 10641","SI","SI","NO","SI",{"$f":"IF(U645=\"SI\",\"Pública clasificada\",\"Pública\")","v":"Pública clasificada"},{"$f":"CONCATENATE(D645,\"-\",\"Tipo de información\",\" \",V645,\"-\",F645)","v":"C67002022-Tipo de información Pública clasificada-Prestación de servicios: El CONTRATISTA se obliga con POSITIVA a la prestación de los servicios de salud para los asegurados y o afiliados a POSITIVA que accedan a los servicios habilitados del CONTRATISTA en calidad de asegurados a los ramos Administración de Riesgos Laborales ARL por causa exclusiva de un accidente de trabajo una enfermedad profesional) Accidentes Personales AP Educativo Generación Positiva AP Colectivos APCorto Plazo AP Individual y demás Ramos de Seguros autorizados a Positiva encontrándose excluidos del presente contrato los servicios y todas aquellas actividades procedimientos e intervenciones que no tengan por objeto contribuir al diagnóstico tratamiento o rehabilitación de la patología derivada del siniestro o los servicios considerados como experimentales cosméticos y suntuarios."}]
["VICEPRESIDENCIA TÉCNICA","Gerencia Médica","NO","C67012022",85100000,"Prestación de servicios: El CONTRATISTA se obliga con POSITIVA a la prestación de los servicios de salud para los asegurados y o afiliados a POSITIVA que accedan a los servicios habilitados del CONTRATISTA en calidad de asegurados a los ramos Administración de Riesgos Laborales ARL por causa exclusiva de un accidente de trabajo una enfermedad profesional) Accidentes Personales AP Educativo Generación Positiva AP Colectivos APCorto Plazo AP Individual y demás Ramos de Seguros autorizados a Positiva encontrándose excluidos del presente contrato los servicios y todas aquellas actividades procedimientos e intervenciones que no tengan por objeto contribuir al diagnóstico tratamiento o rehabilitación de la patología derivada del siniestro o los servicios considerados como experimentales cosméticos y suntuarios.","2022-04-21",{"$f":"MONTH(G646)","v":4},"2024-04-21",{"$f":"(I646-G646)/30","v":24.366666666666667},"Invitación directa","CargoAReserva",0,0,"NO",null,"Gerencia de Abastecimiento Estratégico\ncontratacion@positiva.gov.co\nPBX: (1)6502200 Ext: 10641","SI","SI","NO","SI",{"$f":"IF(U646=\"SI\",\"Pública clasificada\",\"Pública\")","v":"Pública clasificada"},{"$f":"CONCATENATE(D646,\"-\",\"Tipo de información\",\" \",V646,\"-\",F646)","v":"C67012022-Tipo de información Pública clasificada-Prestación de servicios: El CONTRATISTA se obliga con POSITIVA a la prestación de los servicios de salud para los asegurados y o afiliados a POSITIVA que accedan a los servicios habilitados del CONTRATISTA en calidad de asegurados a los ramos Administración de Riesgos Laborales ARL por causa exclusiva de un accidente de trabajo una enfermedad profesional) Accidentes Personales AP Educativo Generación Positiva AP Colectivos APCorto Plazo AP Individual y demás Ramos de Seguros autorizados a Positiva encontrándose excluidos del presente contrato los servicios y todas aquellas actividades procedimientos e intervenciones que no tengan por objeto contribuir al diagnóstico tratamiento o rehabilitación de la patología derivada del siniestro o los servicios considerados como experimentales cosméticos y suntuarios."}]
["VICEPRESIDENCIA TÉCNICA","Gerencia Médica","NO","C67022022",85100000,"Prestación de servicios: El CONTRATISTA se obliga con POSITIVA a la prestación de los servicios de salud para los asegurados y o afiliados a POSITIVA que accedan a los servicios habilitados del CONTRATISTA en calidad de asegurados a los ramos Administración de Riesgos Laborales ARL por causa exclusiva de un accidente de trabajo una enfermedad profesional) Accidentes Personales AP Educativo Generación Positiva AP Colectivos APCorto Plazo AP Individual y demás Ramos de Seguros autorizados a Positiva encontrándose excluidos del presente contrato los servicios y todas aquellas actividades procedimientos e intervenciones que no tengan por objeto contribuir al diagnóstico tratamiento o rehabilitación de la patología derivada del siniestro o los servicios considerados como experimentales cosméticos y suntuarios.","2022-05-24",{"$f":"MONTH(G647)","v":5},"2024-05-24",{"$f":"(I647-G647)/30","v":24.366666666666667},"Invitación directa","CargoAReserva",0,0,"NO",null,"Gerencia de Abastecimiento Estratégico\ncontratacion@positiva.gov.co\nPBX: (1)6502200 Ext: 10641","SI","SI","NO","SI",{"$f":"IF(U647=\"SI\",\"Pública clasificada\",\"Pública\")","v":"Pública clasificada"},{"$f":"CONCATENATE(D647,\"-\",\"Tipo de información\",\" \",V647,\"-\",F647)","v":"C67022022-Tipo de información Pública clasificada-Prestación de servicios: El CONTRATISTA se obliga con POSITIVA a la prestación de los servicios de salud para los asegurados y o afiliados a POSITIVA que accedan a los servicios habilitados del CONTRATISTA en calidad de asegurados a los ramos Administración de Riesgos Laborales ARL por causa exclusiva de un accidente de trabajo una enfermedad profesional) Accidentes Personales AP Educativo Generación Positiva AP Colectivos APCorto Plazo AP Individual y demás Ramos de Seguros autorizados a Positiva encontrándose excluidos del presente contrato los servicios y todas aquellas actividades procedimientos e intervenciones que no tengan por objeto contribuir al diagnóstico tratamiento o rehabilitación de la patología derivada del siniestro o los servicios considerados como experimentales cosméticos y suntuarios."}]
["VICEPRESIDENCIA TÉCNICA","Gerencia Médica","NO","C67032022",85100000,"Prestación de servicios: El CONTRATISTA se obliga con POSITIVA a la prestación de los servicios de salud para los asegurados y o afiliados a POSITIVA que accedan a los servicios habilitados del CONTRATISTA en calidad de asegurados a los ramos Administración de Riesgos Laborales ARL por causa exclusiva de un accidente de trabajo una enfermedad profesional) Accidentes Personales AP Educativo Generación Positiva AP Colectivos APCorto Plazo AP Individual y demás Ramos de Seguros autorizados a Positiva encontrándose excluidos del presente contrato los servicios y todas aquellas actividades procedimientos e intervenciones que no tengan por objeto contribuir al diagnóstico tratamiento o rehabilitación de la patología derivada del siniestro o los servicios considerados como experimentales cosméticos y suntuarios.","2022-06-15",{"$f":"MONTH(G648)","v":6},"2024-06-15",{"$f":"(I648-G648)/30","v":24.366666666666667},"Invitación directa","CargoAReserva",0,0,"NO",null,"Gerencia de Abastecimiento Estratégico\ncontratacion@positiva.gov.co\nPBX: (1)6502200 Ext: 10641","SI","SI","NO","SI",{"$f":"IF(U648=\"SI\",\"Pública clasificada\",\"Pública\")","v":"Pública clasificada"},{"$f":"CONCATENATE(D648,\"-\",\"Tipo de información\",\" \",V648,\"-\",F648)","v":"C67032022-Tipo de información Pública clasificada-Prestación de servicios: El CONTRATISTA se obliga con POSITIVA a la prestación de los servicios de salud para los asegurados y o afiliados a POSITIVA que accedan a los servicios habilitados del CONTRATISTA en calidad de asegurados a los ramos Administración de Riesgos Laborales ARL por causa exclusiva de un accidente de trabajo una enfermedad profesional) Accidentes Personales AP Educativo Generación Positiva AP Colectivos APCorto Plazo AP Individual y demás Ramos de Seguros autorizados a Positiva encontrándose excluidos del presente contrato los servicios y todas aquellas actividades procedimientos e intervenciones que no tengan por objeto contribuir al diagnóstico tratamiento o rehabilitación de la patología derivada del siniestro o los servicios considerados como experimentales cosméticos y suntuarios."}]
["VICEPRESIDENCIA TÉCNICA","Gerencia Médica","NO","C67042022",85100000,"Prestación de servicios: El CONTRATISTA se obliga con POSITIVA a la prestación de los servicios de salud para los asegurados y o afiliados a POSITIVA que accedan a los servicios habilitados del CONTRATISTA en calidad de asegurados a los ramos Administración de Riesgos Laborales ARL por causa exclusiva de un accidente de trabajo una enfermedad profesional) Accidentes Personales AP Educativo Generación Positiva AP Colectivos APCorto Plazo AP Individual y demás Ramos de Seguros autorizados a Positiva encontrándose excluidos del presente contrato los servicios y todas aquellas actividades procedimientos e intervenciones que no tengan por objeto contribuir al diagnóstico tratamiento o rehabilitación de la patología derivada del siniestro o los servicios considerados como experimentales cosméticos y suntuarios.","2022-06-15",{"$f":"MONTH(G649)","v":6},"2024-06-15",{"$f":"(I649-G649)/30","v":24.366666666666667},"Invitación directa","CargoAReserva",0,0,"NO",null,"Gerencia de Abastecimiento Estratégico\ncontratacion@positiva.gov.co\nPBX: (1)6502200 Ext: 10641","SI","SI","NO","SI",{"$f":"IF(U649=\"SI\",\"Pública clasificada\",\"Pública\")","v":"Pública clasificada"},{"$f":"CONCATENATE(D649,\"-\",\"Tipo de información\",\" \",V649,\"-\",F649)","v":"C67042022-Tipo de información Pública clasificada-Prestación de servicios: El CONTRATISTA se obliga con POSITIVA a la prestación de los servicios de salud para los asegurados y o afiliados a POSITIVA que accedan a los servicios habilitados del CONTRATISTA en calidad de asegurados a los ramos Administración de Riesgos Laborales ARL por causa exclusiva de un accidente de trabajo una enfermedad profesional) Accidentes Personales AP Educativo Generación Positiva AP Colectivos APCorto Plazo AP Individual y demás Ramos de Seguros autorizados a Positiva encontrándose excluidos del presente contrato los servicios y todas aquellas actividades procedimientos e intervenciones que no tengan por objeto contribuir al diagnóstico tratamiento o rehabilitación de la patología derivada del siniestro o los servicios considerados como experimentales cosméticos y suntuarios."}]
["VICEPRESIDENCIA TÉCNICA","Gerencia Médica","NO","C67052022",85100000,"Prestación de servicios: El CONTRATISTA se obliga con POSITIVA a la prestación de los servicios de salud para los asegurados y o afiliados a POSITIVA que accedan a los servicios habilitados del CONTRATISTA en calidad de asegurados a los ramos Administración de Riesgos Laborales ARL por causa exclusiva de un accidente de trabajo una enfermedad profesional) Accidentes Personales AP Educativo Generación Positiva AP Colectivos APCorto Plazo AP Individual y demás Ramos de Seguros autorizados a Positiva encontrándose excluidos del presente contrato los servicios y todas aquellas actividades procedimientos e intervenciones que no tengan por objeto contribuir al diagnóstico tratamiento o rehabilitación de la patología derivada del siniestro o los servicios considerados como experimentales cosméticos y suntuarios.","2022-09-20",{"$f":"MONTH(G650)","v":9},"2024-09-20",{"$f":"(I650-G650)/30","v":24.366666666666667},"Invitación directa","CargoAReserva",0,0,"NO",null,"Gerencia de Abastecimiento Estratégico\ncontratacion@positiva.gov.co\nPBX: (1)6502200 Ext: 10641","SI","SI","NO","SI",{"$f":"IF(U650=\"SI\",\"Pública clasificada\",\"Pública\")","v":"Pública clasificada"},{"$f":"CONCATENATE(D650,\"-\",\"Tipo de información\",\" \",V650,\"-\",F650)","v":"C67052022-Tipo de información Pública clasificada-Prestación de servicios: El CONTRATISTA se obliga con POSITIVA a la prestación de los servicios de salud para los asegurados y o afiliados a POSITIVA que accedan a los servicios habilitados del CONTRATISTA en calidad de asegurados a los ramos Administración de Riesgos Laborales ARL por causa exclusiva de un accidente de trabajo una enfermedad profesional) Accidentes Personales AP Educativo Generación Positiva AP Colectivos APCorto Plazo AP Individual y demás Ramos de Seguros autorizados a Positiva encontrándose excluidos del presente contrato los servicios y todas aquellas actividades procedimientos e intervenciones que no tengan por objeto contribuir al diagnóstico tratamiento o rehabilitación de la patología derivada del siniestro o los servicios considerados como experimentales cosméticos y suntuarios."}]
["VICEPRESIDENCIA TÉCNICA","Gerencia Médica","NO","C67062022",85100000,"Prestación de servicios: El CONTRATISTA se obliga con POSITIVA a la prestación de los servicios de salud para los asegurados y o afiliados a POSITIVA que accedan a los servicios habilitados del CONTRATISTA en calidad de asegurados a los ramos Administración de Riesgos Laborales ARL por causa exclusiva de un accidente de trabajo una enfermedad profesional) Accidentes Personales AP Educativo Generación Positiva AP Colectivos APCorto Plazo AP Individual y demás Ramos de Seguros autorizados a Positiva encontrándose excluidos del presente contrato los servicios y todas aquellas actividades procedimientos e intervenciones que no tengan por objeto contribuir al diagnóstico tratamiento o rehabilitación de la patología derivada del siniestro o los servicios considerados como experimentales cosméticos y suntuarios.","2022-12-27",{"$f":"MONTH(G651)","v":12},"2024-12-27",{"$f":"(I651-G651)/30","v":24.366666666666667},"Invitación directa","CargoAReserva",0,0,"NO",null,"Gerencia de Abastecimiento Estratégico\ncontratacion@positiva.gov.co\nPBX: (1)6502200 Ext: 10641","SI","SI","NO","SI",{"$f":"IF(U651=\"SI\",\"Pública clasificada\",\"Pública\")","v":"Pública clasificada"},{"$f":"CONCATENATE(D651,\"-\",\"Tipo de información\",\" \",V651,\"-\",F651)","v":"C67062022-Tipo de información Pública clasificada-Prestación de servicios: El CONTRATISTA se obliga con POSITIVA a la prestación de los servicios de salud para los asegurados y o afiliados a POSITIVA que accedan a los servicios habilitados del CONTRATISTA en calidad de asegurados a los ramos Administración de Riesgos Laborales ARL por causa exclusiva de un accidente de trabajo una enfermedad profesional) Accidentes Personales AP Educativo Generación Positiva AP Colectivos APCorto Plazo AP Individual y demás Ramos de Seguros autorizados a Positiva encontrándose excluidos del presente contrato los servicios y todas aquellas actividades procedimientos e intervenciones que no tengan por objeto contribuir al diagnóstico tratamiento o rehabilitación de la patología derivada del siniestro o los servicios considerados como experimentales cosméticos y suntuarios."}]
["VICEPRESIDENCIA TÉCNICA","Gerencia Médica","NO","C67072022",85100000,"Prestación de servicios: El CONTRATISTA se obliga con POSITIVA a la prestación de los servicios de salud para los asegurados y o afiliados a POSITIVA que accedan a los servicios habilitados del CONTRATISTA en calidad de asegurados a los ramos Administración de Riesgos Laborales ARL por causa exclusiva de un accidente de trabajo una enfermedad profesional) Accidentes Personales AP Educativo Generación Positiva AP Colectivos APCorto Plazo AP Individual y demás Ramos de Seguros autorizados a Positiva encontrándose excluidos del presente contrato los servicios y todas aquellas actividades procedimientos e intervenciones que no tengan por objeto contribuir al diagnóstico tratamiento o rehabilitación de la patología derivada del siniestro o los servicios considerados como experimentales cosméticos y suntuarios.","2022-03-15",{"$f":"MONTH(G652)","v":3},"2024-03-15",{"$f":"(I652-G652)/30","v":24.366666666666667},"Invitación directa","CargoAReserva",0,0,"NO",null,"Gerencia de Abastecimiento Estratégico\ncontratacion@positiva.gov.co\nPBX: (1)6502200 Ext: 10641","SI","SI","NO","SI",{"$f":"IF(U652=\"SI\",\"Pública clasificada\",\"Pública\")","v":"Pública clasificada"},{"$f":"CONCATENATE(D652,\"-\",\"Tipo de información\",\" \",V652,\"-\",F652)","v":"C67072022-Tipo de información Pública clasificada-Prestación de servicios: El CONTRATISTA se obliga con POSITIVA a la prestación de los servicios de salud para los asegurados y o afiliados a POSITIVA que accedan a los servicios habilitados del CONTRATISTA en calidad de asegurados a los ramos Administración de Riesgos Laborales ARL por causa exclusiva de un accidente de trabajo una enfermedad profesional) Accidentes Personales AP Educativo Generación Positiva AP Colectivos APCorto Plazo AP Individual y demás Ramos de Seguros autorizados a Positiva encontrándose excluidos del presente contrato los servicios y todas aquellas actividades procedimientos e intervenciones que no tengan por objeto contribuir al diagnóstico tratamiento o rehabilitación de la patología derivada del siniestro o los servicios considerados como experimentales cosméticos y suntuarios."}]
["VICEPRESIDENCIA TÉCNICA","Gerencia Médica","NO","C67082022",85100000,"Prestación de servicios: El CONTRATISTA se obliga con POSITIVA a la prestación de los servicios de salud para los asegurados y o afiliados a POSITIVA que accedan a los servicios habilitados del CONTRATISTA en calidad de asegurados a los ramos Administración de Riesgos Laborales ARL por causa exclusiva de un accidente de trabajo una enfermedad profesional) Accidentes Personales AP Educativo Generación Positiva AP Colectivos APCorto Plazo AP Individual y demás Ramos de Seguros autorizados a Positiva encontrándose excluidos del presente contrato los servicios y todas aquellas actividades procedimientos e intervenciones que no tengan por objeto contribuir al diagnóstico tratamiento o rehabilitación de la patología derivada del siniestro o los servicios considerados como experimentales cosméticos y suntuarios.","2022-04-21",{"$f":"MONTH(G653)","v":4},"2024-04-21",{"$f":"(I653-G653)/30","v":24.366666666666667},"Invitación directa","CargoAReserva",0,0,"NO",null,"Gerencia de Abastecimiento Estratégico\ncontratacion@positiva.gov.co\nPBX: (1)6502200 Ext: 10641","SI","SI","NO","SI",{"$f":"IF(U653=\"SI\",\"Pública clasificada\",\"Pública\")","v":"Pública clasificada"},{"$f":"CONCATENATE(D653,\"-\",\"Tipo de información\",\" \",V653,\"-\",F653)","v":"C67082022-Tipo de información Pública clasificada-Prestación de servicios: El CONTRATISTA se obliga con POSITIVA a la prestación de los servicios de salud para los asegurados y o afiliados a POSITIVA que accedan a los servicios habilitados del CONTRATISTA en calidad de asegurados a los ramos Administración de Riesgos Laborales ARL por causa exclusiva de un accidente de trabajo una enfermedad profesional) Accidentes Personales AP Educativo Generación Positiva AP Colectivos APCorto Plazo AP Individual y demás Ramos de Seguros autorizados a Positiva encontrándose excluidos del presente contrato los servicios y todas aquellas actividades procedimientos e intervenciones que no tengan por objeto contribuir al diagnóstico tratamiento o rehabilitación de la patología derivada del siniestro o los servicios considerados como experimentales cosméticos y suntuarios."}]
["VICEPRESIDENCIA TÉCNICA","Gerencia Médica","NO","C67092022",85100000,"Prestación de servicios: El CONTRATISTA se obliga con POSITIVA a la prestación de los servicios de salud para los asegurados y o afiliados a POSITIVA que accedan a los servicios habilitados del CONTRATISTA en calidad de asegurados a los ramos Administración de Riesgos Laborales ARL por causa exclusiva de un accidente de trabajo una enfermedad profesional) Accidentes Personales AP Educativo Generación Positiva AP Colectivos APCorto Plazo AP Individual y demás Ramos de Seguros autorizados a Positiva encontrándose excluidos del presente contrato los servicios y todas aquellas actividades procedimientos e intervenciones que no tengan por objeto contribuir al diagnóstico tratamiento o rehabilitación de la patología derivada del siniestro o los servicios considerados como experimentales cosméticos y suntuarios.","2022-05-24",{"$f":"MONTH(G654)","v":5},"2024-05-24",{"$f":"(I654-G654)/30","v":24.366666666666667},"Invitación directa","CargoAReserva",0,0,"NO",null,"Gerencia de Abastecimiento Estratégico\ncontratacion@positiva.gov.co\nPBX: (1)6502200 Ext: 10641","SI","SI","NO","SI",{"$f":"IF(U654=\"SI\",\"Pública clasificada\",\"Pública\")","v":"Pública clasificada"},{"$f":"CONCATENATE(D654,\"-\",\"Tipo de información\",\" \",V654,\"-\",F654)","v":"C67092022-Tipo de información Pública clasificada-Prestación de servicios: El CONTRATISTA se obliga con POSITIVA a la prestación de los servicios de salud para los asegurados y o afiliados a POSITIVA que accedan a los servicios habilitados del CONTRATISTA en calidad de asegurados a los ramos Administración de Riesgos Laborales ARL por causa exclusiva de un accidente de trabajo una enfermedad profesional) Accidentes Personales AP Educativo Generación Positiva AP Colectivos APCorto Plazo AP Individual y demás Ramos de Seguros autorizados a Positiva encontrándose excluidos del presente contrato los servicios y todas aquellas actividades procedimientos e intervenciones que no tengan por objeto contribuir al diagnóstico tratamiento o rehabilitación de la patología derivada del siniestro o los servicios considerados como experimentales cosméticos y suntuarios."}]
["VICEPRESIDENCIA TÉCNICA","Gerencia Médica","NO","C67102022",85100000,"Prestación de servicios: El CONTRATISTA se obliga con POSITIVA a la prestación de los servicios de salud para los asegurados y o afiliados a POSITIVA que accedan a los servicios habilitados del CONTRATISTA en calidad de asegurados a los ramos Administración de Riesgos Laborales ARL por causa exclusiva de un accidente de trabajo una enfermedad profesional) Accidentes Personales AP Educativo Generación Positiva AP Colectivos APCorto Plazo AP Individual y demás Ramos de Seguros autorizados a Positiva encontrándose excluidos del presente contrato los servicios y todas aquellas actividades procedimientos e intervenciones que no tengan por objeto contribuir al diagnóstico tratamiento o rehabilitación de la patología derivada del siniestro o los servicios considerados como experimentales cosméticos y suntuarios.","2022-06-15",{"$f":"MONTH(G655)","v":6},"2024-06-15",{"$f":"(I655-G655)/30","v":24.366666666666667},"Invitación directa","CargoAReserva",0,0,"NO",null,"Gerencia de Abastecimiento Estratégico\ncontratacion@positiva.gov.co\nPBX: (1)6502200 Ext: 10641","SI","SI","NO","SI",{"$f":"IF(U655=\"SI\",\"Pública clasificada\",\"Pública\")","v":"Pública clasificada"},{"$f":"CONCATENATE(D655,\"-\",\"Tipo de información\",\" \",V655,\"-\",F655)","v":"C67102022-Tipo de información Pública clasificada-Prestación de servicios: El CONTRATISTA se obliga con POSITIVA a la prestación de los servicios de salud para los asegurados y o afiliados a POSITIVA que accedan a los servicios habilitados del CONTRATISTA en calidad de asegurados a los ramos Administración de Riesgos Laborales ARL por causa exclusiva de un accidente de trabajo una enfermedad profesional) Accidentes Personales AP Educativo Generación Positiva AP Colectivos APCorto Plazo AP Individual y demás Ramos de Seguros autorizados a Positiva encontrándose excluidos del presente contrato los servicios y todas aquellas actividades procedimientos e intervenciones que no tengan por objeto contribuir al diagnóstico tratamiento o rehabilitación de la patología derivada del siniestro o los servicios considerados como experimentales cosméticos y suntuarios."}]
["VICEPRESIDENCIA TÉCNICA","Gerencia Médica","NO","C67112022",85100000,"Prestación de servicios: El CONTRATISTA se obliga con POSITIVA a la prestación de los servicios de salud para los asegurados y o afiliados a POSITIVA que accedan a los servicios habilitados del CONTRATISTA en calidad de asegurados a los ramos Administración de Riesgos Laborales ARL por causa exclusiva de un accidente de trabajo una enfermedad profesional) Accidentes Personales AP Educativo Generación Positiva AP Colectivos APCorto Plazo AP Individual y demás Ramos de Seguros autorizados a Positiva encontrándose excluidos del presente contrato los servicios y todas aquellas actividades procedimientos e intervenciones que no tengan por objeto contribuir al diagnóstico tratamiento o rehabilitación de la patología derivada del siniestro o los servicios considerados como experimentales cosméticos y suntuarios.","2022-06-15",{"$f":"MONTH(G656)","v":6},"2024-06-15",{"$f":"(I656-G656)/30","v":24.366666666666667},"Invitación directa","CargoAReserva",0,0,"NO",null,"Gerencia de Abastecimiento Estratégico\ncontratacion@positiva.gov.co\nPBX: (1)6502200 Ext: 10641","SI","SI","NO","SI",{"$f":"IF(U656=\"SI\",\"Pública clasificada\",\"Pública\")","v":"Pública clasificada"},{"$f":"CONCATENATE(D656,\"-\",\"Tipo de información\",\" \",V656,\"-\",F656)","v":"C67112022-Tipo de información Pública clasificada-Prestación de servicios: El CONTRATISTA se obliga con POSITIVA a la prestación de los servicios de salud para los asegurados y o afiliados a POSITIVA que accedan a los servicios habilitados del CONTRATISTA en calidad de asegurados a los ramos Administración de Riesgos Laborales ARL por causa exclusiva de un accidente de trabajo una enfermedad profesional) Accidentes Personales AP Educativo Generación Positiva AP Colectivos APCorto Plazo AP Individual y demás Ramos de Seguros autorizados a Positiva encontrándose excluidos del presente contrato los servicios y todas aquellas actividades procedimientos e intervenciones que no tengan por objeto contribuir al diagnóstico tratamiento o rehabilitación de la patología derivada del siniestro o los servicios considerados como experimentales cosméticos y suntuarios."}]
["VICEPRESIDENCIA TÉCNICA","Gerencia Médica","NO","C67122022",85100000,"Prestación de servicios: El CONTRATISTA se obliga con POSITIVA a la prestación de los servicios de salud para los asegurados y o afiliados a POSITIVA que accedan a los servicios habilitados del CONTRATISTA en calidad de asegurados a los ramos Administración de Riesgos Laborales ARL por causa exclusiva de un accidente de trabajo una enfermedad profesional) Accidentes Personales AP Educativo Generación Positiva AP Colectivos APCorto Plazo AP Individual y demás Ramos de Seguros autorizados a Positiva encontrándose excluidos del presente contrato los servicios y todas aquellas actividades procedimientos e intervenciones que no tengan por objeto contribuir al diagnóstico tratamiento o rehabilitación de la patología derivada del siniestro o los servicios considerados como experimentales cosméticos y suntuarios.","2022-06-15",{"$f":"MONTH(G657)","v":6},"2024-06-15",{"$f":"(I657-G657)/30","v":24.366666666666667},"Invitación directa","CargoAReserva",0,0,"NO",null,"Gerencia de Abastecimiento Estratégico\ncontratacion@positiva.gov.co\nPBX: (1)6502200 Ext: 10641","SI","SI","NO","SI",{"$f":"IF(U657=\"SI\",\"Pública clasificada\",\"Pública\")","v":"Pública clasificada"},{"$f":"CONCATENATE(D657,\"-\",\"Tipo de información\",\" \",V657,\"-\",F657)","v":"C67122022-Tipo de información Pública clasificada-Prestación de servicios: El CONTRATISTA se obliga con POSITIVA a la prestación de los servicios de salud para los asegurados y o afiliados a POSITIVA que accedan a los servicios habilitados del CONTRATISTA en calidad de asegurados a los ramos Administración de Riesgos Laborales ARL por causa exclusiva de un accidente de trabajo una enfermedad profesional) Accidentes Personales AP Educativo Generación Positiva AP Colectivos APCorto Plazo AP Individual y demás Ramos de Seguros autorizados a Positiva encontrándose excluidos del presente contrato los servicios y todas aquellas actividades procedimientos e intervenciones que no tengan por objeto contribuir al diagnóstico tratamiento o rehabilitación de la patología derivada del siniestro o los servicios considerados como experimentales cosméticos y suntuarios."}]
["VICEPRESIDENCIA TÉCNICA","Gerencia Médica","NO","C67132022",85100000,"Prestación de servicios: El CONTRATISTA se obliga con POSITIVA a la prestación de los servicios de salud para los asegurados y o afiliados a POSITIVA que accedan a los servicios habilitados del CONTRATISTA en calidad de asegurados a los ramos Administración de Riesgos Laborales ARL por causa exclusiva de un accidente de trabajo una enfermedad profesional) Accidentes Personales AP Educativo Generación Positiva AP Colectivos APCorto Plazo AP Individual y demás Ramos de Seguros autorizados a Positiva encontrándose excluidos del presente contrato los servicios y todas aquellas actividades procedimientos e intervenciones que no tengan por objeto contribuir al diagnóstico tratamiento o rehabilitación de la patología derivada del siniestro o los servicios considerados como experimentales cosméticos y suntuarios.","2022-09-20",{"$f":"MONTH(G658)","v":9},"2024-09-20",{"$f":"(I658-G658)/30","v":24.366666666666667},"Invitación directa","CargoAReserva",0,0,"NO",null,"Gerencia de Abastecimiento Estratégico\ncontratacion@positiva.gov.co\nPBX: (1)6502200 Ext: 10641","SI","SI","NO","SI",{"$f":"IF(U658=\"SI\",\"Pública clasificada\",\"Pública\")","v":"Pública clasificada"},{"$f":"CONCATENATE(D658,\"-\",\"Tipo de información\",\" \",V658,\"-\",F658)","v":"C67132022-Tipo de información Pública clasificada-Prestación de servicios: El CONTRATISTA se obliga con POSITIVA a la prestación de los servicios de salud para los asegurados y o afiliados a POSITIVA que accedan a los servicios habilitados del CONTRATISTA en calidad de asegurados a los ramos Administración de Riesgos Laborales ARL por causa exclusiva de un accidente de trabajo una enfermedad profesional) Accidentes Personales AP Educativo Generación Positiva AP Colectivos APCorto Plazo AP Individual y demás Ramos de Seguros autorizados a Positiva encontrándose excluidos del presente contrato los servicios y todas aquellas actividades procedimientos e intervenciones que no tengan por objeto contribuir al diagnóstico tratamiento o rehabilitación de la patología derivada del siniestro o los servicios considerados como experimentales cosméticos y suntuarios."}]
["VICEPRESIDENCIA TÉCNICA","Gerencia Médica","NO","C67142022",85100000,"Prestación de servicios: El CONTRATISTA se obliga con POSITIVA a la prestación de los servicios de salud para los asegurados y o afiliados a POSITIVA que accedan a los servicios habilitados del CONTRATISTA en calidad de asegurados a los ramos Administración de Riesgos Laborales ARL por causa exclusiva de un accidente de trabajo una enfermedad profesional) Accidentes Personales AP Educativo Generación Positiva AP Colectivos APCorto Plazo AP Individual y demás Ramos de Seguros autorizados a Positiva encontrándose excluidos del presente contrato los servicios y todas aquellas actividades procedimientos e intervenciones que no tengan por objeto contribuir al diagnóstico tratamiento o rehabilitación de la patología derivada del siniestro o los servicios considerados como experimentales cosméticos y suntuarios.","2022-12-27",{"$f":"MONTH(G659)","v":12},"2024-12-27",{"$f":"(I659-G659)/30","v":24.366666666666667},"Invitación directa","CargoAReserva",0,0,"NO",null,"Gerencia de Abastecimiento Estratégico\ncontratacion@positiva.gov.co\nPBX: (1)6502200 Ext: 10641","SI","SI","NO","SI",{"$f":"IF(U659=\"SI\",\"Pública clasificada\",\"Pública\")","v":"Pública clasificada"},{"$f":"CONCATENATE(D659,\"-\",\"Tipo de información\",\" \",V659,\"-\",F659)","v":"C67142022-Tipo de información Pública clasificada-Prestación de servicios: El CONTRATISTA se obliga con POSITIVA a la prestación de los servicios de salud para los asegurados y o afiliados a POSITIVA que accedan a los servicios habilitados del CONTRATISTA en calidad de asegurados a los ramos Administración de Riesgos Laborales ARL por causa exclusiva de un accidente de trabajo una enfermedad profesional) Accidentes Personales AP Educativo Generación Positiva AP Colectivos APCorto Plazo AP Individual y demás Ramos de Seguros autorizados a Positiva encontrándose excluidos del presente contrato los servicios y todas aquellas actividades procedimientos e intervenciones que no tengan por objeto contribuir al diagnóstico tratamiento o rehabilitación de la patología derivada del siniestro o los servicios considerados como experimentales cosméticos y suntuarios."}]
["VICEPRESIDENCIA TÉCNICA","Gerencia Médica","NO","C67152022",85100000,"Prestación de servicios: El CONTRATISTA se obliga con POSITIVA a la prestación de los servicios de salud para los asegurados y o afiliados a POSITIVA que accedan a los servicios habilitados del CONTRATISTA en calidad de asegurados a los ramos Administración de Riesgos Laborales ARL por causa exclusiva de un accidente de trabajo una enfermedad profesional) Accidentes Personales AP Educativo Generación Positiva AP Colectivos APCorto Plazo AP Individual y demás Ramos de Seguros autorizados a Positiva encontrándose excluidos del presente contrato los servicios y todas aquellas actividades procedimientos e intervenciones que no tengan por objeto contribuir al diagnóstico tratamiento o rehabilitación de la patología derivada del siniestro o los servicios considerados como experimentales cosméticos y suntuarios.","2022-03-15",{"$f":"MONTH(G660)","v":3},"2024-03-15",{"$f":"(I660-G660)/30","v":24.366666666666667},"Invitación directa","CargoAReserva",0,0,"NO",null,"Gerencia de Abastecimiento Estratégico\ncontratacion@positiva.gov.co\nPBX: (1)6502200 Ext: 10641","SI","SI","NO","SI",{"$f":"IF(U660=\"SI\",\"Pública clasificada\",\"Pública\")","v":"Pública clasificada"},{"$f":"CONCATENATE(D660,\"-\",\"Tipo de información\",\" \",V660,\"-\",F660)","v":"C67152022-Tipo de información Pública clasificada-Prestación de servicios: El CONTRATISTA se obliga con POSITIVA a la prestación de los servicios de salud para los asegurados y o afiliados a POSITIVA que accedan a los servicios habilitados del CONTRATISTA en calidad de asegurados a los ramos Administración de Riesgos Laborales ARL por causa exclusiva de un accidente de trabajo una enfermedad profesional) Accidentes Personales AP Educativo Generación Positiva AP Colectivos APCorto Plazo AP Individual y demás Ramos de Seguros autorizados a Positiva encontrándose excluidos del presente contrato los servicios y todas aquellas actividades procedimientos e intervenciones que no tengan por objeto contribuir al diagnóstico tratamiento o rehabilitación de la patología derivada del siniestro o los servicios considerados como experimentales cosméticos y suntuarios."}]
["VICEPRESIDENCIA TÉCNICA","Gerencia Médica","NO","C67162022",85100000,"Prestación de servicios: El CONTRATISTA se obliga con POSITIVA a la prestación de los servicios de salud para los asegurados y o afiliados a POSITIVA que accedan a los servicios habilitados del CONTRATISTA en calidad de asegurados a los ramos Administración de Riesgos Laborales ARL por causa exclusiva de un accidente de trabajo una enfermedad profesional) Accidentes Personales AP Educativo Generación Positiva AP Colectivos APCorto Plazo AP Individual y demás Ramos de Seguros autorizados a Positiva encontrándose excluidos del presente contrato los servicios y todas aquellas actividades procedimientos e intervenciones que no tengan por objeto contribuir al diagnóstico tratamiento o rehabilitación de la patología derivada del siniestro o los servicios considerados como experimentales cosméticos y suntuarios.","2022-04-21",{"$f":"MONTH(G661)","v":4},"2024-04-21",{"$f":"(I661-G661)/30","v":24.366666666666667},"Invitación directa","CargoAReserva",0,0,"NO",null,"Gerencia de Abastecimiento Estratégico\ncontratacion@positiva.gov.co\nPBX: (1)6502200 Ext: 10641","SI","SI","NO","SI",{"$f":"IF(U661=\"SI\",\"Pública clasificada\",\"Pública\")","v":"Pública clasificada"},{"$f":"CONCATENATE(D661,\"-\",\"Tipo de información\",\" \",V661,\"-\",F661)","v":"C67162022-Tipo de información Pública clasificada-Prestación de servicios: El CONTRATISTA se obliga con POSITIVA a la prestación de los servicios de salud para los asegurados y o afiliados a POSITIVA que accedan a los servicios habilitados del CONTRATISTA en calidad de asegurados a los ramos Administración de Riesgos Laborales ARL por causa exclusiva de un accidente de trabajo una enfermedad profesional) Accidentes Personales AP Educativo Generación Positiva AP Colectivos APCorto Plazo AP Individual y demás Ramos de Seguros autorizados a Positiva encontrándose excluidos del presente contrato los servicios y todas aquellas actividades procedimientos e intervenciones que no tengan por objeto contribuir al diagnóstico tratamiento o rehabilitación de la patología derivada del siniestro o los servicios considerados como experimentales cosméticos y suntuarios."}]
["Financiera y Administrativa","Gcia. Logística",null,"C55072022 -  C55402022",80131502,"Arrendamiento inmueble Sucursal Meta","2021-09-01",9,"2023-09-30",25.3,"Invitación directa","GastosAdministrativos",227185083,117032733,"SI","Aprobadas",null,"NO","NO","NO","SI","Pública clasificada","C55072022 -  C55402022-Tipo de información Pública clasificada-Arrendamiento inmueble Sucursal Meta"]
["Financiera y Administrativa","Gcia. Logística",null,"C55062022",80131502,"Arrendamiento inmueble Sucursal Caquetá","2021-09-30",9,"2022-12-31",15.233333333333333,"Invitación directa","GastosAdministrativos",39000000,6337200,"SI","Aprobadas",null,"NO","NO","NO","SI","Pública clasificada","C55062022-Tipo de información Pública clasificada-Arrendamiento inmueble Sucursal Caquetá"]
["Financiera y Administrativa","Gcia. Logística",null,"C56592021-C55382022-C55032023-C55002024",80131502,"Arrendamiento inmueble Punto de Atención Antioquia","2021-10-01",10,"2024-11-30",38.533333333333331,"Invitación directa","GastosAdministrativos",574292568,182664745,"SI","Aprobada",null,"NO","NO","NO","SI","Pública clasificada","C56592021-C55382022-C55032023-C55002024-Tipo de información Pública clasificada-Arrendamiento inmueble Punto de Atención Antioquia"]
["Financiera y Administrativa","Gcia. Logística",null,"C55392022-C55042023-C55012024",80131502,"Arrendamiento inmueble Sede Administrativa Antioquia","2021-10-01",10,"2024-12-31",39.56666666666667,"Invitación directa","GastosAdministrativos",871512972,278460000,"SI","Aprobada",null,"NO","NO","NO","SI","Pública clasificada","C55392022-C55042023-C55012024-Tipo de información Pública clasificada-Arrendamiento inmueble Sede Administrativa Antioquia"]
["Financiera y Administrativa","Gcia. Logística",null,"C55042022",92101500,"Prestación de servicios de vigilancia y seguridad privada con monitoreo de alarmas para las coodirnadores sucursales y puntos de atencion de Positiva Compañía de Seguros  ","2021-09-15",9,"2022-12-31",15.733333333333333,"Invitación pública","GastosAdministrativos",1216838593,1216838593,"SI","Aprobadas",null,"NO","NO","NO","SI","Pública clasificada","C55042022-Tipo de información Pública clasificada-Prestación de servicios de vigilancia y seguridad privada con monitoreo de alarmas para las coodirnadores sucursales y puntos de atencion de Positiva Compañía de Seguros  "]
["Financiera y Administrativa","Gcia. Logística",null,"C55052022","76110000, 90101700","Prestación de servicios de Aseo y Cafeteria con el suministro de insumos y elementos para la atención a colaboradores y clientes ubicados en Casa Matriz y coodinadoras sucursales y puntos de atencion de Positiva Compañía de Seguros","2021-09-15",9,"2022-12-31",15.733333333333333,"Invitación pública","GastosAdministrativos",1539036287,1539036287,"SI","Aprobadas",null,"NO","NO","NO","SI","Pública clasificada","C55052022-Tipo de información Pública clasificada-Prestación de servicios de Aseo y Cafeteria con el suministro de insumos y elementos para la atención a colaboradores y clientes ubicados en Casa Matriz y coodinadoras sucursales y puntos de atencion de Positiva Compañía de Seguros"]
["Financiera y Administrativa","Gcia. Logística",null,null,80111612,"Prestación del Servicio profesionales de conductor para atender las necesidades requeridas en la Casa Matriz y Gerencias Coordinadoras de la compañía","2022-05-01",5,"2022-12-31",8.1333333333333329,"Invitación cerrada","GastosAdministrativos",308211209,308211209,"SI","Aprobada",null,"NO","NO","NO","SI","Pública clasificada","-Tipo de información Pública clasificada-Prestación del Servicio profesionales de conductor para atender las necesidades requeridas en la Casa Matriz y Gerencias Coordinadoras de la compañía"]
["Financiera y Administrativa","Gcia. Logística",null,"C55032022","78131602-80161506","Prestación del servicio especializado en gestión documental de compañía para la administración y custodia del archivo físico tanto administrativo como misional de la compañía.","2022-08-09",8,"2023-10-31",14.933333333333334,"Invitación pública","GastosAdministrativos",2100616522,334439822,"SI",null,null,"NO","NO","NO","SI","Pública clasificada","C55032022-Tipo de información Pública clasificada-Prestación del servicio especializado en gestión documental de compañía para la administración y custodia del archivo físico tanto administrativo como misional de la compañía."]
["Financiera y Administrativa","Gcia. Logística",null,"C55872022",92121702,"Prestación de servicios para el mantenimiento preventivo del sistema de detección y alarma contra incendio del inmueble “El Limonar” de la Gerencia Sucursal Valle Tipo A ","2022-08-30",8,"2022-12-31",4.0999999999999996,"Invitación directa","GastosAdministrativos",7175700,7175700,"NO",null,null,null,null,null,null,null,"C55872022-Tipo de informacion Publica,  Prestación de servicios para el mantenimiento preventivo del sistema de detección y alarma contra incendio del inmueble “El Limonar” de la Gerencia Sucursal Valle Tipo A "]
["Financiera y Administrativa","Gcia. Logística",null,null,72101507,"Prestación de servicios para realizar el Mantenimiento Preventivo y Correctivo de los inmuebles donde funcionan las oficinas de Positiva a Nivel Nacional.","2022-03-04",3,"2022-12-31",10.066666666666666,"Invitación pública","GastosAdministrativos",975500000,975500000,"NO",null,null,null,null,null,null,"Publica","Tipo de informacion Publica, Prestación de servicios para realizar el Mantenimiento Preventivo y Correctivo de los inmuebles donde funcionan las oficinas de Positiva a Nivel Nacional."]
["Financiera y Administrativa","Gcia. Logística",null,"C55932021",78181500,"PRESTACION DE SERVICIOS DE MANTENIMIENTO PREVENTIVO CORRECTIVO CON SUMINISTRO DE REPUESTOS INSUMOS Y ACCESORIOS PARA LOS VEHÍCULOS MARCA NISSAN DE PROPIEDAD DE LA COMPAÑÍA ASIGNADOS DE CASA MATRIZ, LAS COORDINADORAS BOGOTA, ANTIOQUIA, ATLANTICO, VALLE Y SANTANDER PARA SOPORTAR LA OPTIMA Y ADECUADA OPERACIÓN DE ESTOS.  ","2022-01-01",1,"2022-12-31",12,"Invitación directa","GastosAdministrativos",85261506,85261506,"SI","APROBADAS",null,"NO","NO","NO","SI","Pública clasificada","C55932021-Tipo de información Pública clasificada-PRESTACION DE SERVICIOS DE MANTENIMIENTO PREVENTIVO CORRECTIVO CON SUMINISTRO DE REPUESTOS INSUMOS Y ACCESORIOS PARA LOS VEHÍCULOS MARCA NISSAN DE PROPIEDAD DE LA COMPAÑÍA ASIGNADOS DE CASA MATRIZ, LAS COORDINADORAS BOGOTA, ANTIOQUIA, ATLANTICO, VALLE Y SANTANDER PARA SOPORTAR LA OPTIMA Y ADECUADA OPERACIÓN DE ESTOS.  "]
["Financiera y Administrativa","Gcia. Logística",null,"C55942021",78181500,"PRESTACION DE SERVICIOS DE MANTENIMIENTO PREVENTIVO CORRECTIVO CON SUMINISTRO DE REPUESTOS INSUMOS Y ACCESORIOS PARA EL VEHICULO DE PROPIEDAD DE LA COMPAÑÍA ASIGNADOS A LA PRESIDENCIA DE POSITIVA COMPAÑIA DE SEGUROS S.A.  PARA SOPORTAR LA OPTIMA Y ADECUADA OPERACIÓN DE ESTE.","2022-01-01",1,"2022-12-31",12,"Invitación directa","GastosAdministrativos",17000000,17000000,"SI","APROBADAS",null,"NO","NO","NO","SI","Pública clasificada","C55942021-Tipo de información Pública clasificada-PRESTACION DE SERVICIOS DE MANTENIMIENTO PREVENTIVO CORRECTIVO CON SUMINISTRO DE REPUESTOS INSUMOS Y ACCESORIOS PARA EL VEHICULO DE PROPIEDAD DE LA COMPAÑÍA ASIGNADOS A LA PRESIDENCIA DE POSITIVA COMPAÑIA DE SEGUROS S.A.  PARA SOPORTAR LA OPTIMA Y ADECUADA OPERACIÓN DE ESTE."]
["Financiera y Administrativa","Gcia. Logística",null,null,80131802,"Prestación de servicios de avalúos inmuebles","2022-10-01",10,"2022-12-31",3.0333333333333332,"Invitación directa","GastosAdministrativos",92799697.588200003,92799697.588200003,"NO",null,null,"NO","NO","NO","SI","Pública clasificada","-Tipo de información Pública clasificada-Prestación de servicios de avalúos inmuebles"]
["Financiera y Administrativa","Gcia. Logística",null,null,80111617,"Prestar servicios profesionales de Arquitecto, brindando apoyo y acompañamiento para la atención de los diferentes procesos, actividades y gestiones a cargo de la Gerencia de Logística de la Vicepresidencia Financiera y Administrativa de Positiva Compañía de Seguros.","2022-01-01",1,"2022-06-30",6,"Invitación directa","GastosAdministrativos",24000000,24000000,"NO",null,null,"SI","NO","NO","SI","Pública clasificada","-Tipo de información Pública clasificada-Prestar servicios profesionales de Arquitecto, brindando apoyo y acompañamiento para la atención de los diferentes procesos, actividades y gestiones a cargo de la Gerencia de Logística de la Vicepresidencia Financiera y Administrativa de Positiva Compañía de Seguros."]
["Financiera y Administrativa","Gcia. Logística",null,null,72101507,"Mantenimiento sede Florencia","2022-01-10",1,"2022-02-10",1.0333333333333334,"Invitación directa","GastosAdministrativos",20604329,20604329,"NO",null,null,"NO","NO","NO","NO","Pública","-Tipo de información Pública-Mantenimiento sede Florencia"]
["Financiera y Administrativa","Gcia. Logística",null,null,72101507,"Obra: punto de atención Medellin","2022-01-10",1,"2022-02-14",1.1666666666666667,"Invitación directa","GastosAdministrativos",120803118,120803118,"NO",null,null,"NO","NO","NO","NO","Pública","-Tipo de información Pública-Obra: punto de atención Medellin"]
["Financiera y Administrativa","Gcia. Logística",null,null,72101507,"Obra: sede administrativa Medellin","2022-01-17",1,"2022-02-21",1.1666666666666667,"Invitación directa","GastosAdministrativos",170079466,170079466,"NO",null,null,"NO","NO","NO","NO","Pública","-Tipo de información Pública-Obra: sede administrativa Medellin"]
["Financiera y Administrativa","Gcia. Logística",null,null,72151207,"Compraventa e instalación de aires acondicionados Medellin (sede administrativa y punto de atención)","2022-01-15",1,"2022-02-15",1.0333333333333334,"Invitación directa","GastosAdministrativos",200324235,200324235,"NO",null,null,"NO","NO","NO","NO","Pública","-Tipo de información Pública-Compraventa e instalación de aires acondicionados Medellin (sede administrativa y punto de atención)"]
["Financiera y Administrativa","Gcia. Logística",null,null,"14111828,44122003,44111515","Prestacion de servicios de suministro de papeleria utiles de oficina y elementos de archivo a nivel nacional","2022-07-01",7,"2022-12-15",16,"Invitación directa","GastosAdministrativos",70000000,70000000,"NO",null,null,"NO","NO","NO","SI","Pública clasificada","-Tipo de información Pública clasificada-Prestacion de servicios de suministro de papeleria utiles de oficina y elementos de archivo a nivel nacional"]
["Financiera y Administrativa","Gcia. Logística",null,null,520000000,"suministro de elelmentos/ dispositivos sucursales","2022-02-01",2,"2022-02-15",9,"Tienda virtual","GastosAdministrativos",30000000,30000000,"NO",null,null,"NO","NO","NO","SI","Pública clasificada","Tipo de información Pública clasificada-Prestacion de servicios de suministro y elementos / dispositivos para las sucursalesa nivel nacional"]
["Secretaria General y Jurídica","Ofic. Control Interno","NO","C10022022","43211500","Contrato de arrendamiento vigencia 2022 – 2023 de las licencias como administrador y usuarios de campo en la plataforma tecnológica RESOLVER:CORE, la cual soporta la trazabilidad del proceso de Auditoría Interna.","2022-10-01",{"$f":"MONTH(G682)","v":10},"2023-10-31",{"$f":"_xlfn.DAYS(I682,G682)/30","v":13.166666666666666},"Invitación directa","GastosAdministrativos",95300400,95300400,"NO","NA","Gerencia de Abastecimiento Estratégico\ncontratacion@positiva.gov.co\nPBX: (1)6502200 Ext: 10641","NO","NO","NO","NO",{"$f":"IF(U682=\"SI\",\"Pública clasificada\",\"Pública\")","v":"Pública"},{"$f":"CONCATENATE(D682,\"-\",\"Tipo de información\",\" \",V682,\"-\",F682)","v":"C10022022-Tipo de información Pública-Contrato de arrendamiento vigencia 2022 – 2023 de las licencias como administrador y usuarios de campo en la plataforma tecnológica RESOLVER:CORE, la cual soporta la trazabilidad del proceso de Auditoría Interna."}]
["SECRETARIA GENERAL Y JURÍDICA","Oficina de Tecnologías de la Información","NO","C05102022",81111506,"Prestación de servicios soporte técnico de fabricante DELL para 1 chasis y 4 cuchillas","2022-11-01",{"$f":"MONTH(G683)","v":11},"2023-10-31",{"$f":"MONTH(I683-G683)","v":12},"Invitación directa","GastosAdministrativos",70400000,70400000,"NO","N/A","Gerencia de Abastecimiento Estratégico\ncontratacion@positiva.gov.co\nPBX: (1)6502200 Ext: 10641","NO","NO","NO","NO",{"$f":"IF(U683=\"SI\",\"Pública clasificada\",\"Pública\")","v":"Pública"},{"$f":"CONCATENATE(D683,\"-\",\"Tipo de información\",\" \",V683,\"-\",F683)","v":"C05102022-Tipo de información Pública-Prestación de servicios soporte técnico de fabricante DELL para 1 chasis y 4 cuchillas"}]
["SECRETARIA GENERAL Y JURÍDICA","Oficina de Tecnologías de la Información","NO","C05132022",81112200,"Compra-venta de plataforma de almacenamiento principal con capacidad 300TB efectivas Incluyendo Switch de fibra para interconexion con Server.","2022-07-15",{"$f":"MONTH(G684)","v":7},"2023-07-14",{"$f":"MONTH(I684-G684)","v":12},"Invitación cerrada","GastosAdministrativos",2715929585,2715929585,"NO","N/A","Gerencia de Abastecimiento Estratégico\ncontratacion@positiva.gov.co\nPBX: (1)6502200 Ext: 10641","NO","NO","NO","NO",{"$f":"IF(U684=\"SI\",\"Pública clasificada\",\"Pública\")","v":"Pública"},{"$f":"CONCATENATE(D684,\"-\",\"Tipo de información\",\" \",V684,\"-\",F684)","v":"C05132022-Tipo de información Pública-Compra-venta de plataforma de almacenamiento principal con capacidad 300TB efectivas Incluyendo Switch de fibra para interconexion con Server."}]
["SECRETARIA GENERAL Y JURÍDICA","Oficina de Tecnologías de la Información","NO","C05142022",81112200,"Subscripcion de JAVA para soporte con de Fabricante","2022-07-01",{"$f":"MONTH(G685)","v":7},"2023-06-30",{"$f":"MONTH(I685-G685)","v":12},"Invitación directa","GastosAdministrativos",380800000,380800000,"NO","N/A","Gerencia de Abastecimiento Estratégico\ncontratacion@positiva.gov.co\nPBX: (1)6502200 Ext: 10641","NO","NO","NO","NO",{"$f":"IF(U685=\"SI\",\"Pública clasificada\",\"Pública\")","v":"Pública"},{"$f":"CONCATENATE(D685,\"-\",\"Tipo de información\",\" \",V685,\"-\",F685)","v":"C05142022-Tipo de información Pública-Subscripcion de JAVA para soporte con de Fabricante"}]
["SECRETARIA GENERAL Y JURÍDICA","Oficina de Tecnologías de la Información","NO","C05152022",72151514,"Arrendamiento; Servicio de arrendamiento UPS","2022-10-01",{"$f":"MONTH(G686)","v":10},"2023-09-30",{"$f":"MONTH(I686-G686)","v":12},"Invitación directa","GastosAdministrativos",31534845,31534845,"SI","N/A","Gerencia de Abastecimiento Estratégico\ncontratacion@positiva.gov.co\nPBX: (1)6502200 Ext: 10641","NO","NO","NO","NO",{"$f":"IF(U686=\"SI\",\"Pública clasificada\",\"Pública\")","v":"Pública"},{"$f":"CONCATENATE(D686,\"-\",\"Tipo de información\",\" \",V686,\"-\",F686)","v":"C05152022-Tipo de información Pública-Arrendamiento; Servicio de arrendamiento UPS"}]
["SECRETARIA GENERAL Y JURÍDICA","Oficina de Tecnologías de la Información","NO","C05162022",43212200,"Servicio de conectividad WAN de la red nacional de Positiva y Servicios en ambiente de contingencia (Data Center Alterno)","2022-09-01",{"$f":"MONTH(G687)","v":9},"2023-08-31",{"$f":"MONTH(I687-G687)","v":12},"Invitación directa","GastosAdministrativos",2612820960,2612820960,"SI","N/A","Gerencia de Abastecimiento Estratégico\ncontratacion@positiva.gov.co\nPBX: (1)6502200 Ext: 10641","NO","SI","SI","NO",{"$f":"IF(U687=\"SI\",\"Pública clasificada\",\"Pública\")","v":"Pública"},{"$f":"CONCATENATE(D687,\"-\",\"Tipo de información\",\" \",V687,\"-\",F687)","v":"C05162022-Tipo de información Pública-Servicio de conectividad WAN de la red nacional de Positiva y Servicios en ambiente de contingencia (Data Center Alterno)"}]
["SECRETARIA GENERAL Y JURÍDICA","Oficina de Tecnologías de la Información","NO","C05172022",81112101,"Servicio de conectividad WAN de la red nacional de Positiva y Servicios de Data Center","2022-09-01",{"$f":"MONTH(G688)","v":9},"2023-08-31",{"$f":"MONTH(I688-G688)","v":12},"Invitación directa","GastosAdministrativos",1832431353,1832431353,"SI","N/A","Gerencia de Abastecimiento Estratégico\ncontratacion@positiva.gov.co\nPBX: (1)6502200 Ext: 10641","NO","SI","SI","NO",{"$f":"IF(U688=\"SI\",\"Pública clasificada\",\"Pública\")","v":"Pública"},{"$f":"CONCATENATE(D688,\"-\",\"Tipo de información\",\" \",V688,\"-\",F688)","v":"C05172022-Tipo de información Pública-Servicio de conectividad WAN de la red nacional de Positiva y Servicios de Data Center"}]
["SECRETARIA GENERAL Y JURÍDICA","Oficina de Tecnologías de la Información","NO","C05182022",81112101,"Prestación de servicios de comunicaciones a través del canal dedicado de internet que funcionará como Canal de contingencia y Prestación de servicios de internet público inalámbrico y gratuito wifi","2022-07-01",{"$f":"MONTH(G689)","v":7},"2023-06-30",{"$f":"MONTH(I689-G689)","v":12},"Invitación directa","GastosAdministrativos",168200208,168200208,"SI","N/A","Gerencia de Abastecimiento Estratégico\ncontratacion@positiva.gov.co\nPBX: (1)6502200 Ext: 10641","NO","NO","SI","NO",{"$f":"IF(U689=\"SI\",\"Pública clasificada\",\"Pública\")","v":"Pública"},{"$f":"CONCATENATE(D689,\"-\",\"Tipo de información\",\" \",V689,\"-\",F689)","v":"C05182022-Tipo de información Pública-Prestación de servicios de comunicaciones a través del canal dedicado de internet que funcionará como Canal de contingencia y Prestación de servicios de internet público inalámbrico y gratuito wifi"}]
["SECRETARIA GENERAL Y JURÍDICA","Oficina de Tecnologías de la Información","NO","C05222022",81112501,"Adquisicion de licenciamiento con actualizacion y soporte para las licencias de Aranda ASSET Management, Aranda Service Desk para contingencia.","2022-11-20",{"$f":"MONTH(G690)","v":11},"2023-11-19",{"$f":"MONTH(I690-G690)","v":12},"Invitación directa","GastosAdministrativos",219872902,219872902,"NO","N/A","Gerencia de Abastecimiento Estratégico\ncontratacion@positiva.gov.co\nPBX: (1)6502200 Ext: 10641","NO","NO","NO","NO",{"$f":"IF(U690=\"SI\",\"Pública clasificada\",\"Pública\")","v":"Pública"},{"$f":"CONCATENATE(D690,\"-\",\"Tipo de información\",\" \",V690,\"-\",F690)","v":"C05222022-Tipo de información Pública-Adquisicion de licenciamiento con actualizacion y soporte para las licencias de Aranda ASSET Management, Aranda Service Desk para contingencia."}]
["SECRETARIA GENERAL Y JURÍDICA","Oficina de Tecnologías de la Información","NO","C05232022",81112500,"Renovación del Software Assurance, y adquisición de licenciamiento Microsoft por un (1) año, bajo esquema  CSP y MPSA , con las características que se describen en las especificaciones técnicas.","2022-07-01",{"$f":"MONTH(G691)","v":7},"2023-06-30",{"$f":"MONTH(I691-G691)","v":12},"Invitación cerrada","GastosAdministrativos",2400120000,2400120000,"NO","N/A","Gerencia de Abastecimiento Estratégico\ncontratacion@positiva.gov.co\nPBX: (1)6502200 Ext: 10641","NO","NO","NO","NO",{"$f":"IF(U691=\"SI\",\"Pública clasificada\",\"Pública\")","v":"Pública"},{"$f":"CONCATENATE(D691,\"-\",\"Tipo de información\",\" \",V691,\"-\",F691)","v":"C05232022-Tipo de información Pública-Renovación del Software Assurance, y adquisición de licenciamiento Microsoft por un (1) año, bajo esquema  CSP y MPSA , con las características que se describen en las especificaciones técnicas."}]
["SECRETARIA GENERAL Y JURÍDICA","Oficina de Tecnologías de la Información","NO","C05242022",43231512,"Licenciamiento Acrobat","2022-10-31",{"$f":"MONTH(G692)","v":10},"2023-10-30",{"$f":"MONTH(I692-G692)","v":12},"Invitación directa","GastosAdministrativos",56628250,56628250,"NO","N/A","Gerencia de Abastecimiento Estratégico\ncontratacion@positiva.gov.co\nPBX: (1)6502200 Ext: 10641","NO","NO","NO","NO",{"$f":"IF(U692=\"SI\",\"Pública clasificada\",\"Pública\")","v":"Pública"},{"$f":"CONCATENATE(D692,\"-\",\"Tipo de información\",\" \",V692,\"-\",F692)","v":"C05242022-Tipo de información Pública-Licenciamiento Acrobat"}]
["SECRETARIA GENERAL Y JURÍDICA","Oficina de Tecnologías de la Información","NO","C05302022",43233205,"Prestación de Servicios; renovación y mantenimiento de  la herramienta de  Cifrado  de  Información para todas   las  aplicaciones  que  transfieren  archivos  a  SAP. Cryptocenter","2022-12-14",{"$f":"MONTH(G693)","v":12},"2023-12-13",{"$f":"MONTH(I693-G693)","v":12},"Invitación directa","GastosAdministrativos",109517856,109517856,"NO","N/A","Gerencia de Abastecimiento Estratégico\ncontratacion@positiva.gov.co\nPBX: (1)6502200 Ext: 10641","NO","NO","SI","NO",{"$f":"IF(U693=\"SI\",\"Pública clasificada\",\"Pública\")","v":"Pública"},{"$f":"CONCATENATE(D693,\"-\",\"Tipo de información\",\" \",V693,\"-\",F693)","v":"C05302022-Tipo de información Pública-Prestación de Servicios; renovación y mantenimiento de  la herramienta de  Cifrado  de  Información para todas   las  aplicaciones  que  transfieren  archivos  a  SAP. Cryptocenter"}]
["SECRETARIA GENERAL Y JURÍDICA","Oficina de Tecnologías de la Información","NO","C05312022",43233205,"Prestación de Servicios; renovación y mantenimiento de  la herramienta de  Cifrado  de  Información para todas  las  aplicaciones  que  transfieren  archivos  a  SAP en contingencia.","2022-07-30",{"$f":"MONTH(G694)","v":7},"2023-07-29",{"$f":"MONTH(I694-G694)","v":12},"Invitación directa","GastosAdministrativos",24097500,24097500,"NO","N/A","Gerencia de Abastecimiento Estratégico\ncontratacion@positiva.gov.co\nPBX: (1)6502200 Ext: 10641","NO","NO","SI","NO",{"$f":"IF(U694=\"SI\",\"Pública clasificada\",\"Pública\")","v":"Pública"},{"$f":"CONCATENATE(D694,\"-\",\"Tipo de información\",\" \",V694,\"-\",F694)","v":"C05312022-Tipo de información Pública-Prestación de Servicios; renovación y mantenimiento de  la herramienta de  Cifrado  de  Información para todas  las  aplicaciones  que  transfieren  archivos  a  SAP en contingencia."}]
["SECRETARIA GENERAL Y JURÍDICA","Oficina de Tecnologías de la Información","NO","C05322022",43211507,"Suministrar el licenciamiento por subscripción tipo SaaS necesario para proveer el servicio de acceso remoto a PC y el servicio de escritorios y aplicaciones virtuales. ","2022-09-20",{"$f":"MONTH(G695)","v":9},"2023-09-19",{"$f":"MONTH(I695-G695)","v":12},"Invitación directa","GastosAdministrativos",451500000,451500000,"NO","N/A","Gerencia de Abastecimiento Estratégico\ncontratacion@positiva.gov.co\nPBX: (1)6502200 Ext: 10641","NO","NO","NO","NO",{"$f":"IF(U695=\"SI\",\"Pública clasificada\",\"Pública\")","v":"Pública"},{"$f":"CONCATENATE(D695,\"-\",\"Tipo de información\",\" \",V695,\"-\",F695)","v":"C05322022-Tipo de información Pública-Suministrar el licenciamiento por subscripción tipo SaaS necesario para proveer el servicio de acceso remoto a PC y el servicio de escritorios y aplicaciones virtuales. "}]
["SECRETARIA GENERAL Y JURÍDICA","Oficina de Tecnologías de la Información","NO","C05332022",32151802,"Prestación de Servicios; renovación mantenimiento Certificados Digitales SSL para sitios WEB de la Compañía.","2022-10-01",{"$f":"MONTH(G696)","v":10},"2023-09-30",{"$f":"MONTH(I696-G696)","v":12},"Invitación directa","GastosAdministrativos",119124746,119124746,"NO","N/A","Gerencia de Abastecimiento Estratégico\ncontratacion@positiva.gov.co\nPBX: (1)6502200 Ext: 10641","NO","NO","NO","NO",{"$f":"IF(U696=\"SI\",\"Pública clasificada\",\"Pública\")","v":"Pública"},{"$f":"CONCATENATE(D696,\"-\",\"Tipo de información\",\" \",V696,\"-\",F696)","v":"C05332022-Tipo de información Pública-Prestación de Servicios; renovación mantenimiento Certificados Digitales SSL para sitios WEB de la Compañía."}]
["SECRETARIA GENERAL Y JURÍDICA","Oficina de Tecnologías de la Información","NO","C05352022",81112501,"Soporte Técnico licenciamiento FIREWALL ","2022-11-01",{"$f":"MONTH(G697)","v":11},"2023-10-31",{"$f":"MONTH(I697-G697)","v":12},"Invitación directa","GastosAdministrativos",55000000,55000000,"NO","N/A","Gerencia de Abastecimiento Estratégico\ncontratacion@positiva.gov.co\nPBX: (1)6502200 Ext: 10641","NO","SI","SI","NO",{"$f":"IF(U697=\"SI\",\"Pública clasificada\",\"Pública\")","v":"Pública"},{"$f":"CONCATENATE(D697,\"-\",\"Tipo de información\",\" \",V697,\"-\",F697)","v":"C05352022-Tipo de información Pública-Soporte Técnico licenciamiento FIREWALL "}]
["SECRETARIA GENERAL Y JURÍDICA","Oficina de Tecnologías de la Información","NO","C05362022",81111801,"Renovación Licenciamiento FIREWALL de seguridad perimetral para garantizar la seguridad de la informacion","2022-11-01",{"$f":"MONTH(G698)","v":11},"2023-10-31",{"$f":"MONTH(I698-G698)","v":12},"Invitación directa","GastosAdministrativos",70000000,70000000,"NO","N/A","Gerencia de Abastecimiento Estratégico\ncontratacion@positiva.gov.co\nPBX: (1)6502200 Ext: 10641","NO","SI","SI","NO",{"$f":"IF(U698=\"SI\",\"Pública clasificada\",\"Pública\")","v":"Pública"},{"$f":"CONCATENATE(D698,\"-\",\"Tipo de información\",\" \",V698,\"-\",F698)","v":"C05362022-Tipo de información Pública-Renovación Licenciamiento FIREWALL de seguridad perimetral para garantizar la seguridad de la informacion"}]
["SECRETARIA GENERAL Y JURÍDICA","Oficina de Tecnologías de la Información","NO","C05442022",81111801,"Renovación del licenciamiento de Forcepoint para DLP en solución híbrida (nube privada fabricante y on premise), incluyendo soporte y garantía de fabricante para el licenciamiento Essential en modalidad 7x24.","2022-06-08",{"$f":"MONTH(G699)","v":6},"2023-06-09",{"$f":"MONTH(I699-G699)","v":12},"Invitación directa","GastosAdministrativos",267851692,267851692,"NO","N/A","Gerencia de Abastecimiento Estratégico\ncontratacion@positiva.gov.co\nPBX: (1)6502200 Ext: 10641","NO","NO","NO","NO",{"$f":"IF(U699=\"SI\",\"Pública clasificada\",\"Pública\")","v":"Pública"},{"$f":"CONCATENATE(D699,\"-\",\"Tipo de información\",\" \",V699,\"-\",F699)","v":"C05442022-Tipo de información Pública-Renovación del licenciamiento de Forcepoint para DLP en solución híbrida (nube privada fabricante y on premise), incluyendo soporte y garantía de fabricante para el licenciamiento Essential en modalidad 7x24."}]
["SECRETARIA GENERAL Y JURÍDICA","Oficina de Tecnologías de la Información","NO","C05452022",43233205,"Soporte Técnico licenciamiento SAINT para análisis de vulnerabilidades y pruebas de penetración de la infraestructura de Servidores y de las aplicaciones misionales","2022-09-08",{"$f":"MONTH(G700)","v":9},"2023-09-07",{"$f":"MONTH(I700-G700)","v":12},"Invitación directa","GastosAdministrativos",18117750,18117750,"NO","N/A","Gerencia de Abastecimiento Estratégico\ncontratacion@positiva.gov.co\nPBX: (1)6502200 Ext: 10641","NO","NO","SI","NO",{"$f":"IF(U700=\"SI\",\"Pública clasificada\",\"Pública\")","v":"Pública"},{"$f":"CONCATENATE(D700,\"-\",\"Tipo de información\",\" \",V700,\"-\",F700)","v":"C05452022-Tipo de información Pública-Soporte Técnico licenciamiento SAINT para análisis de vulnerabilidades y pruebas de penetración de la infraestructura de Servidores y de las aplicaciones misionales"}]
["SECRETARIA GENERAL Y JURÍDICA","Oficina de Tecnologías de la Información","NO","C05462022",43233205,"Licenciamiento; Renovación Licenciamiento SAINT para análisis de vulnerabilidades y pruebas de penetración de la infraestructura de Servidores y de las aplicaciones misionales","2022-09-08",{"$f":"MONTH(G701)","v":9},"2023-09-07",{"$f":"MONTH(I701-G701)","v":12},"Invitación directa","GastosAdministrativos",30461810,30461810,"NO","N/A","Gerencia de Abastecimiento Estratégico\ncontratacion@positiva.gov.co\nPBX: (1)6502200 Ext: 10641","NO","NO","NO","NO",{"$f":"IF(U701=\"SI\",\"Pública clasificada\",\"Pública\")","v":"Pública"},{"$f":"CONCATENATE(D701,\"-\",\"Tipo de información\",\" \",V701,\"-\",F701)","v":"C05462022-Tipo de información Pública-Licenciamiento; Renovación Licenciamiento SAINT para análisis de vulnerabilidades y pruebas de penetración de la infraestructura de Servidores y de las aplicaciones misionales"}]
["SECRETARIA GENERAL Y JURÍDICA","Oficina de Tecnologías de la Información","NO","C05522022",43231512,"Adquisicion de Licenciamiento Aruba","2022-07-18",{"$f":"MONTH(G702)","v":7},"2023-07-17",{"$f":"MONTH(I702-G702)","v":12},"Invitación cerrada","GastosAdministrativos",60000000,60000000,"NO","N/A","Gerencia de Abastecimiento Estratégico\ncontratacion@positiva.gov.co\nPBX: (1)6502200 Ext: 10641","NO","NO","NO","NO",{"$f":"IF(U702=\"SI\",\"Pública clasificada\",\"Pública\")","v":"Pública"},{"$f":"CONCATENATE(D702,\"-\",\"Tipo de información\",\" \",V702,\"-\",F702)","v":"C05522022-Tipo de información Pública-Adquisicion de Licenciamiento Aruba"}]
["SECRETARIA GENERAL Y JURÍDICA","Oficina de Tecnologías de la Información","NO","C05572022",81112000,"Adqusicion de licenciamiento Veritas netbackup 16 TB con soporte por 1 año","2022-03-29",{"$f":"MONTH(G703)","v":3},"2023-03-28",{"$f":"MONTH(I703-G703)","v":12},"Invitación directa","GastosAdministrativos",305116000,305116000,"NO","N/A","Gerencia de Abastecimiento Estratégico\ncontratacion@positiva.gov.co\nPBX: (1)6502200 Ext: 10641","NO","NO","NO","NO",{"$f":"IF(U703=\"SI\",\"Pública clasificada\",\"Pública\")","v":"Pública"},{"$f":"CONCATENATE(D703,\"-\",\"Tipo de información\",\" \",V703,\"-\",F703)","v":"C05572022-Tipo de información Pública-Adqusicion de licenciamiento Veritas netbackup 16 TB con soporte por 1 año"}]
["SECRETARIA GENERAL Y JURÍDICA","Oficina de Tecnologías de la Información","NO","C05582022",81112000,"Adquisicion librería de cintas 3 Drive LTO8 y 1 Drive LTO7 con tres años de garantia ","2022-08-01",{"$f":"MONTH(G704)","v":8},"2023-07-30",{"$f":"MONTH(I704-G704)","v":12},"Invitación directa","GastosAdministrativos",132566600,132566600,"NO","N/A","Gerencia de Abastecimiento Estratégico\ncontratacion@positiva.gov.co\nPBX: (1)6502200 Ext: 10641","NO","NO","NO","NO",{"$f":"IF(U704=\"SI\",\"Pública clasificada\",\"Pública\")","v":"Pública"},{"$f":"CONCATENATE(D704,\"-\",\"Tipo de información\",\" \",V704,\"-\",F704)","v":"C05582022-Tipo de información Pública-Adquisicion librería de cintas 3 Drive LTO8 y 1 Drive LTO7 con tres años de garantia "}]
["SECRETARIA GENERAL Y JURÍDICA","Oficina de Tecnologías de la Información","NO","C05602022",81112501,"Adquisicion de licenciamiento aranda path ","2022-11-19",{"$f":"MONTH(G705)","v":11},"2023-11-18",{"$f":"MONTH(I705-G705)","v":12},"Invitación directa","GastosAdministrativos",129550621,129550621,"NO","N/A","Gerencia de Abastecimiento Estratégico\ncontratacion@positiva.gov.co\nPBX: (1)6502200 Ext: 10641","NO","NO","NO","NO",{"$f":"IF(U705=\"SI\",\"Pública clasificada\",\"Pública\")","v":"Pública"},{"$f":"CONCATENATE(D705,\"-\",\"Tipo de información\",\" \",V705,\"-\",F705)","v":"C05602022-Tipo de información Pública-Adquisicion de licenciamiento aranda path "}]
["SECRETARIA GENERAL Y JURÍDICA","Oficina de Tecnologías de la Información","NO","C05612022",81112500,"Compra licencias  Oracle WebLogic Suite - Processor Perpetual PN L5900 y una licencia de Oracle DB Enterprise Enterprise Edition con sus respectivos Software Update License & Suppor","2022-07-01",{"$f":"MONTH(G706)","v":7},"2022-12-31",{"$f":"MONTH(I706-G706)","v":7},"Invitación cerrada","GastosAdministrativos",768085044,768085044,"NO","N/A","Gerencia de Abastecimiento Estratégico\ncontratacion@positiva.gov.co\nPBX: (1)6502200 Ext: 10641","NO","NO","NO","NO",{"$f":"IF(U706=\"SI\",\"Pública clasificada\",\"Pública\")","v":"Pública"},{"$f":"CONCATENATE(D706,\"-\",\"Tipo de información\",\" \",V706,\"-\",F706)","v":"C05612022-Tipo de información Pública-Compra licencias  Oracle WebLogic Suite - Processor Perpetual PN L5900 y una licencia de Oracle DB Enterprise Enterprise Edition con sus respectivos Software Update License & Suppor"}]
["SECRETARIA GENERAL Y JURÍDICA","Oficina de Tecnologías de la Información","NO","C05632022",81112200,"Suscripción de servicio de la herramienta RESOLVER CORE para la Oficina de Control Interno","2022-10-21",{"$f":"MONTH(G707)","v":10},"2023-10-20",{"$f":"MONTH(I707-G707)","v":12},"Invitación directa","GastosAdministrativos",120640000,120640000,"NO","N/A","Gerencia de Abastecimiento Estratégico\ncontratacion@positiva.gov.co\nPBX: (1)6502200 Ext: 10641","NO","NO","NO","NO",{"$f":"IF(U707=\"SI\",\"Pública clasificada\",\"Pública\")","v":"Pública"},{"$f":"CONCATENATE(D707,\"-\",\"Tipo de información\",\" \",V707,\"-\",F707)","v":"C05632022-Tipo de información Pública-Suscripción de servicio de la herramienta RESOLVER CORE para la Oficina de Control Interno"}]
["SECRETARIA GENERAL Y JURÍDICA","Oficina de Tecnologías de la Información","NO","C05642022",81112105,"Arrendamiento; PaaS (Plataforma como Servicio) Actualización de la plataforma tecnológica en la que está desarrollada el Portal Web de POSITIVA Compañía de Seguros S.A.","2022-08-05",{"$f":"MONTH(G708)","v":8},"2023-08-04",{"$f":"MONTH(I708-G708)","v":12},"Invitación cerrada","GastosAdministrativos",654500000,654500000,"NO","N/A","Gerencia de Abastecimiento Estratégico\ncontratacion@positiva.gov.co\nPBX: (1)6502200 Ext: 10641","NO","NO","NO","NO",{"$f":"IF(U708=\"SI\",\"Pública clasificada\",\"Pública\")","v":"Pública"},{"$f":"CONCATENATE(D708,\"-\",\"Tipo de información\",\" \",V708,\"-\",F708)","v":"C05642022-Tipo de información Pública-Arrendamiento; PaaS (Plataforma como Servicio) Actualización de la plataforma tecnológica en la que está desarrollada el Portal Web de POSITIVA Compañía de Seguros S.A."}]
["SECRETARIA GENERAL Y JURÍDICA","Oficina de Tecnologías de la Información","NO","C05692022",32150000,"Renovación mantenimiento de Licencias Anywhere Automation RPA","2022-12-15",{"$f":"MONTH(G709)","v":12},"2023-12-14",{"$f":"MONTH(I709-G709)","v":12},"Invitación directa","GastosAdministrativos",87351048,87351048,"NO","N/A","Gerencia de Abastecimiento Estratégico\ncontratacion@positiva.gov.co\nPBX: (1)6502200 Ext: 10641","NO","NO","NO","NO",{"$f":"IF(U709=\"SI\",\"Pública clasificada\",\"Pública\")","v":"Pública"},{"$f":"CONCATENATE(D709,\"-\",\"Tipo de información\",\" \",V709,\"-\",F709)","v":"C05692022-Tipo de información Pública-Renovación mantenimiento de Licencias Anywhere Automation RPA"}]
["SECRETARIA GENERAL Y JURÍDICA","Oficina de Tecnologías de la Información","NO","C05712022",43232202,"Prestación de Servicios mantenimiento de firma electrónica ADOBE SIGN","2022-11-22",{"$f":"MONTH(G710)","v":11},"2023-11-21",{"$f":"MONTH(I710-G710)","v":12},"Invitación directa","GastosAdministrativos",106600000,106600000,"NO","N/A","Gerencia de Abastecimiento Estratégico\ncontratacion@positiva.gov.co\nPBX: (1)6502200 Ext: 10641","NO","NO","NO","NO",{"$f":"IF(U710=\"SI\",\"Pública clasificada\",\"Pública\")","v":"Pública"},{"$f":"CONCATENATE(D710,\"-\",\"Tipo de información\",\" \",V710,\"-\",F710)","v":"C05712022-Tipo de información Pública-Prestación de Servicios mantenimiento de firma electrónica ADOBE SIGN"}]
["SECRETARIA GENERAL Y JURÍDICA","Oficina de Tecnologías de la Información","NO","C05732022",81000000,"Prestación de Servicio; desarrollo de nuevos productos sobre la plataforma IAXIS y web","2022-09-01",{"$f":"MONTH(G711)","v":9},"2022-12-31",{"$f":"MONTH(I711-G711)","v":4},"Invitación directa","GastosAdministrativos",600000000,600000000,"NO","N/A","Gerencia de Abastecimiento Estratégico\ncontratacion@positiva.gov.co\nPBX: (1)6502200 Ext: 10641","NO","NO","NO","NO",{"$f":"IF(U711=\"SI\",\"Pública clasificada\",\"Pública\")","v":"Pública"},{"$f":"CONCATENATE(D711,\"-\",\"Tipo de información\",\" \",V711,\"-\",F711)","v":"C05732022-Tipo de información Pública-Prestación de Servicio; desarrollo de nuevos productos sobre la plataforma IAXIS y web"}]
["SECRETARIA GENERAL Y JURÍDICA","Oficina de Tecnologías de la Información","NO","C05742022",81000000,"Prestación de Servicios; ROADMAP - VIDA Productos FASE II","2022-09-01",{"$f":"MONTH(G712)","v":9},"2022-12-31",{"$f":"MONTH(I712-G712)","v":4},"Invitación directa","GastosAdministrativos",1832287920,1832287920,"NO","N/A","Gerencia de Abastecimiento Estratégico\ncontratacion@positiva.gov.co\nPBX: (1)6502200 Ext: 10641","NO","NO","NO","NO",{"$f":"IF(U712=\"SI\",\"Pública clasificada\",\"Pública\")","v":"Pública"},{"$f":"CONCATENATE(D712,\"-\",\"Tipo de información\",\" \",V712,\"-\",F712)","v":"C05742022-Tipo de información Pública-Prestación de Servicios; ROADMAP - VIDA Productos FASE II"}]
["SECRETARIA GENERAL Y JURÍDICA","Oficina de Tecnologías de la Información","NO","C05762022",81000000,"Prestación de servicio, Implementación nuevas funcionalidades ERP (SAP) - S4HANA Licenciamiento","2022-08-15",{"$f":"MONTH(G713)","v":8},"2022-12-31",{"$f":"MONTH(I713-G713)","v":5},"Invitación directa","GastosAdministrativos",1694560000,1694560000,"NO","N/A","Gerencia de Abastecimiento Estratégico\ncontratacion@positiva.gov.co\nPBX: (1)6502200 Ext: 10641","NO","NO","NO","NO",{"$f":"IF(U713=\"SI\",\"Pública clasificada\",\"Pública\")","v":"Pública"},{"$f":"CONCATENATE(D713,\"-\",\"Tipo de información\",\" \",V713,\"-\",F713)","v":"C05762022-Tipo de información Pública-Prestación de servicio, Implementación nuevas funcionalidades ERP (SAP) - S4HANA Licenciamiento"}]
["SECRETARIA GENERAL Y JURÍDICA","Oficina de Tecnologías de la Información","NO","C05772022",81000000,"Prestación de servicio, Implementación nuevas funcionalidades ERP (SAP) - S4HANA - Servicios","2022-08-15",{"$f":"MONTH(G714)","v":8},"2022-12-31",{"$f":"MONTH(I714-G714)","v":5},"Invitación directa","GastosAdministrativos",680000000,680000000,"NO","N/A","Gerencia de Abastecimiento Estratégico\ncontratacion@positiva.gov.co\nPBX: (1)6502200 Ext: 10641","NO","NO","NO","NO",{"$f":"IF(U714=\"SI\",\"Pública clasificada\",\"Pública\")","v":"Pública"},{"$f":"CONCATENATE(D714,\"-\",\"Tipo de información\",\" \",V714,\"-\",F714)","v":"C05772022-Tipo de información Pública-Prestación de servicio, Implementación nuevas funcionalidades ERP (SAP) - S4HANA - Servicios"}]
["SECRETARIA GENERAL Y JURÍDICA","Oficina de Tecnologías de la Información","NO","C05922022",43231512,"Conversión de Licencias SAP ASE Base de Datos ALWAYS ON (SIARP-SISE)","2022-07-01",{"$f":"MONTH(G715)","v":7},"2022-12-31",{"$f":"MONTH(I715-G715)","v":7},"Invitación directa","GastosAdministrativos",670800000,670800000,"NO","N/A","Gerencia de Abastecimiento Estratégico\ncontratacion@positiva.gov.co\nPBX: (1)6502200 Ext: 10641","NO","NO","NO","NO",{"$f":"IF(U715=\"SI\",\"Pública clasificada\",\"Pública\")","v":"Pública"},{"$f":"CONCATENATE(D715,\"-\",\"Tipo de información\",\" \",V715,\"-\",F715)","v":"C05922022-Tipo de información Pública-Conversión de Licencias SAP ASE Base de Datos ALWAYS ON (SIARP-SISE)"}]
["SECRETARIA GENERAL Y JURÍDICA","Oficina de Tecnologías de la Información","NO","C05932022",43231512,"Implementación de JBPM - Red Hat OpenShift Container Platform with Middleware Portfolio, Premium, (2 Cores or 4 vCPUs) Cantidad: 8","2022-09-01",{"$f":"MONTH(G716)","v":9},"2022-12-31",{"$f":"MONTH(I716-G716)","v":4},"Invitación directa","GastosAdministrativos",433680000,433680000,"NO","N/A","Gerencia de Abastecimiento Estratégico\ncontratacion@positiva.gov.co\nPBX: (1)6502200 Ext: 10641","NO","NO","NO","NO",{"$f":"IF(U716=\"SI\",\"Pública clasificada\",\"Pública\")","v":"Pública"},{"$f":"CONCATENATE(D716,\"-\",\"Tipo de información\",\" \",V716,\"-\",F716)","v":"C05932022-Tipo de información Pública-Implementación de JBPM - Red Hat OpenShift Container Platform with Middleware Portfolio, Premium, (2 Cores or 4 vCPUs) Cantidad: 8"}]
["SECRETARIA GENERAL Y JURÍDICA","Oficina de Tecnologías de la Información","NO","C05942022",43231512,"Servicios para migrar JBPM a PAM y entrenamiento para 6 personas","2022-09-01",{"$f":"MONTH(G717)","v":9},"2022-12-31",{"$f":"MONTH(I717-G717)","v":4},"Invitación directa","GastosAdministrativos",300000000,300000000,"NO","N/A","Gerencia de Abastecimiento Estratégico\ncontratacion@positiva.gov.co\nPBX: (1)6502200 Ext: 10641","NO","NO","NO","NO",{"$f":"IF(U717=\"SI\",\"Pública clasificada\",\"Pública\")","v":"Pública"},{"$f":"CONCATENATE(D717,\"-\",\"Tipo de información\",\" \",V717,\"-\",F717)","v":"C05942022-Tipo de información Pública-Servicios para migrar JBPM a PAM y entrenamiento para 6 personas"}]
["SECRETARIA GENERAL Y JURÍDICA","Oficina de Tecnologías de la Información","NO","C05952022",81112200,"servicios profesionales para la modernización de Integración de aplicaciones y arquitectura ISARL utilizando y adoptando contenedores desde la perspectiva de Red Hat- Openshift y desarrollo de microservicios","2022-01-15",{"$f":"MONTH(G718)","v":1},"2022-12-31",{"$f":"MONTH(I718-G718)","v":12},"Invitación directa","GastosAdministrativos",70320961,70320961,"NO","N/A","Gerencia de Abastecimiento Estratégico\ncontratacion@positiva.gov.co\nPBX: (1)6502200 Ext: 10641","NO","NO","NO","NO",{"$f":"IF(U718=\"SI\",\"Pública clasificada\",\"Pública\")","v":"Pública"},{"$f":"CONCATENATE(D718,\"-\",\"Tipo de información\",\" \",V718,\"-\",F718)","v":"C05952022-Tipo de información Pública-servicios profesionales para la modernización de Integración de aplicaciones y arquitectura ISARL utilizando y adoptando contenedores desde la perspectiva de Red Hat- Openshift y desarrollo de microservicios"}]
["SECRETARIA GENERAL Y JURÍDICA","Oficina de Tecnologías de la Información","NO","C05992022",81112006,"Prestación de servicios de transporte, almacenamiento y custodia medios magnéticos","2022-11-30",{"$f":"MONTH(G719)","v":11},"2022-12-31",{"$f":"MONTH(I719-G719)","v":1},"Invitación directa","GastosAdministrativos",1620000,1620000,"NO","N/A","Gerencia de Abastecimiento Estratégico\ncontratacion@positiva.gov.co\nPBX: (1)6502200 Ext: 10641","NO","NO","NO","NO",{"$f":"IF(U719=\"SI\",\"Pública clasificada\",\"Pública\")","v":"Pública"},{"$f":"CONCATENATE(D719,\"-\",\"Tipo de información\",\" \",V719,\"-\",F719)","v":"C05992022-Tipo de información Pública-Prestación de servicios de transporte, almacenamiento y custodia medios magnéticos"}]
["SECRETARIA GENERAL Y JURÍDICA","Oficina de Tecnologías de la Información","NO","C06002022",81111801,"Honorarios, servicio de Ethical Hacking","2022-11-30",{"$f":"MONTH(G720)","v":11},"2023-07-30",{"$f":"MONTH(I720-G720)","v":8},"Invitación directa","GastosAdministrativos",18785554,18785554,"NO","N/A","Gerencia de Abastecimiento Estratégico\ncontratacion@positiva.gov.co\nPBX: (1)6502200 Ext: 10641","NO","NO","NO","NO",{"$f":"IF(U720=\"SI\",\"Pública clasificada\",\"Pública\")","v":"Pública"},{"$f":"CONCATENATE(D720,\"-\",\"Tipo de información\",\" \",V720,\"-\",F720)","v":"C06002022-Tipo de información Pública-Honorarios, servicio de Ethical Hacking"}]
["SECRETARIA GENERAL Y JURÍDICA","Oficina de Tecnologías de la Información","NO","C06012022",81112501,"Licenciamiento; Renovación de la Licencia","2022-11-30",{"$f":"MONTH(G721)","v":11},"2022-12-31",{"$f":"MONTH(I721-G721)","v":1},"Invitación directa","GastosAdministrativos",401467,401467,"NO","N/A","Gerencia de Abastecimiento Estratégico\ncontratacion@positiva.gov.co\nPBX: (1)6502200 Ext: 10641","NO","NO","NO","NO",{"$f":"IF(U721=\"SI\",\"Pública clasificada\",\"Pública\")","v":"Pública"},{"$f":"CONCATENATE(D721,\"-\",\"Tipo de información\",\" \",V721,\"-\",F721)","v":"C06012022-Tipo de información Pública-Licenciamiento; Renovación de la Licencia"}]
["SECRETARIA GENERAL Y JURÍDICA","Oficina de Tecnologías de la Información","NO","C06022022",81112500,"Servicio arrendamiento licencias","1/09/2022",{"$f":"MONTH(G722)","v":9},"31/12/2022",{"$f":"MONTH(I722-G722)","v":4},"Invitación cerrada","GastosAdministrativos",1050794918,1050794918,"NO","N/A","Gerencia de Abastecimiento Estratégico\ncontratacion@positiva.gov.co\nPBX: (1)6502200 Ext: 10641","NO","NO","NO","NO",{"$f":"IF(U722=\"SI\",\"Pública clasificada\",\"Pública\")","v":"Pública"},{"$f":"CONCATENATE(D722,\"-\",\"Tipo de información\",\" \",V722,\"-\",F722)","v":"C06022022-Tipo de información Pública-Servicio arrendamiento licencias"}]
["SECRETARIA GENERAL Y JURÍDICA","Oficina de Tecnologías de la Información","NO","C06032022",8100000,"Prestación de servicios, Desarrollo solución producto BEPS","2022-07-01",{"$f":"MONTH(G723)","v":7},"2022-12-31",{"$f":"MONTH(I723-G723)","v":7},"Invitación directa","GastosAdministrativos",205000000,205000000,"NO","N/A","Gerencia de Abastecimiento Estratégico\ncontratacion@positiva.gov.co\nPBX: (1)6502200 Ext: 10641","NO","NO","NO","NO",{"$f":"IF(U723=\"SI\",\"Pública clasificada\",\"Pública\")","v":"Pública"},{"$f":"CONCATENATE(D723,\"-\",\"Tipo de información\",\" \",V723,\"-\",F723)","v":"C06032022-Tipo de información Pública-Prestación de servicios, Desarrollo solución producto BEPS"}]
["SECRETARIA GENERAL Y JURÍDICA","Oficina de Tecnologías de la Información","NO","C06082022",81111801,"Soporte, configuración atención de requerimientos Equipos Switch Fase II en la infraestructura de la compañía (Hardware Refresh)","2022-07-01",{"$f":"MONTH(G724)","v":7},"2022-12-31",{"$f":"MONTH(I724-G724)","v":7},"Invitación cerrada","GastosAdministrativos",170000000,170000000,"NO","N/A","Gerencia de Abastecimiento Estratégico\ncontratacion@positiva.gov.co\nPBX: (1)6502200 Ext: 10641","NO","NO","NO","NO",{"$f":"IF(U724=\"SI\",\"Pública clasificada\",\"Pública\")","v":"Pública"},{"$f":"CONCATENATE(D724,\"-\",\"Tipo de información\",\" \",V724,\"-\",F724)","v":"C06082022-Tipo de información Pública-Soporte, configuración atención de requerimientos Equipos Switch Fase II en la infraestructura de la compañía (Hardware Refresh)"}]

{"sheet":"Hoja5","index":5,"n_rows":4,"n_cols":2,"rows_kept":4,"cut":false,"hidden":true,"merged":[]}
[]
[]
["Suma de Valor total estimado","Total"]
["Total",192782729037.5542]